{"text_format":"1","workbook":"xlsx","n_sheets":12,"sheets":["Title","Results","Group1","Group2","Group3","Group4","Oral","Final","Full","Print","Instructions","About"],"not_rendered":{"charts":0,"images":3,"macros":1,"external_links":0,"defined_names":2,"comments":0,"pivot_tables":0},"unopened":[],"bounds":{"document_bytes":16777216,"sheet_cells":100000,"rows_first":2000,"rows_last":500,"rows_between":2000,"halvings":0,"cell_chars":16384,"cell_head_chars":4096},"cells_cut":0,"cells_raw":0,"read":"whole","date_system":"1900"}

{"sheet":"Title","index":0,"n_rows":22,"n_cols":8,"rows_kept":22,"cut":false,"hidden":false,"merged":[[16,3,16,4],[21,6,21,11],[15,7,15,12],[14,7,14,12],[8,7,8,14],[10,7,10,14],[12,7,12,8],[12,9,12,12]]}
[]
[]
[]
[]
[]
[null,null,null,null,null,null,null,"YOUNG JUDGES COMPETITION"]
[]
[]
[null,null,null,null,null,null,null,"Competition Name"]
[]
[null,null,null,null,null,null,null,"Host/ Event"]
[]
[null,null,null,null,null,null,null,"OVER-JUDGE :"]
[]
[null,null,null,null,null,null,null,"Locaton"]
[null,null,null,null,null,null,null,"Date"]
[]
[]
[]
[]
[]
[null,null,null,null,null,null,"©  Agricultural Societies Council of NSW 2011"]

{"sheet":"Results","index":1,"n_rows":203,"n_cols":9,"rows_kept":203,"cut":false,"hidden":false,"merged":[]}
[]
[null,{"$f":"Title!H9","v":"Competition Name"},null,null,null,null,"GROUPS",0]
[null,"Entrant No","Name","Visual Score","Handling Score","Oral Score","Total Score","Rank","Place"]
[null,1,null,{"$f":"IF($C4=\"\",\"\",IF($H$2=1,Group1!$K4,IF($H$2=2,Group1!$K4+Group2!$K4,IF($H$2=3,Group1!$K4+Group2!$K4+Group3!$K4,Group1!$K4+Group2!$K4+Group3!$K4+Group4!$K4))))","v":""},null,49,{"$f":"IF(D4=\"\",\"\",$D4+$E4+$F4)","v":""},{"$f":"IF(G4=\"\",\"\",RANK($G4,$G$4:$G$103))","v":""}]
[null,2,null,{"$f":"IF($C5=\"\",\"\",IF($H$2=1,Group1!$K5,IF($H$2=2,Group1!$K5+Group2!$K5,IF($H$2=3,Group1!$K5+Group2!$K5+Group3!$K5,Group1!$K5+Group2!$K5+Group3!$K5+Group4!$K5))))","v":""},null,47,{"$f":"IF(D5=\"\",\"\",$D5+$E5+$F5)","v":""},{"$f":"IF(G5=\"\",\"\",RANK($G5,$G$4:$G$103))","v":""}]
[null,3,null,{"$f":"IF($C6=\"\",\"\",IF($H$2=1,Group1!$K6,IF($H$2=2,Group1!$K6+Group2!$K6,IF($H$2=3,Group1!$K6+Group2!$K6+Group3!$K6,Group1!$K6+Group2!$K6+Group3!$K6+Group4!$K6))))","v":""},null,38,"",{"$f":"IF(G6=\"\",\"\",RANK($G6,$G$4:$G$103))","v":""}]
[null,4,null,{"$f":"IF($C7=\"\",\"\",IF($H$2=1,Group1!$K7,IF($H$2=2,Group1!$K7+Group2!$K7,IF($H$2=3,Group1!$K7+Group2!$K7+Group3!$K7,Group1!$K7+Group2!$K7+Group3!$K7+Group4!$K7))))","v":""},null,44,"",""]
[null,5,null,{"$f":"IF($C8=\"\",\"\",IF($H$2=1,Group1!$K8,IF($H$2=2,Group1!$K8+Group2!$K8,IF($H$2=3,Group1!$K8+Group2!$K8+Group3!$K8,Group1!$K8+Group2!$K8+Group3!$K8+Group4!$K8))))","v":""},null,35,"",""]
[null,6,null,{"$f":"IF($C9=\"\",\"\",IF($H$2=1,Group1!$K9,IF($H$2=2,Group1!$K9+Group2!$K9,IF($H$2=3,Group1!$K9+Group2!$K9+Group3!$K9,Group1!$K9+Group2!$K9+Group3!$K9+Group4!$K9))))","v":""},null,null,"",""]
[null,7,null,{"$f":"IF($C10=\"\",\"\",IF($H$2=1,Group1!$K10,IF($H$2=2,Group1!$K10+Group2!$K10,IF($H$2=3,Group1!$K10+Group2!$K10+Group3!$K10,Group1!$K10+Group2!$K10+Group3!$K10+Group4!$K10))))","v":""},null,null,"",""]
[null,8,null,{"$f":"IF($C11=\"\",\"\",IF($H$2=1,Group1!$K11,IF($H$2=2,Group1!$K11+Group2!$K11,IF($H$2=3,Group1!$K11+Group2!$K11+Group3!$K11,Group1!$K11+Group2!$K11+Group3!$K11+Group4!$K11))))","v":""},null,null,"",""]
[null,9,null,{"$f":"IF($C12=\"\",\"\",IF($H$2=1,Group1!$K12,IF($H$2=2,Group1!$K12+Group2!$K12,IF($H$2=3,Group1!$K12+Group2!$K12+Group3!$K12,Group1!$K12+Group2!$K12+Group3!$K12+Group4!$K12))))","v":""},null,null,"",""]
[null,10,null,{"$f":"IF($C13=\"\",\"\",IF($H$2=1,Group1!$K13,IF($H$2=2,Group1!$K13+Group2!$K13,IF($H$2=3,Group1!$K13+Group2!$K13+Group3!$K13,Group1!$K13+Group2!$K13+Group3!$K13+Group4!$K13))))","v":""},null,null,"",""]
[null,11,null,{"$f":"IF($C14=\"\",\"\",IF($H$2=1,Group1!$K14,IF($H$2=2,Group1!$K14+Group2!$K14,IF($H$2=3,Group1!$K14+Group2!$K14+Group3!$K14,Group1!$K14+Group2!$K14+Group3!$K14+Group4!$K14))))","v":""},null,null,"",""]
[null,12,null,{"$f":"IF($C15=\"\",\"\",IF($H$2=1,Group1!$K15,IF($H$2=2,Group1!$K15+Group2!$K15,IF($H$2=3,Group1!$K15+Group2!$K15+Group3!$K15,Group1!$K15+Group2!$K15+Group3!$K15+Group4!$K15))))","v":""},null,null,"",""]
[null,13,null,{"$f":"IF($C16=\"\",\"\",IF($H$2=1,Group1!$K16,IF($H$2=2,Group1!$K16+Group2!$K16,IF($H$2=3,Group1!$K16+Group2!$K16+Group3!$K16,Group1!$K16+Group2!$K16+Group3!$K16+Group4!$K16))))","v":""},null,null,"",""]
[null,14,null,{"$f":"IF($C17=\"\",\"\",IF($H$2=1,Group1!$K17,IF($H$2=2,Group1!$K17+Group2!$K17,IF($H$2=3,Group1!$K17+Group2!$K17+Group3!$K17,Group1!$K17+Group2!$K17+Group3!$K17+Group4!$K17))))","v":""},null,null,"",""]
[null,15,null,{"$f":"IF($C18=\"\",\"\",IF($H$2=1,Group1!$K18,IF($H$2=2,Group1!$K18+Group2!$K18,IF($H$2=3,Group1!$K18+Group2!$K18+Group3!$K18,Group1!$K18+Group2!$K18+Group3!$K18+Group4!$K18))))","v":""},null,null,"",""]
[null,16,null,{"$f":"IF($C19=\"\",\"\",IF($H$2=1,Group1!$K19,IF($H$2=2,Group1!$K19+Group2!$K19,IF($H$2=3,Group1!$K19+Group2!$K19+Group3!$K19,Group1!$K19+Group2!$K19+Group3!$K19+Group4!$K19))))","v":""},null,null,"",""]
[null,17,null,{"$f":"IF($C20=\"\",\"\",IF($H$2=1,Group1!$K20,IF($H$2=2,Group1!$K20+Group2!$K20,IF($H$2=3,Group1!$K20+Group2!$K20+Group3!$K20,Group1!$K20+Group2!$K20+Group3!$K20+Group4!$K20))))","v":""},null,null,"",""]
[null,18,null,{"$f":"IF($C21=\"\",\"\",IF($H$2=1,Group1!$K21,IF($H$2=2,Group1!$K21+Group2!$K21,IF($H$2=3,Group1!$K21+Group2!$K21+Group3!$K21,Group1!$K21+Group2!$K21+Group3!$K21+Group4!$K21))))","v":""},null,null,"",""]
[null,19,null,{"$f":"IF($C22=\"\",\"\",IF($H$2=1,Group1!$K22,IF($H$2=2,Group1!$K22+Group2!$K22,IF($H$2=3,Group1!$K22+Group2!$K22+Group3!$K22,Group1!$K22+Group2!$K22+Group3!$K22+Group4!$K22))))","v":""},null,null,"",""]
[null,20,null,{"$f":"IF($C23=\"\",\"\",IF($H$2=1,Group1!$K23,IF($H$2=2,Group1!$K23+Group2!$K23,IF($H$2=3,Group1!$K23+Group2!$K23+Group3!$K23,Group1!$K23+Group2!$K23+Group3!$K23+Group4!$K23))))","v":""},null,null,"",""]
[null,21,null,{"$f":"IF($C24=\"\",\"\",IF($H$2=1,Group1!$K24,IF($H$2=2,Group1!$K24+Group2!$K24,IF($H$2=3,Group1!$K24+Group2!$K24+Group3!$K24,Group1!$K24+Group2!$K24+Group3!$K24+Group4!$K24))))","v":""},null,null,"",""]
[null,22,null,{"$f":"IF($C25=\"\",\"\",IF($H$2=1,Group1!$K25,IF($H$2=2,Group1!$K25+Group2!$K25,IF($H$2=3,Group1!$K25+Group2!$K25+Group3!$K25,Group1!$K25+Group2!$K25+Group3!$K25+Group4!$K25))))","v":""},null,null,"",""]
[null,23,null,{"$f":"IF($C26=\"\",\"\",IF($H$2=1,Group1!$K26,IF($H$2=2,Group1!$K26+Group2!$K26,IF($H$2=3,Group1!$K26+Group2!$K26+Group3!$K26,Group1!$K26+Group2!$K26+Group3!$K26+Group4!$K26))))","v":""},null,null,"",""]
[null,24,null,{"$f":"IF($C27=\"\",\"\",IF($H$2=1,Group1!$K27,IF($H$2=2,Group1!$K27+Group2!$K27,IF($H$2=3,Group1!$K27+Group2!$K27+Group3!$K27,Group1!$K27+Group2!$K27+Group3!$K27+Group4!$K27))))","v":""},null,null,"",""]
[null,25,null,{"$f":"IF($C28=\"\",\"\",IF($H$2=1,Group1!$K28,IF($H$2=2,Group1!$K28+Group2!$K28,IF($H$2=3,Group1!$K28+Group2!$K28+Group3!$K28,Group1!$K28+Group2!$K28+Group3!$K28+Group4!$K28))))","v":""},null,null,"",""]
[null,26,null,{"$f":"IF($C29=\"\",\"\",IF($H$2=1,Group1!$K29,IF($H$2=2,Group1!$K29+Group2!$K29,IF($H$2=3,Group1!$K29+Group2!$K29+Group3!$K29,Group1!$K29+Group2!$K29+Group3!$K29+Group4!$K29))))","v":""},null,null,"",""]
[null,27,null,{"$f":"IF($C30=\"\",\"\",IF($H$2=1,Group1!$K30,IF($H$2=2,Group1!$K30+Group2!$K30,IF($H$2=3,Group1!$K30+Group2!$K30+Group3!$K30,Group1!$K30+Group2!$K30+Group3!$K30+Group4!$K30))))","v":""},null,null,"",""]
[null,28,null,{"$f":"IF($C31=\"\",\"\",IF($H$2=1,Group1!$K31,IF($H$2=2,Group1!$K31+Group2!$K31,IF($H$2=3,Group1!$K31+Group2!$K31+Group3!$K31,Group1!$K31+Group2!$K31+Group3!$K31+Group4!$K31))))","v":""},null,null,"",""]
[null,29,null,{"$f":"IF($C32=\"\",\"\",IF($H$2=1,Group1!$K32,IF($H$2=2,Group1!$K32+Group2!$K32,IF($H$2=3,Group1!$K32+Group2!$K32+Group3!$K32,Group1!$K32+Group2!$K32+Group3!$K32+Group4!$K32))))","v":""},null,null,"",""]
[null,30,null,{"$f":"IF($C33=\"\",\"\",IF($H$2=1,Group1!$K33,IF($H$2=2,Group1!$K33+Group2!$K33,IF($H$2=3,Group1!$K33+Group2!$K33+Group3!$K33,Group1!$K33+Group2!$K33+Group3!$K33+Group4!$K33))))","v":""},null,null,"",""]
[null,31,null,{"$f":"IF($C34=\"\",\"\",IF($H$2=1,Group1!$K34,IF($H$2=2,Group1!$K34+Group2!$K34,IF($H$2=3,Group1!$K34+Group2!$K34+Group3!$K34,Group1!$K34+Group2!$K34+Group3!$K34+Group4!$K34))))","v":""},null,null,{"$f":"IF(D34=\"\",\"\",$D34+$E34+$F34)","v":""},""]
[null,32,null,{"$f":"IF($C35=\"\",\"\",IF($H$2=1,Group1!$K35,IF($H$2=2,Group1!$K35+Group2!$K35,IF($H$2=3,Group1!$K35+Group2!$K35+Group3!$K35,Group1!$K35+Group2!$K35+Group3!$K35+Group4!$K35))))","v":""},null,null,"",""]
[null,33,null,{"$f":"IF($C36=\"\",\"\",IF($H$2=1,Group1!$K36,IF($H$2=2,Group1!$K36+Group2!$K36,IF($H$2=3,Group1!$K36+Group2!$K36+Group3!$K36,Group1!$K36+Group2!$K36+Group3!$K36+Group4!$K36))))","v":""},null,null,"",""]
[null,34,null,{"$f":"IF($C37=\"\",\"\",IF($H$2=1,Group1!$K37,IF($H$2=2,Group1!$K37+Group2!$K37,IF($H$2=3,Group1!$K37+Group2!$K37+Group3!$K37,Group1!$K37+Group2!$K37+Group3!$K37+Group4!$K37))))","v":""},null,null,"",""]
[null,35,null,{"$f":"IF($C38=\"\",\"\",IF($H$2=1,Group1!$K38,IF($H$2=2,Group1!$K38+Group2!$K38,IF($H$2=3,Group1!$K38+Group2!$K38+Group3!$K38,Group1!$K38+Group2!$K38+Group3!$K38+Group4!$K38))))","v":""},null,null,"",""]
[null,36,null,{"$f":"IF($C39=\"\",\"\",IF($H$2=1,Group1!$K39,IF($H$2=2,Group1!$K39+Group2!$K39,IF($H$2=3,Group1!$K39+Group2!$K39+Group3!$K39,Group1!$K39+Group2!$K39+Group3!$K39+Group4!$K39))))","v":""},null,null,"",""]
[null,37,null,{"$f":"IF($C40=\"\",\"\",IF($H$2=1,Group1!$K40,IF($H$2=2,Group1!$K40+Group2!$K40,IF($H$2=3,Group1!$K40+Group2!$K40+Group3!$K40,Group1!$K40+Group2!$K40+Group3!$K40+Group4!$K40))))","v":""},null,null,"",""]
[null,38,null,{"$f":"IF($C41=\"\",\"\",IF($H$2=1,Group1!$K41,IF($H$2=2,Group1!$K41+Group2!$K41,IF($H$2=3,Group1!$K41+Group2!$K41+Group3!$K41,Group1!$K41+Group2!$K41+Group3!$K41+Group4!$K41))))","v":""},null,null,"",""]
[null,39,null,{"$f":"IF($C42=\"\",\"\",IF($H$2=1,Group1!$K42,IF($H$2=2,Group1!$K42+Group2!$K42,IF($H$2=3,Group1!$K42+Group2!$K42+Group3!$K42,Group1!$K42+Group2!$K42+Group3!$K42+Group4!$K42))))","v":""},null,null,"",""]
[null,40,null,{"$f":"IF($C43=\"\",\"\",IF($H$2=1,Group1!$K43,IF($H$2=2,Group1!$K43+Group2!$K43,IF($H$2=3,Group1!$K43+Group2!$K43+Group3!$K43,Group1!$K43+Group2!$K43+Group3!$K43+Group4!$K43))))","v":""},null,null,"",""]
[null,41,null,{"$f":"IF($C44=\"\",\"\",IF($H$2=1,Group1!$K44,IF($H$2=2,Group1!$K44+Group2!$K44,IF($H$2=3,Group1!$K44+Group2!$K44+Group3!$K44,Group1!$K44+Group2!$K44+Group3!$K44+Group4!$K44))))","v":""},null,null,"",""]
[null,42,null,{"$f":"IF($C45=\"\",\"\",IF($H$2=1,Group1!$K45,IF($H$2=2,Group1!$K45+Group2!$K45,IF($H$2=3,Group1!$K45+Group2!$K45+Group3!$K45,Group1!$K45+Group2!$K45+Group3!$K45+Group4!$K45))))","v":""},null,null,"",""]
[null,43,null,{"$f":"IF($C46=\"\",\"\",IF($H$2=1,Group1!$K46,IF($H$2=2,Group1!$K46+Group2!$K46,IF($H$2=3,Group1!$K46+Group2!$K46+Group3!$K46,Group1!$K46+Group2!$K46+Group3!$K46+Group4!$K46))))","v":""},null,null,"",""]
[null,44,null,{"$f":"IF($C47=\"\",\"\",IF($H$2=1,Group1!$K47,IF($H$2=2,Group1!$K47+Group2!$K47,IF($H$2=3,Group1!$K47+Group2!$K47+Group3!$K47,Group1!$K47+Group2!$K47+Group3!$K47+Group4!$K47))))","v":""},null,null,"",""]
[null,45,null,{"$f":"IF($C48=\"\",\"\",IF($H$2=1,Group1!$K48,IF($H$2=2,Group1!$K48+Group2!$K48,IF($H$2=3,Group1!$K48+Group2!$K48+Group3!$K48,Group1!$K48+Group2!$K48+Group3!$K48+Group4!$K48))))","v":""},null,null,"",""]
[null,46,null,{"$f":"IF($C49=\"\",\"\",IF($H$2=1,Group1!$K49,IF($H$2=2,Group1!$K49+Group2!$K49,IF($H$2=3,Group1!$K49+Group2!$K49+Group3!$K49,Group1!$K49+Group2!$K49+Group3!$K49+Group4!$K49))))","v":""},null,null,"",""]
[null,47,null,{"$f":"IF($C50=\"\",\"\",IF($H$2=1,Group1!$K50,IF($H$2=2,Group1!$K50+Group2!$K50,IF($H$2=3,Group1!$K50+Group2!$K50+Group3!$K50,Group1!$K50+Group2!$K50+Group3!$K50+Group4!$K50))))","v":""},null,null,"",""]
[null,48,null,{"$f":"IF($C51=\"\",\"\",IF($H$2=1,Group1!$K51,IF($H$2=2,Group1!$K51+Group2!$K51,IF($H$2=3,Group1!$K51+Group2!$K51+Group3!$K51,Group1!$K51+Group2!$K51+Group3!$K51+Group4!$K51))))","v":""},null,null,"",""]
[null,49,null,{"$f":"IF($C52=\"\",\"\",IF($H$2=1,Group1!$K52,IF($H$2=2,Group1!$K52+Group2!$K52,IF($H$2=3,Group1!$K52+Group2!$K52+Group3!$K52,Group1!$K52+Group2!$K52+Group3!$K52+Group4!$K52))))","v":""},null,null,"",""]
[null,50,null,{"$f":"IF($C53=\"\",\"\",IF($H$2=1,Group1!$K53,IF($H$2=2,Group1!$K53+Group2!$K53,IF($H$2=3,Group1!$K53+Group2!$K53+Group3!$K53,Group1!$K53+Group2!$K53+Group3!$K53+Group4!$K53))))","v":""},null,null,"",""]
[null,51,null,{"$f":"IF($C54=\"\",\"\",IF($H$2=1,Group1!$K54,IF($H$2=2,Group1!$K54+Group2!$K54,IF($H$2=3,Group1!$K54+Group2!$K54+Group3!$K54,Group1!$K54+Group2!$K54+Group3!$K54+Group4!$K54))))","v":""},null,null,"",""]
[null,52,null,{"$f":"IF($C55=\"\",\"\",IF($H$2=1,Group1!$K55,IF($H$2=2,Group1!$K55+Group2!$K55,IF($H$2=3,Group1!$K55+Group2!$K55+Group3!$K55,Group1!$K55+Group2!$K55+Group3!$K55+Group4!$K55))))","v":""},null,null,"",""]
[null,53,null,{"$f":"IF($C56=\"\",\"\",IF($H$2=1,Group1!$K56,IF($H$2=2,Group1!$K56+Group2!$K56,IF($H$2=3,Group1!$K56+Group2!$K56+Group3!$K56,Group1!$K56+Group2!$K56+Group3!$K56+Group4!$K56))))","v":""},null,null,"",""]
[null,54,null,{"$f":"IF($C57=\"\",\"\",IF($H$2=1,Group1!$K57,IF($H$2=2,Group1!$K57+Group2!$K57,IF($H$2=3,Group1!$K57+Group2!$K57+Group3!$K57,Group1!$K57+Group2!$K57+Group3!$K57+Group4!$K57))))","v":""},null,null,"",""]
[null,55,null,{"$f":"IF($C58=\"\",\"\",IF($H$2=1,Group1!$K58,IF($H$2=2,Group1!$K58+Group2!$K58,IF($H$2=3,Group1!$K58+Group2!$K58+Group3!$K58,Group1!$K58+Group2!$K58+Group3!$K58+Group4!$K58))))","v":""},null,null,"",""]
[null,56,null,{"$f":"IF($C59=\"\",\"\",IF($H$2=1,Group1!$K59,IF($H$2=2,Group1!$K59+Group2!$K59,IF($H$2=3,Group1!$K59+Group2!$K59+Group3!$K59,Group1!$K59+Group2!$K59+Group3!$K59+Group4!$K59))))","v":""},null,null,"",""]
[null,57,null,{"$f":"IF($C60=\"\",\"\",IF($H$2=1,Group1!$K60,IF($H$2=2,Group1!$K60+Group2!$K60,IF($H$2=3,Group1!$K60+Group2!$K60+Group3!$K60,Group1!$K60+Group2!$K60+Group3!$K60+Group4!$K60))))","v":""},null,null,"",""]
[null,58,null,{"$f":"IF($C61=\"\",\"\",IF($H$2=1,Group1!$K61,IF($H$2=2,Group1!$K61+Group2!$K61,IF($H$2=3,Group1!$K61+Group2!$K61+Group3!$K61,Group1!$K61+Group2!$K61+Group3!$K61+Group4!$K61))))","v":""},null,null,"",""]
[null,59,null,{"$f":"IF($C62=\"\",\"\",IF($H$2=1,Group1!$K62,IF($H$2=2,Group1!$K62+Group2!$K62,IF($H$2=3,Group1!$K62+Group2!$K62+Group3!$K62,Group1!$K62+Group2!$K62+Group3!$K62+Group4!$K62))))","v":""},null,null,"",""]
[null,60,null,{"$f":"IF($C63=\"\",\"\",IF($H$2=1,Group1!$K63,IF($H$2=2,Group1!$K63+Group2!$K63,IF($H$2=3,Group1!$K63+Group2!$K63+Group3!$K63,Group1!$K63+Group2!$K63+Group3!$K63+Group4!$K63))))","v":""},null,null,"",""]
[null,61,null,{"$f":"IF($C64=\"\",\"\",IF($H$2=1,Group1!$K64,IF($H$2=2,Group1!$K64+Group2!$K64,IF($H$2=3,Group1!$K64+Group2!$K64+Group3!$K64,Group1!$K64+Group2!$K64+Group3!$K64+Group4!$K64))))","v":""},null,null,"",""]
[null,62,null,{"$f":"IF($C65=\"\",\"\",IF($H$2=1,Group1!$K65,IF($H$2=2,Group1!$K65+Group2!$K65,IF($H$2=3,Group1!$K65+Group2!$K65+Group3!$K65,Group1!$K65+Group2!$K65+Group3!$K65+Group4!$K65))))","v":""},null,null,"",""]
[null,63,null,{"$f":"IF($C66=\"\",\"\",IF($H$2=1,Group1!$K66,IF($H$2=2,Group1!$K66+Group2!$K66,IF($H$2=3,Group1!$K66+Group2!$K66+Group3!$K66,Group1!$K66+Group2!$K66+Group3!$K66+Group4!$K66))))","v":""},null,null,"",""]
[null,64,null,{"$f":"IF($C67=\"\",\"\",IF($H$2=1,Group1!$K67,IF($H$2=2,Group1!$K67+Group2!$K67,IF($H$2=3,Group1!$K67+Group2!$K67+Group3!$K67,Group1!$K67+Group2!$K67+Group3!$K67+Group4!$K67))))","v":""},null,null,"",""]
[null,65,null,{"$f":"IF($C68=\"\",\"\",IF($H$2=1,Group1!$K68,IF($H$2=2,Group1!$K68+Group2!$K68,IF($H$2=3,Group1!$K68+Group2!$K68+Group3!$K68,Group1!$K68+Group2!$K68+Group3!$K68+Group4!$K68))))","v":""},null,null,"",""]
[null,66,null,{"$f":"IF($C69=\"\",\"\",IF($H$2=1,Group1!$K69,IF($H$2=2,Group1!$K69+Group2!$K69,IF($H$2=3,Group1!$K69+Group2!$K69+Group3!$K69,Group1!$K69+Group2!$K69+Group3!$K69+Group4!$K69))))","v":""},null,null,"",""]
[null,67,null,{"$f":"IF($C70=\"\",\"\",IF($H$2=1,Group1!$K70,IF($H$2=2,Group1!$K70+Group2!$K70,IF($H$2=3,Group1!$K70+Group2!$K70+Group3!$K70,Group1!$K70+Group2!$K70+Group3!$K70+Group4!$K70))))","v":""},null,null,"",{"$f":"IF(G70=\"\",\"\",RANK($G70,$G$4:$G$103))","v":""}]
[null,68,null,{"$f":"IF($C71=\"\",\"\",IF($H$2=1,Group1!$K71,IF($H$2=2,Group1!$K71+Group2!$K71,IF($H$2=3,Group1!$K71+Group2!$K71+Group3!$K71,Group1!$K71+Group2!$K71+Group3!$K71+Group4!$K71))))","v":""},null,null,"",""]
[null,69,null,{"$f":"IF($C72=\"\",\"\",IF($H$2=1,Group1!$K72,IF($H$2=2,Group1!$K72+Group2!$K72,IF($H$2=3,Group1!$K72+Group2!$K72+Group3!$K72,Group1!$K72+Group2!$K72+Group3!$K72+Group4!$K72))))","v":""},null,null,"",""]
[null,70,null,{"$f":"IF($C73=\"\",\"\",IF($H$2=1,Group1!$K73,IF($H$2=2,Group1!$K73+Group2!$K73,IF($H$2=3,Group1!$K73+Group2!$K73+Group3!$K73,Group1!$K73+Group2!$K73+Group3!$K73+Group4!$K73))))","v":""},null,null,"",""]
[null,71,null,{"$f":"IF($C74=\"\",\"\",IF($H$2=1,Group1!$K74,IF($H$2=2,Group1!$K74+Group2!$K74,IF($H$2=3,Group1!$K74+Group2!$K74+Group3!$K74,Group1!$K74+Group2!$K74+Group3!$K74+Group4!$K74))))","v":""},null,null,"",""]
[null,72,null,{"$f":"IF($C75=\"\",\"\",IF($H$2=1,Group1!$K75,IF($H$2=2,Group1!$K75+Group2!$K75,IF($H$2=3,Group1!$K75+Group2!$K75+Group3!$K75,Group1!$K75+Group2!$K75+Group3!$K75+Group4!$K75))))","v":""},null,null,"",""]
[null,73,null,{"$f":"IF($C76=\"\",\"\",IF($H$2=1,Group1!$K76,IF($H$2=2,Group1!$K76+Group2!$K76,IF($H$2=3,Group1!$K76+Group2!$K76+Group3!$K76,Group1!$K76+Group2!$K76+Group3!$K76+Group4!$K76))))","v":""},null,null,"",""]
[null,74,null,{"$f":"IF($C77=\"\",\"\",IF($H$2=1,Group1!$K77,IF($H$2=2,Group1!$K77+Group2!$K77,IF($H$2=3,Group1!$K77+Group2!$K77+Group3!$K77,Group1!$K77+Group2!$K77+Group3!$K77+Group4!$K77))))","v":""},null,null,"",""]
[null,75,null,{"$f":"IF($C78=\"\",\"\",IF($H$2=1,Group1!$K78,IF($H$2=2,Group1!$K78+Group2!$K78,IF($H$2=3,Group1!$K78+Group2!$K78+Group3!$K78,Group1!$K78+Group2!$K78+Group3!$K78+Group4!$K78))))","v":""},null,null,"",""]
[null,76,null,{"$f":"IF($C79=\"\",\"\",IF($H$2=1,Group1!$K79,IF($H$2=2,Group1!$K79+Group2!$K79,IF($H$2=3,Group1!$K79+Group2!$K79+Group3!$K79,Group1!$K79+Group2!$K79+Group3!$K79+Group4!$K79))))","v":""},null,null,"",""]
[null,77,null,{"$f":"IF($C80=\"\",\"\",IF($H$2=1,Group1!$K80,IF($H$2=2,Group1!$K80+Group2!$K80,IF($H$2=3,Group1!$K80+Group2!$K80+Group3!$K80,Group1!$K80+Group2!$K80+Group3!$K80+Group4!$K80))))","v":""},null,null,"",""]
[null,78,null,{"$f":"IF($C81=\"\",\"\",IF($H$2=1,Group1!$K81,IF($H$2=2,Group1!$K81+Group2!$K81,IF($H$2=3,Group1!$K81+Group2!$K81+Group3!$K81,Group1!$K81+Group2!$K81+Group3!$K81+Group4!$K81))))","v":""},null,null,"",""]
[null,79,null,{"$f":"IF($C82=\"\",\"\",IF($H$2=1,Group1!$K82,IF($H$2=2,Group1!$K82+Group2!$K82,IF($H$2=3,Group1!$K82+Group2!$K82+Group3!$K82,Group1!$K82+Group2!$K82+Group3!$K82+Group4!$K82))))","v":""},null,null,"",""]
[null,80,null,{"$f":"IF($C83=\"\",\"\",IF($H$2=1,Group1!$K83,IF($H$2=2,Group1!$K83+Group2!$K83,IF($H$2=3,Group1!$K83+Group2!$K83+Group3!$K83,Group1!$K83+Group2!$K83+Group3!$K83+Group4!$K83))))","v":""},null,null,"",""]
[null,81,null,{"$f":"IF($C84=\"\",\"\",IF($H$2=1,Group1!$K84,IF($H$2=2,Group1!$K84+Group2!$K84,IF($H$2=3,Group1!$K84+Group2!$K84+Group3!$K84,Group1!$K84+Group2!$K84+Group3!$K84+Group4!$K84))))","v":""},null,null,"",""]
[null,82,null,{"$f":"IF($C85=\"\",\"\",IF($H$2=1,Group1!$K85,IF($H$2=2,Group1!$K85+Group2!$K85,IF($H$2=3,Group1!$K85+Group2!$K85+Group3!$K85,Group1!$K85+Group2!$K85+Group3!$K85+Group4!$K85))))","v":""},null,null,"",""]
[null,83,null,{"$f":"IF($C86=\"\",\"\",IF($H$2=1,Group1!$K86,IF($H$2=2,Group1!$K86+Group2!$K86,IF($H$2=3,Group1!$K86+Group2!$K86+Group3!$K86,Group1!$K86+Group2!$K86+Group3!$K86+Group4!$K86))))","v":""},null,null,"",""]
[null,84,null,{"$f":"IF($C87=\"\",\"\",IF($H$2=1,Group1!$K87,IF($H$2=2,Group1!$K87+Group2!$K87,IF($H$2=3,Group1!$K87+Group2!$K87+Group3!$K87,Group1!$K87+Group2!$K87+Group3!$K87+Group4!$K87))))","v":""},null,null,"",""]
[null,85,null,{"$f":"IF($C88=\"\",\"\",IF($H$2=1,Group1!$K88,IF($H$2=2,Group1!$K88+Group2!$K88,IF($H$2=3,Group1!$K88+Group2!$K88+Group3!$K88,Group1!$K88+Group2!$K88+Group3!$K88+Group4!$K88))))","v":""},null,null,"",""]
[null,86,null,{"$f":"IF($C89=\"\",\"\",IF($H$2=1,Group1!$K89,IF($H$2=2,Group1!$K89+Group2!$K89,IF($H$2=3,Group1!$K89+Group2!$K89+Group3!$K89,Group1!$K89+Group2!$K89+Group3!$K89+Group4!$K89))))","v":""},null,null,"",""]
[null,87,null,{"$f":"IF($C90=\"\",\"\",IF($H$2=1,Group1!$K90,IF($H$2=2,Group1!$K90+Group2!$K90,IF($H$2=3,Group1!$K90+Group2!$K90+Group3!$K90,Group1!$K90+Group2!$K90+Group3!$K90+Group4!$K90))))","v":""},null,null,"",""]
[null,88,null,{"$f":"IF($C91=\"\",\"\",IF($H$2=1,Group1!$K91,IF($H$2=2,Group1!$K91+Group2!$K91,IF($H$2=3,Group1!$K91+Group2!$K91+Group3!$K91,Group1!$K91+Group2!$K91+Group3!$K91+Group4!$K91))))","v":""},null,null,"",""]
[null,89,null,{"$f":"IF($C92=\"\",\"\",IF($H$2=1,Group1!$K92,IF($H$2=2,Group1!$K92+Group2!$K92,IF($H$2=3,Group1!$K92+Group2!$K92+Group3!$K92,Group1!$K92+Group2!$K92+Group3!$K92+Group4!$K92))))","v":""},null,null,"",""]
[null,90,null,{"$f":"IF($C93=\"\",\"\",IF($H$2=1,Group1!$K93,IF($H$2=2,Group1!$K93+Group2!$K93,IF($H$2=3,Group1!$K93+Group2!$K93+Group3!$K93,Group1!$K93+Group2!$K93+Group3!$K93+Group4!$K93))))","v":""},null,null,"",""]
[null,91,null,{"$f":"IF($C94=\"\",\"\",IF($H$2=1,Group1!$K94,IF($H$2=2,Group1!$K94+Group2!$K94,IF($H$2=3,Group1!$K94+Group2!$K94+Group3!$K94,Group1!$K94+Group2!$K94+Group3!$K94+Group4!$K94))))","v":""},null,null,"",""]
[null,92,null,{"$f":"IF($C95=\"\",\"\",IF($H$2=1,Group1!$K95,IF($H$2=2,Group1!$K95+Group2!$K95,IF($H$2=3,Group1!$K95+Group2!$K95+Group3!$K95,Group1!$K95+Group2!$K95+Group3!$K95+Group4!$K95))))","v":""},null,null,"",""]
[null,93,null,{"$f":"IF($C96=\"\",\"\",IF($H$2=1,Group1!$K96,IF($H$2=2,Group1!$K96+Group2!$K96,IF($H$2=3,Group1!$K96+Group2!$K96+Group3!$K96,Group1!$K96+Group2!$K96+Group3!$K96+Group4!$K96))))","v":""},null,null,"",""]
[null,94,null,{"$f":"IF($C97=\"\",\"\",IF($H$2=1,Group1!$K97,IF($H$2=2,Group1!$K97+Group2!$K97,IF($H$2=3,Group1!$K97+Group2!$K97+Group3!$K97,Group1!$K97+Group2!$K97+Group3!$K97+Group4!$K97))))","v":""},null,null,"",""]
[null,95,null,{"$f":"IF($C98=\"\",\"\",IF($H$2=1,Group1!$K98,IF($H$2=2,Group1!$K98+Group2!$K98,IF($H$2=3,Group1!$K98+Group2!$K98+Group3!$K98,Group1!$K98+Group2!$K98+Group3!$K98+Group4!$K98))))","v":""},null,null,{"$f":"IF(D98=\"\",\"\",$D98+$E98+$F98)","v":""},""]
[null,96,null,{"$f":"IF($C99=\"\",\"\",IF($H$2=1,Group1!$K99,IF($H$2=2,Group1!$K99+Group2!$K99,IF($H$2=3,Group1!$K99+Group2!$K99+Group3!$K99,Group1!$K99+Group2!$K99+Group3!$K99+Group4!$K99))))","v":""},null,null,"",""]
[null,97,null,{"$f":"IF($C100=\"\",\"\",IF($H$2=1,Group1!$K100,IF($H$2=2,Group1!$K100+Group2!$K100,IF($H$2=3,Group1!$K100+Group2!$K100+Group3!$K100,Group1!$K100+Group2!$K100+Group3!$K100+Group4!$K100))))","v":""},null,null,"",""]
[null,98,null,{"$f":"IF($C101=\"\",\"\",IF($H$2=1,Group1!$K101,IF($H$2=2,Group1!$K101+Group2!$K101,IF($H$2=3,Group1!$K101+Group2!$K101+Group3!$K101,Group1!$K101+Group2!$K101+Group3!$K101+Group4!$K101))))","v":""},null,null,"",""]
[null,99,null,{"$f":"IF($C102=\"\",\"\",IF($H$2=1,Group1!$K102,IF($H$2=2,Group1!$K102+Group2!$K102,IF($H$2=3,Group1!$K102+Group2!$K102+Group3!$K102,Group1!$K102+Group2!$K102+Group3!$K102+Group4!$K102))))","v":""},null,null,"",""]
[null,100,null,{"$f":"IF($C103=\"\",\"\",IF($H$2=1,Group1!$K103,IF($H$2=2,Group1!$K103+Group2!$K103,IF($H$2=3,Group1!$K103+Group2!$K103+Group3!$K103,Group1!$K103+Group2!$K103+Group3!$K103+Group4!$K103))))","v":""},null,null,"",""]
[null,101,null,{"$f":"IF($C104=\"\",\"\",IF($H$2=1,Group1!$K104,IF($H$2=2,Group1!$K104+Group2!$K104,IF($H$2=3,Group1!$K104+Group2!$K104+Group3!$K104,Group1!$K104+Group2!$K104+Group3!$K104+Group4!$K104))))","v":""},null,null,{"$f":"IF(D104=\"\",\"\",$D104+$E104+$F104)","v":""},{"$f":"IF(G104=\"\",\"\",RANK($G104,$G$4:$G$103))","v":""}]
[null,102,null,{"$f":"IF($C105=\"\",\"\",IF($H$2=1,Group1!$K105,IF($H$2=2,Group1!$K105+Group2!$K105,IF($H$2=3,Group1!$K105+Group2!$K105+Group3!$K105,Group1!$K105+Group2!$K105+Group3!$K105+Group4!$K105))))","v":""},null,null,"",""]
[null,103,null,{"$f":"IF($C106=\"\",\"\",IF($H$2=1,Group1!$K106,IF($H$2=2,Group1!$K106+Group2!$K106,IF($H$2=3,Group1!$K106+Group2!$K106+Group3!$K106,Group1!$K106+Group2!$K106+Group3!$K106+Group4!$K106))))","v":""},null,null,"",""]
[null,104,null,{"$f":"IF($C107=\"\",\"\",IF($H$2=1,Group1!$K107,IF($H$2=2,Group1!$K107+Group2!$K107,IF($H$2=3,Group1!$K107+Group2!$K107+Group3!$K107,Group1!$K107+Group2!$K107+Group3!$K107+Group4!$K107))))","v":""},null,null,"",""]
[null,105,null,{"$f":"IF($C108=\"\",\"\",IF($H$2=1,Group1!$K108,IF($H$2=2,Group1!$K108+Group2!$K108,IF($H$2=3,Group1!$K108+Group2!$K108+Group3!$K108,Group1!$K108+Group2!$K108+Group3!$K108+Group4!$K108))))","v":""},null,null,"",""]
[null,106,null,{"$f":"IF($C109=\"\",\"\",IF($H$2=1,Group1!$K109,IF($H$2=2,Group1!$K109+Group2!$K109,IF($H$2=3,Group1!$K109+Group2!$K109+Group3!$K109,Group1!$K109+Group2!$K109+Group3!$K109+Group4!$K109))))","v":""},null,null,"",""]
[null,107,null,{"$f":"IF($C110=\"\",\"\",IF($H$2=1,Group1!$K110,IF($H$2=2,Group1!$K110+Group2!$K110,IF($H$2=3,Group1!$K110+Group2!$K110+Group3!$K110,Group1!$K110+Group2!$K110+Group3!$K110+Group4!$K110))))","v":""},null,null,"",""]
[null,108,null,{"$f":"IF($C111=\"\",\"\",IF($H$2=1,Group1!$K111,IF($H$2=2,Group1!$K111+Group2!$K111,IF($H$2=3,Group1!$K111+Group2!$K111+Group3!$K111,Group1!$K111+Group2!$K111+Group3!$K111+Group4!$K111))))","v":""},null,null,"",""]
[null,109,null,{"$f":"IF($C112=\"\",\"\",IF($H$2=1,Group1!$K112,IF($H$2=2,Group1!$K112+Group2!$K112,IF($H$2=3,Group1!$K112+Group2!$K112+Group3!$K112,Group1!$K112+Group2!$K112+Group3!$K112+Group4!$K112))))","v":""},null,null,"",""]
[null,110,null,{"$f":"IF($C113=\"\",\"\",IF($H$2=1,Group1!$K113,IF($H$2=2,Group1!$K113+Group2!$K113,IF($H$2=3,Group1!$K113+Group2!$K113+Group3!$K113,Group1!$K113+Group2!$K113+Group3!$K113+Group4!$K113))))","v":""},null,null,"",""]
[null,111,null,{"$f":"IF($C114=\"\",\"\",IF($H$2=1,Group1!$K114,IF($H$2=2,Group1!$K114+Group2!$K114,IF($H$2=3,Group1!$K114+Group2!$K114+Group3!$K114,Group1!$K114+Group2!$K114+Group3!$K114+Group4!$K114))))","v":""},null,null,"",""]
[null,112,null,{"$f":"IF($C115=\"\",\"\",IF($H$2=1,Group1!$K115,IF($H$2=2,Group1!$K115+Group2!$K115,IF($H$2=3,Group1!$K115+Group2!$K115+Group3!$K115,Group1!$K115+Group2!$K115+Group3!$K115+Group4!$K115))))","v":""},null,null,"",""]
[null,113,null,{"$f":"IF($C116=\"\",\"\",IF($H$2=1,Group1!$K116,IF($H$2=2,Group1!$K116+Group2!$K116,IF($H$2=3,Group1!$K116+Group2!$K116+Group3!$K116,Group1!$K116+Group2!$K116+Group3!$K116+Group4!$K116))))","v":""},null,null,"",""]
[null,114,null,{"$f":"IF($C117=\"\",\"\",IF($H$2=1,Group1!$K117,IF($H$2=2,Group1!$K117+Group2!$K117,IF($H$2=3,Group1!$K117+Group2!$K117+Group3!$K117,Group1!$K117+Group2!$K117+Group3!$K117+Group4!$K117))))","v":""},null,null,"",""]
[null,115,null,{"$f":"IF($C118=\"\",\"\",IF($H$2=1,Group1!$K118,IF($H$2=2,Group1!$K118+Group2!$K118,IF($H$2=3,Group1!$K118+Group2!$K118+Group3!$K118,Group1!$K118+Group2!$K118+Group3!$K118+Group4!$K118))))","v":""},null,null,"",""]
[null,116,null,{"$f":"IF($C119=\"\",\"\",IF($H$2=1,Group1!$K119,IF($H$2=2,Group1!$K119+Group2!$K119,IF($H$2=3,Group1!$K119+Group2!$K119+Group3!$K119,Group1!$K119+Group2!$K119+Group3!$K119+Group4!$K119))))","v":""},null,null,"",""]
[null,117,null,{"$f":"IF($C120=\"\",\"\",IF($H$2=1,Group1!$K120,IF($H$2=2,Group1!$K120+Group2!$K120,IF($H$2=3,Group1!$K120+Group2!$K120+Group3!$K120,Group1!$K120+Group2!$K120+Group3!$K120+Group4!$K120))))","v":""},null,null,"",""]
[null,118,null,{"$f":"IF($C121=\"\",\"\",IF($H$2=1,Group1!$K121,IF($H$2=2,Group1!$K121+Group2!$K121,IF($H$2=3,Group1!$K121+Group2!$K121+Group3!$K121,Group1!$K121+Group2!$K121+Group3!$K121+Group4!$K121))))","v":""},null,null,"",""]
[null,119,null,{"$f":"IF($C122=\"\",\"\",IF($H$2=1,Group1!$K122,IF($H$2=2,Group1!$K122+Group2!$K122,IF($H$2=3,Group1!$K122+Group2!$K122+Group3!$K122,Group1!$K122+Group2!$K122+Group3!$K122+Group4!$K122))))","v":""},null,null,"",""]
[null,120,null,{"$f":"IF($C123=\"\",\"\",IF($H$2=1,Group1!$K123,IF($H$2=2,Group1!$K123+Group2!$K123,IF($H$2=3,Group1!$K123+Group2!$K123+Group3!$K123,Group1!$K123+Group2!$K123+Group3!$K123+Group4!$K123))))","v":""},null,null,"",""]
[null,121,null,{"$f":"IF($C124=\"\",\"\",IF($H$2=1,Group1!$K124,IF($H$2=2,Group1!$K124+Group2!$K124,IF($H$2=3,Group1!$K124+Group2!$K124+Group3!$K124,Group1!$K124+Group2!$K124+Group3!$K124+Group4!$K124))))","v":""},null,null,"",""]
[null,122,null,{"$f":"IF($C125=\"\",\"\",IF($H$2=1,Group1!$K125,IF($H$2=2,Group1!$K125+Group2!$K125,IF($H$2=3,Group1!$K125+Group2!$K125+Group3!$K125,Group1!$K125+Group2!$K125+Group3!$K125+Group4!$K125))))","v":""},null,null,"",""]
[null,123,null,{"$f":"IF($C126=\"\",\"\",IF($H$2=1,Group1!$K126,IF($H$2=2,Group1!$K126+Group2!$K126,IF($H$2=3,Group1!$K126+Group2!$K126+Group3!$K126,Group1!$K126+Group2!$K126+Group3!$K126+Group4!$K126))))","v":""},null,null,"",""]
[null,124,null,{"$f":"IF($C127=\"\",\"\",IF($H$2=1,Group1!$K127,IF($H$2=2,Group1!$K127+Group2!$K127,IF($H$2=3,Group1!$K127+Group2!$K127+Group3!$K127,Group1!$K127+Group2!$K127+Group3!$K127+Group4!$K127))))","v":""},null,null,"",""]
[null,125,null,{"$f":"IF($C128=\"\",\"\",IF($H$2=1,Group1!$K128,IF($H$2=2,Group1!$K128+Group2!$K128,IF($H$2=3,Group1!$K128+Group2!$K128+Group3!$K128,Group1!$K128+Group2!$K128+Group3!$K128+Group4!$K128))))","v":""},null,null,"",""]
[null,126,null,{"$f":"IF($C129=\"\",\"\",IF($H$2=1,Group1!$K129,IF($H$2=2,Group1!$K129+Group2!$K129,IF($H$2=3,Group1!$K129+Group2!$K129+Group3!$K129,Group1!$K129+Group2!$K129+Group3!$K129+Group4!$K129))))","v":""},null,null,"",""]
[null,127,null,{"$f":"IF($C130=\"\",\"\",IF($H$2=1,Group1!$K130,IF($H$2=2,Group1!$K130+Group2!$K130,IF($H$2=3,Group1!$K130+Group2!$K130+Group3!$K130,Group1!$K130+Group2!$K130+Group3!$K130+Group4!$K130))))","v":""},null,null,"",""]
[null,128,null,{"$f":"IF($C131=\"\",\"\",IF($H$2=1,Group1!$K131,IF($H$2=2,Group1!$K131+Group2!$K131,IF($H$2=3,Group1!$K131+Group2!$K131+Group3!$K131,Group1!$K131+Group2!$K131+Group3!$K131+Group4!$K131))))","v":""},null,null,"",""]
[null,129,null,{"$f":"IF($C132=\"\",\"\",IF($H$2=1,Group1!$K132,IF($H$2=2,Group1!$K132+Group2!$K132,IF($H$2=3,Group1!$K132+Group2!$K132+Group3!$K132,Group1!$K132+Group2!$K132+Group3!$K132+Group4!$K132))))","v":""},null,null,"",""]
[null,130,null,{"$f":"IF($C133=\"\",\"\",IF($H$2=1,Group1!$K133,IF($H$2=2,Group1!$K133+Group2!$K133,IF($H$2=3,Group1!$K133+Group2!$K133+Group3!$K133,Group1!$K133+Group2!$K133+Group3!$K133+Group4!$K133))))","v":""},null,null,"",""]
[null,131,null,{"$f":"IF($C134=\"\",\"\",IF($H$2=1,Group1!$K134,IF($H$2=2,Group1!$K134+Group2!$K134,IF($H$2=3,Group1!$K134+Group2!$K134+Group3!$K134,Group1!$K134+Group2!$K134+Group3!$K134+Group4!$K134))))","v":""},null,null,"",""]
[null,132,null,{"$f":"IF($C135=\"\",\"\",IF($H$2=1,Group1!$K135,IF($H$2=2,Group1!$K135+Group2!$K135,IF($H$2=3,Group1!$K135+Group2!$K135+Group3!$K135,Group1!$K135+Group2!$K135+Group3!$K135+Group4!$K135))))","v":""},null,null,"",""]
[null,133,null,{"$f":"IF($C136=\"\",\"\",IF($H$2=1,Group1!$K136,IF($H$2=2,Group1!$K136+Group2!$K136,IF($H$2=3,Group1!$K136+Group2!$K136+Group3!$K136,Group1!$K136+Group2!$K136+Group3!$K136+Group4!$K136))))","v":""},null,null,"",""]
[null,134,null,{"$f":"IF($C137=\"\",\"\",IF($H$2=1,Group1!$K137,IF($H$2=2,Group1!$K137+Group2!$K137,IF($H$2=3,Group1!$K137+Group2!$K137+Group3!$K137,Group1!$K137+Group2!$K137+Group3!$K137+Group4!$K137))))","v":""},null,null,"",""]
[null,135,null,{"$f":"IF($C138=\"\",\"\",IF($H$2=1,Group1!$K138,IF($H$2=2,Group1!$K138+Group2!$K138,IF($H$2=3,Group1!$K138+Group2!$K138+Group3!$K138,Group1!$K138+Group2!$K138+Group3!$K138+Group4!$K138))))","v":""},null,null,"",""]
[null,136,null,{"$f":"IF($C139=\"\",\"\",IF($H$2=1,Group1!$K139,IF($H$2=2,Group1!$K139+Group2!$K139,IF($H$2=3,Group1!$K139+Group2!$K139+Group3!$K139,Group1!$K139+Group2!$K139+Group3!$K139+Group4!$K139))))","v":""},null,null,"",""]
[null,137,null,{"$f":"IF($C140=\"\",\"\",IF($H$2=1,Group1!$K140,IF($H$2=2,Group1!$K140+Group2!$K140,IF($H$2=3,Group1!$K140+Group2!$K140+Group3!$K140,Group1!$K140+Group2!$K140+Group3!$K140+Group4!$K140))))","v":""},null,null,"",""]
[null,138,null,{"$f":"IF($C141=\"\",\"\",IF($H$2=1,Group1!$K141,IF($H$2=2,Group1!$K141+Group2!$K141,IF($H$2=3,Group1!$K141+Group2!$K141+Group3!$K141,Group1!$K141+Group2!$K141+Group3!$K141+Group4!$K141))))","v":""},null,null,"",""]
[null,139,null,{"$f":"IF($C142=\"\",\"\",IF($H$2=1,Group1!$K142,IF($H$2=2,Group1!$K142+Group2!$K142,IF($H$2=3,Group1!$K142+Group2!$K142+Group3!$K142,Group1!$K142+Group2!$K142+Group3!$K142+Group4!$K142))))","v":""},null,null,"",""]
[null,140,null,{"$f":"IF($C143=\"\",\"\",IF($H$2=1,Group1!$K143,IF($H$2=2,Group1!$K143+Group2!$K143,IF($H$2=3,Group1!$K143+Group2!$K143+Group3!$K143,Group1!$K143+Group2!$K143+Group3!$K143+Group4!$K143))))","v":""},null,null,"",""]
[null,141,null,{"$f":"IF($C144=\"\",\"\",IF($H$2=1,Group1!$K144,IF($H$2=2,Group1!$K144+Group2!$K144,IF($H$2=3,Group1!$K144+Group2!$K144+Group3!$K144,Group1!$K144+Group2!$K144+Group3!$K144+Group4!$K144))))","v":""},null,null,"",""]
[null,142,null,{"$f":"IF($C145=\"\",\"\",IF($H$2=1,Group1!$K145,IF($H$2=2,Group1!$K145+Group2!$K145,IF($H$2=3,Group1!$K145+Group2!$K145+Group3!$K145,Group1!$K145+Group2!$K145+Group3!$K145+Group4!$K145))))","v":""},null,null,"",""]
[null,143,null,{"$f":"IF($C146=\"\",\"\",IF($H$2=1,Group1!$K146,IF($H$2=2,Group1!$K146+Group2!$K146,IF($H$2=3,Group1!$K146+Group2!$K146+Group3!$K146,Group1!$K146+Group2!$K146+Group3!$K146+Group4!$K146))))","v":""},null,null,"",""]
[null,144,null,{"$f":"IF($C147=\"\",\"\",IF($H$2=1,Group1!$K147,IF($H$2=2,Group1!$K147+Group2!$K147,IF($H$2=3,Group1!$K147+Group2!$K147+Group3!$K147,Group1!$K147+Group2!$K147+Group3!$K147+Group4!$K147))))","v":""},null,null,"",""]
[null,145,null,{"$f":"IF($C148=\"\",\"\",IF($H$2=1,Group1!$K148,IF($H$2=2,Group1!$K148+Group2!$K148,IF($H$2=3,Group1!$K148+Group2!$K148+Group3!$K148,Group1!$K148+Group2!$K148+Group3!$K148+Group4!$K148))))","v":""},null,null,"",""]
[null,146,null,{"$f":"IF($C149=\"\",\"\",IF($H$2=1,Group1!$K149,IF($H$2=2,Group1!$K149+Group2!$K149,IF($H$2=3,Group1!$K149+Group2!$K149+Group3!$K149,Group1!$K149+Group2!$K149+Group3!$K149+Group4!$K149))))","v":""},null,null,"",""]
[null,147,null,{"$f":"IF($C150=\"\",\"\",IF($H$2=1,Group1!$K150,IF($H$2=2,Group1!$K150+Group2!$K150,IF($H$2=3,Group1!$K150+Group2!$K150+Group3!$K150,Group1!$K150+Group2!$K150+Group3!$K150+Group4!$K150))))","v":""},null,null,"",""]
[null,148,null,{"$f":"IF($C151=\"\",\"\",IF($H$2=1,Group1!$K151,IF($H$2=2,Group1!$K151+Group2!$K151,IF($H$2=3,Group1!$K151+Group2!$K151+Group3!$K151,Group1!$K151+Group2!$K151+Group3!$K151+Group4!$K151))))","v":""},null,null,"",""]
[null,149,null,{"$f":"IF($C152=\"\",\"\",IF($H$2=1,Group1!$K152,IF($H$2=2,Group1!$K152+Group2!$K152,IF($H$2=3,Group1!$K152+Group2!$K152+Group3!$K152,Group1!$K152+Group2!$K152+Group3!$K152+Group4!$K152))))","v":""},null,null,"",""]
[null,150,null,{"$f":"IF($C153=\"\",\"\",IF($H$2=1,Group1!$K153,IF($H$2=2,Group1!$K153+Group2!$K153,IF($H$2=3,Group1!$K153+Group2!$K153+Group3!$K153,Group1!$K153+Group2!$K153+Group3!$K153+Group4!$K153))))","v":""},null,null,"",""]
[null,151,null,{"$f":"IF($C154=\"\",\"\",IF($H$2=1,Group1!$K154,IF($H$2=2,Group1!$K154+Group2!$K154,IF($H$2=3,Group1!$K154+Group2!$K154+Group3!$K154,Group1!$K154+Group2!$K154+Group3!$K154+Group4!$K154))))","v":""},null,null,"",""]
[null,152,null,{"$f":"IF($C155=\"\",\"\",IF($H$2=1,Group1!$K155,IF($H$2=2,Group1!$K155+Group2!$K155,IF($H$2=3,Group1!$K155+Group2!$K155+Group3!$K155,Group1!$K155+Group2!$K155+Group3!$K155+Group4!$K155))))","v":""},null,null,"",""]
[null,153,null,{"$f":"IF($C156=\"\",\"\",IF($H$2=1,Group1!$K156,IF($H$2=2,Group1!$K156+Group2!$K156,IF($H$2=3,Group1!$K156+Group2!$K156+Group3!$K156,Group1!$K156+Group2!$K156+Group3!$K156+Group4!$K156))))","v":""},null,null,"",""]
[null,154,null,{"$f":"IF($C157=\"\",\"\",IF($H$2=1,Group1!$K157,IF($H$2=2,Group1!$K157+Group2!$K157,IF($H$2=3,Group1!$K157+Group2!$K157+Group3!$K157,Group1!$K157+Group2!$K157+Group3!$K157+Group4!$K157))))","v":""},null,null,"",""]
[null,155,null,{"$f":"IF($C158=\"\",\"\",IF($H$2=1,Group1!$K158,IF($H$2=2,Group1!$K158+Group2!$K158,IF($H$2=3,Group1!$K158+Group2!$K158+Group3!$K158,Group1!$K158+Group2!$K158+Group3!$K158+Group4!$K158))))","v":""},null,null,"",""]
[null,156,null,{"$f":"IF($C159=\"\",\"\",IF($H$2=1,Group1!$K159,IF($H$2=2,Group1!$K159+Group2!$K159,IF($H$2=3,Group1!$K159+Group2!$K159+Group3!$K159,Group1!$K159+Group2!$K159+Group3!$K159+Group4!$K159))))","v":""},null,null,"",""]
[null,157,null,{"$f":"IF($C160=\"\",\"\",IF($H$2=1,Group1!$K160,IF($H$2=2,Group1!$K160+Group2!$K160,IF($H$2=3,Group1!$K160+Group2!$K160+Group3!$K160,Group1!$K160+Group2!$K160+Group3!$K160+Group4!$K160))))","v":""},null,null,"",""]
[null,158,null,{"$f":"IF($C161=\"\",\"\",IF($H$2=1,Group1!$K161,IF($H$2=2,Group1!$K161+Group2!$K161,IF($H$2=3,Group1!$K161+Group2!$K161+Group3!$K161,Group1!$K161+Group2!$K161+Group3!$K161+Group4!$K161))))","v":""},null,null,"",""]
[null,159,null,{"$f":"IF($C162=\"\",\"\",IF($H$2=1,Group1!$K162,IF($H$2=2,Group1!$K162+Group2!$K162,IF($H$2=3,Group1!$K162+Group2!$K162+Group3!$K162,Group1!$K162+Group2!$K162+Group3!$K162+Group4!$K162))))","v":""},null,null,"",""]
[null,160,null,{"$f":"IF($C163=\"\",\"\",IF($H$2=1,Group1!$K163,IF($H$2=2,Group1!$K163+Group2!$K163,IF($H$2=3,Group1!$K163+Group2!$K163+Group3!$K163,Group1!$K163+Group2!$K163+Group3!$K163+Group4!$K163))))","v":""},null,null,"",""]
[null,161,null,{"$f":"IF($C164=\"\",\"\",IF($H$2=1,Group1!$K164,IF($H$2=2,Group1!$K164+Group2!$K164,IF($H$2=3,Group1!$K164+Group2!$K164+Group3!$K164,Group1!$K164+Group2!$K164+Group3!$K164+Group4!$K164))))","v":""},null,null,"",""]
[null,162,null,{"$f":"IF($C165=\"\",\"\",IF($H$2=1,Group1!$K165,IF($H$2=2,Group1!$K165+Group2!$K165,IF($H$2=3,Group1!$K165+Group2!$K165+Group3!$K165,Group1!$K165+Group2!$K165+Group3!$K165+Group4!$K165))))","v":""},null,null,"",""]
[null,163,null,{"$f":"IF($C166=\"\",\"\",IF($H$2=1,Group1!$K166,IF($H$2=2,Group1!$K166+Group2!$K166,IF($H$2=3,Group1!$K166+Group2!$K166+Group3!$K166,Group1!$K166+Group2!$K166+Group3!$K166+Group4!$K166))))","v":""},null,null,"",""]
[null,164,null,{"$f":"IF($C167=\"\",\"\",IF($H$2=1,Group1!$K167,IF($H$2=2,Group1!$K167+Group2!$K167,IF($H$2=3,Group1!$K167+Group2!$K167+Group3!$K167,Group1!$K167+Group2!$K167+Group3!$K167+Group4!$K167))))","v":""},null,null,"",""]
[null,165,null,{"$f":"IF($C168=\"\",\"\",IF($H$2=1,Group1!$K168,IF($H$2=2,Group1!$K168+Group2!$K168,IF($H$2=3,Group1!$K168+Group2!$K168+Group3!$K168,Group1!$K168+Group2!$K168+Group3!$K168+Group4!$K168))))","v":""},null,null,{"$f":"IF(D168=\"\",\"\",$D168+$E168+$F168)","v":""},{"$f":"IF(G168=\"\",\"\",RANK($G168,$G$4:$G$103))","v":""}]
[null,166,null,{"$f":"IF($C169=\"\",\"\",IF($H$2=1,Group1!$K169,IF($H$2=2,Group1!$K169+Group2!$K169,IF($H$2=3,Group1!$K169+Group2!$K169+Group3!$K169,Group1!$K169+Group2!$K169+Group3!$K169+Group4!$K169))))","v":""},null,null,"",""]
[null,167,null,{"$f":"IF($C170=\"\",\"\",IF($H$2=1,Group1!$K170,IF($H$2=2,Group1!$K170+Group2!$K170,IF($H$2=3,Group1!$K170+Group2!$K170+Group3!$K170,Group1!$K170+Group2!$K170+Group3!$K170+Group4!$K170))))","v":""},null,null,"",""]
[null,168,null,{"$f":"IF($C171=\"\",\"\",IF($H$2=1,Group1!$K171,IF($H$2=2,Group1!$K171+Group2!$K171,IF($H$2=3,Group1!$K171+Group2!$K171+Group3!$K171,Group1!$K171+Group2!$K171+Group3!$K171+Group4!$K171))))","v":""},null,null,"",""]
[null,169,null,{"$f":"IF($C172=\"\",\"\",IF($H$2=1,Group1!$K172,IF($H$2=2,Group1!$K172+Group2!$K172,IF($H$2=3,Group1!$K172+Group2!$K172+Group3!$K172,Group1!$K172+Group2!$K172+Group3!$K172+Group4!$K172))))","v":""},null,null,"",""]
[null,170,null,{"$f":"IF($C173=\"\",\"\",IF($H$2=1,Group1!$K173,IF($H$2=2,Group1!$K173+Group2!$K173,IF($H$2=3,Group1!$K173+Group2!$K173+Group3!$K173,Group1!$K173+Group2!$K173+Group3!$K173+Group4!$K173))))","v":""},null,null,"",""]
[null,171,null,{"$f":"IF($C174=\"\",\"\",IF($H$2=1,Group1!$K174,IF($H$2=2,Group1!$K174+Group2!$K174,IF($H$2=3,Group1!$K174+Group2!$K174+Group3!$K174,Group1!$K174+Group2!$K174+Group3!$K174+Group4!$K174))))","v":""},null,null,"",""]
[null,172,null,{"$f":"IF($C175=\"\",\"\",IF($H$2=1,Group1!$K175,IF($H$2=2,Group1!$K175+Group2!$K175,IF($H$2=3,Group1!$K175+Group2!$K175+Group3!$K175,Group1!$K175+Group2!$K175+Group3!$K175+Group4!$K175))))","v":""},null,null,"",""]
[null,173,null,{"$f":"IF($C176=\"\",\"\",IF($H$2=1,Group1!$K176,IF($H$2=2,Group1!$K176+Group2!$K176,IF($H$2=3,Group1!$K176+Group2!$K176+Group3!$K176,Group1!$K176+Group2!$K176+Group3!$K176+Group4!$K176))))","v":""},null,null,"",""]
[null,174,null,{"$f":"IF($C177=\"\",\"\",IF($H$2=1,Group1!$K177,IF($H$2=2,Group1!$K177+Group2!$K177,IF($H$2=3,Group1!$K177+Group2!$K177+Group3!$K177,Group1!$K177+Group2!$K177+Group3!$K177+Group4!$K177))))","v":""},null,null,"",""]
[null,175,null,{"$f":"IF($C178=\"\",\"\",IF($H$2=1,Group1!$K178,IF($H$2=2,Group1!$K178+Group2!$K178,IF($H$2=3,Group1!$K178+Group2!$K178+Group3!$K178,Group1!$K178+Group2!$K178+Group3!$K178+Group4!$K178))))","v":""},null,null,"",""]
[null,176,null,{"$f":"IF($C179=\"\",\"\",IF($H$2=1,Group1!$K179,IF($H$2=2,Group1!$K179+Group2!$K179,IF($H$2=3,Group1!$K179+Group2!$K179+Group3!$K179,Group1!$K179+Group2!$K179+Group3!$K179+Group4!$K179))))","v":""},null,null,"",""]
[null,177,null,{"$f":"IF($C180=\"\",\"\",IF($H$2=1,Group1!$K180,IF($H$2=2,Group1!$K180+Group2!$K180,IF($H$2=3,Group1!$K180+Group2!$K180+Group3!$K180,Group1!$K180+Group2!$K180+Group3!$K180+Group4!$K180))))","v":""},null,null,"",""]
[null,178,null,{"$f":"IF($C181=\"\",\"\",IF($H$2=1,Group1!$K181,IF($H$2=2,Group1!$K181+Group2!$K181,IF($H$2=3,Group1!$K181+Group2!$K181+Group3!$K181,Group1!$K181+Group2!$K181+Group3!$K181+Group4!$K181))))","v":""},null,null,"",""]
[null,179,null,{"$f":"IF($C182=\"\",\"\",IF($H$2=1,Group1!$K182,IF($H$2=2,Group1!$K182+Group2!$K182,IF($H$2=3,Group1!$K182+Group2!$K182+Group3!$K182,Group1!$K182+Group2!$K182+Group3!$K182+Group4!$K182))))","v":""},null,null,"",""]
[null,180,null,{"$f":"IF($C183=\"\",\"\",IF($H$2=1,Group1!$K183,IF($H$2=2,Group1!$K183+Group2!$K183,IF($H$2=3,Group1!$K183+Group2!$K183+Group3!$K183,Group1!$K183+Group2!$K183+Group3!$K183+Group4!$K183))))","v":""},null,null,"",""]
[null,181,null,{"$f":"IF($C184=\"\",\"\",IF($H$2=1,Group1!$K184,IF($H$2=2,Group1!$K184+Group2!$K184,IF($H$2=3,Group1!$K184+Group2!$K184+Group3!$K184,Group1!$K184+Group2!$K184+Group3!$K184+Group4!$K184))))","v":""},null,null,"",""]
[null,182,null,{"$f":"IF($C185=\"\",\"\",IF($H$2=1,Group1!$K185,IF($H$2=2,Group1!$K185+Group2!$K185,IF($H$2=3,Group1!$K185+Group2!$K185+Group3!$K185,Group1!$K185+Group2!$K185+Group3!$K185+Group4!$K185))))","v":""},null,null,"",""]
[null,183,null,{"$f":"IF($C186=\"\",\"\",IF($H$2=1,Group1!$K186,IF($H$2=2,Group1!$K186+Group2!$K186,IF($H$2=3,Group1!$K186+Group2!$K186+Group3!$K186,Group1!$K186+Group2!$K186+Group3!$K186+Group4!$K186))))","v":""},null,null,"",""]
[null,184,null,{"$f":"IF($C187=\"\",\"\",IF($H$2=1,Group1!$K187,IF($H$2=2,Group1!$K187+Group2!$K187,IF($H$2=3,Group1!$K187+Group2!$K187+Group3!$K187,Group1!$K187+Group2!$K187+Group3!$K187+Group4!$K187))))","v":""},null,null,"",""]
[null,185,null,{"$f":"IF($C188=\"\",\"\",IF($H$2=1,Group1!$K188,IF($H$2=2,Group1!$K188+Group2!$K188,IF($H$2=3,Group1!$K188+Group2!$K188+Group3!$K188,Group1!$K188+Group2!$K188+Group3!$K188+Group4!$K188))))","v":""},null,null,"",""]
[null,186,null,{"$f":"IF($C189=\"\",\"\",IF($H$2=1,Group1!$K189,IF($H$2=2,Group1!$K189+Group2!$K189,IF($H$2=3,Group1!$K189+Group2!$K189+Group3!$K189,Group1!$K189+Group2!$K189+Group3!$K189+Group4!$K189))))","v":""},null,null,"",""]
[null,187,null,{"$f":"IF($C190=\"\",\"\",IF($H$2=1,Group1!$K190,IF($H$2=2,Group1!$K190+Group2!$K190,IF($H$2=3,Group1!$K190+Group2!$K190+Group3!$K190,Group1!$K190+Group2!$K190+Group3!$K190+Group4!$K190))))","v":""},null,null,"",""]
[null,188,null,{"$f":"IF($C191=\"\",\"\",IF($H$2=1,Group1!$K191,IF($H$2=2,Group1!$K191+Group2!$K191,IF($H$2=3,Group1!$K191+Group2!$K191+Group3!$K191,Group1!$K191+Group2!$K191+Group3!$K191+Group4!$K191))))","v":""},null,null,"",""]
[null,189,null,{"$f":"IF($C192=\"\",\"\",IF($H$2=1,Group1!$K192,IF($H$2=2,Group1!$K192+Group2!$K192,IF($H$2=3,Group1!$K192+Group2!$K192+Group3!$K192,Group1!$K192+Group2!$K192+Group3!$K192+Group4!$K192))))","v":""},null,null,"",""]
[null,190,null,{"$f":"IF($C193=\"\",\"\",IF($H$2=1,Group1!$K193,IF($H$2=2,Group1!$K193+Group2!$K193,IF($H$2=3,Group1!$K193+Group2!$K193+Group3!$K193,Group1!$K193+Group2!$K193+Group3!$K193+Group4!$K193))))","v":""},null,null,"",""]
[null,191,null,{"$f":"IF($C194=\"\",\"\",IF($H$2=1,Group1!$K194,IF($H$2=2,Group1!$K194+Group2!$K194,IF($H$2=3,Group1!$K194+Group2!$K194+Group3!$K194,Group1!$K194+Group2!$K194+Group3!$K194+Group4!$K194))))","v":""},null,null,"",""]
[null,192,null,{"$f":"IF($C195=\"\",\"\",IF($H$2=1,Group1!$K195,IF($H$2=2,Group1!$K195+Group2!$K195,IF($H$2=3,Group1!$K195+Group2!$K195+Group3!$K195,Group1!$K195+Group2!$K195+Group3!$K195+Group4!$K195))))","v":""},null,null,"",""]
[null,193,null,{"$f":"IF($C196=\"\",\"\",IF($H$2=1,Group1!$K196,IF($H$2=2,Group1!$K196+Group2!$K196,IF($H$2=3,Group1!$K196+Group2!$K196+Group3!$K196,Group1!$K196+Group2!$K196+Group3!$K196+Group4!$K196))))","v":""},null,null,"",""]
[null,194,null,{"$f":"IF($C197=\"\",\"\",IF($H$2=1,Group1!$K197,IF($H$2=2,Group1!$K197+Group2!$K197,IF($H$2=3,Group1!$K197+Group2!$K197+Group3!$K197,Group1!$K197+Group2!$K197+Group3!$K197+Group4!$K197))))","v":""},null,null,"",""]
[null,195,null,{"$f":"IF($C198=\"\",\"\",IF($H$2=1,Group1!$K198,IF($H$2=2,Group1!$K198+Group2!$K198,IF($H$2=3,Group1!$K198+Group2!$K198+Group3!$K198,Group1!$K198+Group2!$K198+Group3!$K198+Group4!$K198))))","v":""},null,null,"",""]
[null,196,null,{"$f":"IF($C199=\"\",\"\",IF($H$2=1,Group1!$K199,IF($H$2=2,Group1!$K199+Group2!$K199,IF($H$2=3,Group1!$K199+Group2!$K199+Group3!$K199,Group1!$K199+Group2!$K199+Group3!$K199+Group4!$K199))))","v":""},null,null,"",""]
[null,197,null,{"$f":"IF($C200=\"\",\"\",IF($H$2=1,Group1!$K200,IF($H$2=2,Group1!$K200+Group2!$K200,IF($H$2=3,Group1!$K200+Group2!$K200+Group3!$K200,Group1!$K200+Group2!$K200+Group3!$K200+Group4!$K200))))","v":""},null,null,"",""]
[null,198,null,{"$f":"IF($C201=\"\",\"\",IF($H$2=1,Group1!$K201,IF($H$2=2,Group1!$K201+Group2!$K201,IF($H$2=3,Group1!$K201+Group2!$K201+Group3!$K201,Group1!$K201+Group2!$K201+Group3!$K201+Group4!$K201))))","v":""},null,null,{"$f":"IF(D201=\"\",\"\",$D201+$E201+$F201)","v":""},{"$f":"IF(G201=\"\",\"\",RANK($G201,$G$4:$G$103))","v":""}]
[null,199,null,{"$f":"IF($C202=\"\",\"\",IF($H$2=1,Group1!$K202,IF($H$2=2,Group1!$K202+Group2!$K202,IF($H$2=3,Group1!$K202+Group2!$K202+Group3!$K202,Group1!$K202+Group2!$K202+Group3!$K202+Group4!$K202))))","v":""},null,null,"",""]
[null,200,null,{"$f":"IF($C203=\"\",\"\",IF($H$2=1,Group1!$K203,IF($H$2=2,Group1!$K203+Group2!$K203,IF($H$2=3,Group1!$K203+Group2!$K203+Group3!$K203,Group1!$K203+Group2!$K203+Group3!$K203+Group4!$K203))))","v":""},null,null,"",""]

{"sheet":"Group1","index":2,"n_rows":203,"n_cols":22,"rows_kept":203,"cut":false,"hidden":false,"merged":[[1,3,1,8]]}
[]
[null,null,"Group 1 :"]
[null,null,null,null,null,null,null,null,"Entrant No","Placings","Score",null,"J1","J2","J3","J4","PO","QO","RO","QP","RP","RQ"]
[null,null,null,null,null,null,null,null,{"$f":"IF(Results!C4=\"\",\"\",Results!B4)","v":""},null,{"$f":"IF($C$6=\"\",\"\",IF(I4=\"\",\"\",50-SUM(Q4:V4)))","v":""},null,{"$f":"SEARCH($C$6,J4)","v":{"$error":"#VALUE!"}},{"$f":"SEARCH($D$6,J4)","v":{"$error":"#VALUE!"}},{"$f":"SEARCH($E$6,J4)","v":{"$error":"#VALUE!"}},{"$f":"SEARCH($F$6,J4)","v":{"$error":"#VALUE!"}},{"$f":"IF((N4-M4)<0,$C$8,0)","v":{"$error":"#VALUE!"}},{"$f":"IF((O4-M4)<0,$C$8+$D$8,0)","v":{"$error":"#VALUE!"}},{"$f":"IF((P4-M4)<0,$C$8+$D$8+$E$8,0)","v":{"$error":"#VALUE!"}},{"$f":"IF((O4-N4)<0,$D$8,0)","v":{"$error":"#VALUE!"}},{"$f":"IF((P4-N4)<0,$D$8+$E$8,0)","v":{"$error":"#VALUE!"}},{"$f":"IF((P4-O4)<0,$E$8,0)","v":{"$error":"#VALUE!"}}]
[null,null,"Judge's Placings",null,null,null,null,null,{"$f":"IF(Results!C5=\"\",\"\",Results!B5)","v":""},null,"",null,{"$error":"#VALUE!"},{"$error":"#VALUE!"},{"$error":"#VALUE!"},{"$error":"#VALUE!"},{"$error":"#VALUE!"},{"$error":"#VALUE!"},{"$error":"#VALUE!"},{"$error":"#VALUE!"},{"$error":"#VALUE!"},{"$error":"#VALUE!"}]
[null,null,null,null,null,null,null,null,{"$f":"IF(Results!C6=\"\",\"\",Results!B6)","v":""},null,"",null,{"$error":"#VALUE!"},{"$error":"#VALUE!"},{"$error":"#VALUE!"},{"$error":"#VALUE!"},{"$error":"#VALUE!"},{"$error":"#VALUE!"},{"$error":"#VALUE!"},{"$error":"#VALUE!"},{"$error":"#VALUE!"},{"$error":"#VALUE!"}]
[null,null,"Judge's Cuts",null,null,null,null,null,{"$f":"IF(Results!C7=\"\",\"\",Results!B7)","v":""},null,"",null,{"$error":"#VALUE!"},{"$error":"#VALUE!"},{"$error":"#VALUE!"},{"$error":"#VALUE!"},{"$error":"#VALUE!"},{"$error":"#VALUE!"},{"$error":"#VALUE!"},{"$error":"#VALUE!"},{"$error":"#VALUE!"},{"$error":"#VALUE!"}]
[null,null,null,null,null,null,null,null,{"$f":"IF(Results!C8=\"\",\"\",Results!B8)","v":""},null,"",null,{"$error":"#VALUE!"},{"$error":"#VALUE!"},{"$error":"#VALUE!"},{"$error":"#VALUE!"},{"$error":"#VALUE!"},{"$error":"#VALUE!"},{"$error":"#VALUE!"},{"$error":"#VALUE!"},{"$error":"#VALUE!"},{"$error":"#VALUE!"}]
[null,null,null,null,null,null,null,null,{"$f":"IF(Results!C9=\"\",\"\",Results!B9)","v":""},null,"",null,{"$error":"#VALUE!"},{"$error":"#VALUE!"},{"$error":"#VALUE!"},{"$error":"#VALUE!"},{"$error":"#VALUE!"},{"$error":"#VALUE!"},{"$error":"#VALUE!"},{"$error":"#VALUE!"},{"$error":"#VALUE!"},{"$error":"#VALUE!"}]
[null,null,{"$f":"IF($C$8=\"\",\"\",IF(($C$8+$D$8+$E$8)<3,\"WARNING : Cuts total less than 3\",\"\"))","v":""},null,null,null,null,null,{"$f":"IF(Results!C10=\"\",\"\",Results!B10)","v":""},null,"",null,{"$error":"#VALUE!"},{"$error":"#VALUE!"},{"$error":"#VALUE!"},{"$error":"#VALUE!"},{"$error":"#VALUE!"},{"$error":"#VALUE!"},{"$error":"#VALUE!"},{"$error":"#VALUE!"},{"$error":"#VALUE!"},{"$error":"#VALUE!"}]
[null,null,{"$f":"IF(($C$8+$D$8+$E$8)>15,\"WARNING : Cuts total more than 15\",\"\")","v":""},null,null,null,null,null,{"$f":"IF(Results!C11=\"\",\"\",Results!B11)","v":""},null,"",null,{"$error":"#VALUE!"},{"$error":"#VALUE!"},{"$error":"#VALUE!"},{"$error":"#VALUE!"},{"$error":"#VALUE!"},{"$error":"#VALUE!"},{"$error":"#VALUE!"},{"$error":"#VALUE!"},{"$error":"#VALUE!"},{"$error":"#VALUE!"}]
[null,null,{"$f":"IF(AND(($C$8+$D$8+$E$8)>=15,$D$8>5),\"WARNING : Middle cut more than 5\",\"\")","v":""},null,null,null,null,null,{"$f":"IF(Results!C12=\"\",\"\",Results!B12)","v":""},null,"",null,{"$error":"#VALUE!"},{"$error":"#VALUE!"},{"$error":"#VALUE!"},{"$error":"#VALUE!"},{"$error":"#VALUE!"},{"$error":"#VALUE!"},{"$error":"#VALUE!"},{"$error":"#VALUE!"},{"$error":"#VALUE!"},{"$error":"#VALUE!"}]
[null,null,{"$f":"IF(AND(($C$8+$D$8+$E$8)=14,$D$8>8),\"WARNING : Middle cut more than 8\",\"\")","v":""},null,null,null,null,null,{"$f":"IF(Results!C13=\"\",\"\",Results!B13)","v":""},null,"",null,{"$error":"#VALUE!"},{"$error":"#VALUE!"},{"$error":"#VALUE!"},{"$error":"#VALUE!"},{"$error":"#VALUE!"},{"$error":"#VALUE!"},{"$error":"#VALUE!"},{"$error":"#VALUE!"},{"$error":"#VALUE!"},{"$error":"#VALUE!"}]
[null,null,{"$f":"IF(AND(C10=\"\",C11=\"\",C12=\"\",C13=\"\"),\"\",\"Please discuss with Judge\")","v":""},null,null,null,null,null,{"$f":"IF(Results!C14=\"\",\"\",Results!B14)","v":""},null,"",null,{"$error":"#VALUE!"},{"$error":"#VALUE!"},{"$error":"#VALUE!"},{"$error":"#VALUE!"},{"$error":"#VALUE!"},{"$error":"#VALUE!"},{"$error":"#VALUE!"},{"$error":"#VALUE!"},{"$error":"#VALUE!"},{"$error":"#VALUE!"}]
[null,null,null,null,null,null,null,null,{"$f":"IF(Results!C15=\"\",\"\",Results!B15)","v":""},null,"",null,{"$error":"#VALUE!"},{"$error":"#VALUE!"},{"$error":"#VALUE!"},{"$error":"#VALUE!"},{"$error":"#VALUE!"},{"$error":"#VALUE!"},{"$error":"#VALUE!"},{"$error":"#VALUE!"},{"$error":"#VALUE!"},{"$error":"#VALUE!"}]
[null,null,null,null,null,null,null,null,{"$f":"IF(Results!C16=\"\",\"\",Results!B16)","v":""},null,"",null,{"$error":"#VALUE!"},{"$error":"#VALUE!"},{"$error":"#VALUE!"},{"$error":"#VALUE!"},{"$error":"#VALUE!"},{"$error":"#VALUE!"},{"$error":"#VALUE!"},{"$error":"#VALUE!"},{"$error":"#VALUE!"},{"$error":"#VALUE!"}]
[null,null,null,null,null,null,null,null,{"$f":"IF(Results!C17=\"\",\"\",Results!B17)","v":""},null,"",null,{"$error":"#VALUE!"},{"$error":"#VALUE!"},{"$error":"#VALUE!"},{"$error":"#VALUE!"},{"$error":"#VALUE!"},{"$error":"#VALUE!"},{"$error":"#VALUE!"},{"$error":"#VALUE!"},{"$error":"#VALUE!"},{"$error":"#VALUE!"}]
[null,null,null,null,null,null,null,null,{"$f":"IF(Results!C18=\"\",\"\",Results!B18)","v":""},null,"",null,{"$error":"#VALUE!"},{"$error":"#VALUE!"},{"$error":"#VALUE!"},{"$error":"#VALUE!"},{"$error":"#VALUE!"},{"$error":"#VALUE!"},{"$error":"#VALUE!"},{"$error":"#VALUE!"},{"$error":"#VALUE!"},{"$error":"#VALUE!"}]
[null,null,null,null,null,null,null,null,{"$f":"IF(Results!C19=\"\",\"\",Results!B19)","v":""},null,"",null,{"$error":"#VALUE!"},{"$error":"#VALUE!"},{"$error":"#VALUE!"},{"$error":"#VALUE!"},{"$error":"#VALUE!"},{"$error":"#VALUE!"},{"$error":"#VALUE!"},{"$error":"#VALUE!"},{"$error":"#VALUE!"},{"$error":"#VALUE!"}]
[null,null,null,null,null,null,null,null,{"$f":"IF(Results!C20=\"\",\"\",Results!B20)","v":""},null,"",null,{"$error":"#VALUE!"},{"$error":"#VALUE!"},{"$error":"#VALUE!"},{"$error":"#VALUE!"},{"$error":"#VALUE!"},{"$error":"#VALUE!"},{"$error":"#VALUE!"},{"$error":"#VALUE!"},{"$error":"#VALUE!"},{"$error":"#VALUE!"}]
[null,null,null,null,null,null,null,null,{"$f":"IF(Results!C21=\"\",\"\",Results!B21)","v":""},null,"",null,{"$error":"#VALUE!"},{"$error":"#VALUE!"},{"$error":"#VALUE!"},{"$error":"#VALUE!"},{"$error":"#VALUE!"},{"$error":"#VALUE!"},{"$error":"#VALUE!"},{"$error":"#VALUE!"},{"$error":"#VALUE!"},{"$error":"#VALUE!"}]
[null,null,null,null,null,null,null,null,{"$f":"IF(Results!C22=\"\",\"\",Results!B22)","v":""},null,"",null,{"$error":"#VALUE!"},{"$error":"#VALUE!"},{"$error":"#VALUE!"},{"$error":"#VALUE!"},{"$error":"#VALUE!"},{"$error":"#VALUE!"},{"$error":"#VALUE!"},{"$error":"#VALUE!"},{"$error":"#VALUE!"},{"$error":"#VALUE!"}]
[null,null,null,null,null,null,null,null,{"$f":"IF(Results!C23=\"\",\"\",Results!B23)","v":""},null,"",null,{"$error":"#VALUE!"},{"$error":"#VALUE!"},{"$error":"#VALUE!"},{"$error":"#VALUE!"},{"$error":"#VALUE!"},{"$error":"#VALUE!"},{"$error":"#VALUE!"},{"$error":"#VALUE!"},{"$error":"#VALUE!"},{"$error":"#VALUE!"}]
[null,null,null,null,null,null,null,null,{"$f":"IF(Results!C24=\"\",\"\",Results!B24)","v":""},null,"",null,{"$f":"SEARCH($C$6,J24)","v":{"$error":"#VALUE!"}},{"$f":"SEARCH($D$6,J24)","v":{"$error":"#VALUE!"}},{"$f":"SEARCH($E$6,J24)","v":{"$error":"#VALUE!"}},{"$f":"SEARCH($F$6,J24)","v":{"$error":"#VALUE!"}},{"$f":"IF((N24-M24)<0,$C$8,0)","v":{"$error":"#VALUE!"}},{"$f":"IF((O24-M24)<0,$C$8+$D$8,0)","v":{"$error":"#VALUE!"}},{"$f":"IF((P24-M24)<0,$C$8+$D$8+$E$8,0)","v":{"$error":"#VALUE!"}},{"$f":"IF((O24-N24)<0,$D$8,0)","v":{"$error":"#VALUE!"}},{"$f":"IF((P24-N24)<0,$D$8+$E$8,0)","v":{"$error":"#VALUE!"}},{"$f":"IF((P24-O24)<0,$E$8,0)","v":{"$error":"#VALUE!"}}]
[null,null,null,null,null,null,null,null,{"$f":"IF(Results!C25=\"\",\"\",Results!B25)","v":""},null,"",null,{"$error":"#VALUE!"},{"$error":"#VALUE!"},{"$error":"#VALUE!"},{"$error":"#VALUE!"},{"$error":"#VALUE!"},{"$error":"#VALUE!"},{"$error":"#VALUE!"},{"$error":"#VALUE!"},{"$error":"#VALUE!"},{"$error":"#VALUE!"}]
[null,null,null,null,null,null,null,null,{"$f":"IF(Results!C26=\"\",\"\",Results!B26)","v":""},null,"",null,{"$error":"#VALUE!"},{"$error":"#VALUE!"},{"$error":"#VALUE!"},{"$error":"#VALUE!"},{"$error":"#VALUE!"},{"$error":"#VALUE!"},{"$error":"#VALUE!"},{"$error":"#VALUE!"},{"$error":"#VALUE!"},{"$error":"#VALUE!"}]
[null,null,null,null,null,null,null,null,{"$f":"IF(Results!C27=\"\",\"\",Results!B27)","v":""},null,"",null,{"$error":"#VALUE!"},{"$error":"#VALUE!"},{"$error":"#VALUE!"},{"$error":"#VALUE!"},{"$error":"#VALUE!"},{"$error":"#VALUE!"},{"$error":"#VALUE!"},{"$error":"#VALUE!"},{"$error":"#VALUE!"},{"$error":"#VALUE!"}]
[null,null,null,null,null,null,null,null,{"$f":"IF(Results!C28=\"\",\"\",Results!B28)","v":""},null,"",null,{"$error":"#VALUE!"},{"$error":"#VALUE!"},{"$error":"#VALUE!"},{"$error":"#VALUE!"},{"$error":"#VALUE!"},{"$error":"#VALUE!"},{"$error":"#VALUE!"},{"$error":"#VALUE!"},{"$error":"#VALUE!"},{"$error":"#VALUE!"}]
[null,null,null,null,null,null,null,null,{"$f":"IF(Results!C29=\"\",\"\",Results!B29)","v":""},null,"",null,{"$error":"#VALUE!"},{"$error":"#VALUE!"},{"$error":"#VALUE!"},{"$error":"#VALUE!"},{"$error":"#VALUE!"},{"$error":"#VALUE!"},{"$error":"#VALUE!"},{"$error":"#VALUE!"},{"$error":"#VALUE!"},{"$error":"#VALUE!"}]
[null,null,null,null,null,null,null,null,{"$f":"IF(Results!C30=\"\",\"\",Results!B30)","v":""},null,"",null,{"$error":"#VALUE!"},{"$error":"#VALUE!"},{"$error":"#VALUE!"},{"$error":"#VALUE!"},{"$error":"#VALUE!"},{"$error":"#VALUE!"},{"$error":"#VALUE!"},{"$error":"#VALUE!"},{"$error":"#VALUE!"},{"$error":"#VALUE!"}]
[null,null,null,null,null,null,null,null,{"$f":"IF(Results!C31=\"\",\"\",Results!B31)","v":""},null,"",null,{"$error":"#VALUE!"},{"$error":"#VALUE!"},{"$error":"#VALUE!"},{"$error":"#VALUE!"},{"$error":"#VALUE!"},{"$error":"#VALUE!"},{"$error":"#VALUE!"},{"$error":"#VALUE!"},{"$error":"#VALUE!"},{"$error":"#VALUE!"}]
[null,null,null,null,null,null,null,null,{"$f":"IF(Results!C32=\"\",\"\",Results!B32)","v":""},null,"",null,{"$error":"#VALUE!"},{"$error":"#VALUE!"},{"$error":"#VALUE!"},{"$error":"#VALUE!"},{"$error":"#VALUE!"},{"$error":"#VALUE!"},{"$error":"#VALUE!"},{"$error":"#VALUE!"},{"$error":"#VALUE!"},{"$error":"#VALUE!"}]
[null,null,null,null,null,null,null,null,{"$f":"IF(Results!C33=\"\",\"\",Results!B33)","v":""},null,"",null,{"$error":"#VALUE!"},{"$error":"#VALUE!"},{"$error":"#VALUE!"},{"$error":"#VALUE!"},{"$error":"#VALUE!"},{"$error":"#VALUE!"},{"$error":"#VALUE!"},{"$error":"#VALUE!"},{"$error":"#VALUE!"},{"$error":"#VALUE!"}]
[null,null,null,null,null,null,null,null,{"$f":"IF(Results!C34=\"\",\"\",Results!B34)","v":""},null,{"$f":"IF($C$6=\"\",\"\",IF(I34=\"\",\"\",50-SUM(Q34:V34)))","v":""},null,{"$f":"SEARCH($C$6,J34)","v":{"$error":"#VALUE!"}},{"$f":"SEARCH($D$6,J34)","v":{"$error":"#VALUE!"}},{"$f":"SEARCH($E$6,J34)","v":{"$error":"#VALUE!"}},{"$f":"SEARCH($F$6,J34)","v":{"$error":"#VALUE!"}},{"$f":"IF((N34-M34)<0,$C$8,0)","v":{"$error":"#VALUE!"}},{"$f":"IF((O34-M34)<0,$C$8+$D$8,0)","v":{"$error":"#VALUE!"}},{"$f":"IF((P34-M34)<0,$C$8+$D$8+$E$8,0)","v":{"$error":"#VALUE!"}},{"$f":"IF((O34-N34)<0,$D$8,0)","v":{"$error":"#VALUE!"}},{"$f":"IF((P34-N34)<0,$D$8+$E$8,0)","v":{"$error":"#VALUE!"}},{"$f":"IF((P34-O34)<0,$E$8,0)","v":{"$error":"#VALUE!"}}]
[null,null,null,null,null,null,null,null,{"$f":"IF(Results!C35=\"\",\"\",Results!B35)","v":""},null,"",null,{"$error":"#VALUE!"},{"$error":"#VALUE!"},{"$error":"#VALUE!"},{"$error":"#VALUE!"},{"$error":"#VALUE!"},{"$error":"#VALUE!"},{"$error":"#VALUE!"},{"$error":"#VALUE!"},{"$error":"#VALUE!"},{"$error":"#VALUE!"}]
[null,null,null,null,null,null,null,null,{"$f":"IF(Results!C36=\"\",\"\",Results!B36)","v":""},null,"",null,{"$error":"#VALUE!"},{"$error":"#VALUE!"},{"$error":"#VALUE!"},{"$error":"#VALUE!"},{"$error":"#VALUE!"},{"$error":"#VALUE!"},{"$error":"#VALUE!"},{"$error":"#VALUE!"},{"$error":"#VALUE!"},{"$error":"#VALUE!"}]
[null,null,null,null,null,null,null,null,{"$f":"IF(Results!C37=\"\",\"\",Results!B37)","v":""},null,"",null,{"$error":"#VALUE!"},{"$error":"#VALUE!"},{"$error":"#VALUE!"},{"$error":"#VALUE!"},{"$error":"#VALUE!"},{"$error":"#VALUE!"},{"$error":"#VALUE!"},{"$error":"#VALUE!"},{"$error":"#VALUE!"},{"$error":"#VALUE!"}]
[null,null,null,null,null,null,null,null,{"$f":"IF(Results!C38=\"\",\"\",Results!B38)","v":""},null,"",null,{"$error":"#VALUE!"},{"$error":"#VALUE!"},{"$error":"#VALUE!"},{"$error":"#VALUE!"},{"$error":"#VALUE!"},{"$error":"#VALUE!"},{"$error":"#VALUE!"},{"$error":"#VALUE!"},{"$error":"#VALUE!"},{"$error":"#VALUE!"}]
[null,null,null,null,null,null,null,null,{"$f":"IF(Results!C39=\"\",\"\",Results!B39)","v":""},null,"",null,{"$error":"#VALUE!"},{"$error":"#VALUE!"},{"$error":"#VALUE!"},{"$error":"#VALUE!"},{"$error":"#VALUE!"},{"$error":"#VALUE!"},{"$error":"#VALUE!"},{"$error":"#VALUE!"},{"$error":"#VALUE!"},{"$error":"#VALUE!"}]
[null,null,null,null,null,null,null,null,{"$f":"IF(Results!C40=\"\",\"\",Results!B40)","v":""},null,"",null,{"$error":"#VALUE!"},{"$error":"#VALUE!"},{"$error":"#VALUE!"},{"$error":"#VALUE!"},{"$error":"#VALUE!"},{"$error":"#VALUE!"},{"$error":"#VALUE!"},{"$error":"#VALUE!"},{"$error":"#VALUE!"},{"$error":"#VALUE!"}]
[null,null,null,null,null,null,null,null,{"$f":"IF(Results!C41=\"\",\"\",Results!B41)","v":""},null,"",null,{"$error":"#VALUE!"},{"$error":"#VALUE!"},{"$error":"#VALUE!"},{"$error":"#VALUE!"},{"$error":"#VALUE!"},{"$error":"#VALUE!"},{"$error":"#VALUE!"},{"$error":"#VALUE!"},{"$error":"#VALUE!"},{"$error":"#VALUE!"}]
[null,null,null,null,null,null,null,null,{"$f":"IF(Results!C42=\"\",\"\",Results!B42)","v":""},null,"",null,{"$error":"#VALUE!"},{"$error":"#VALUE!"},{"$error":"#VALUE!"},{"$error":"#VALUE!"},{"$error":"#VALUE!"},{"$error":"#VALUE!"},{"$error":"#VALUE!"},{"$error":"#VALUE!"},{"$error":"#VALUE!"},{"$error":"#VALUE!"}]
[null,null,null,null,null,null,null,null,{"$f":"IF(Results!C43=\"\",\"\",Results!B43)","v":""},null,"",null,{"$error":"#VALUE!"},{"$error":"#VALUE!"},{"$error":"#VALUE!"},{"$error":"#VALUE!"},{"$error":"#VALUE!"},{"$error":"#VALUE!"},{"$error":"#VALUE!"},{"$error":"#VALUE!"},{"$error":"#VALUE!"},{"$error":"#VALUE!"}]
[null,null,null,null,null,null,null,null,{"$f":"IF(Results!C44=\"\",\"\",Results!B44)","v":""},null,"",null,{"$error":"#VALUE!"},{"$error":"#VALUE!"},{"$error":"#VALUE!"},{"$error":"#VALUE!"},{"$error":"#VALUE!"},{"$error":"#VALUE!"},{"$error":"#VALUE!"},{"$error":"#VALUE!"},{"$error":"#VALUE!"},{"$error":"#VALUE!"}]
[null,null,null,null,null,null,null,null,{"$f":"IF(Results!C45=\"\",\"\",Results!B45)","v":""},null,"",null,{"$error":"#VALUE!"},{"$error":"#VALUE!"},{"$error":"#VALUE!"},{"$error":"#VALUE!"},{"$error":"#VALUE!"},{"$error":"#VALUE!"},{"$error":"#VALUE!"},{"$error":"#VALUE!"},{"$error":"#VALUE!"},{"$error":"#VALUE!"}]
[null,null,null,null,null,null,null,null,{"$f":"IF(Results!C46=\"\",\"\",Results!B46)","v":""},null,"",null,{"$error":"#VALUE!"},{"$error":"#VALUE!"},{"$error":"#VALUE!"},{"$error":"#VALUE!"},{"$error":"#VALUE!"},{"$error":"#VALUE!"},{"$error":"#VALUE!"},{"$error":"#VALUE!"},{"$error":"#VALUE!"},{"$error":"#VALUE!"}]
[null,null,null,null,null,null,null,null,{"$f":"IF(Results!C47=\"\",\"\",Results!B47)","v":""},null,"",null,{"$error":"#VALUE!"},{"$error":"#VALUE!"},{"$error":"#VALUE!"},{"$error":"#VALUE!"},{"$error":"#VALUE!"},{"$error":"#VALUE!"},{"$error":"#VALUE!"},{"$error":"#VALUE!"},{"$error":"#VALUE!"},{"$error":"#VALUE!"}]
[null,null,null,null,null,null,null,null,{"$f":"IF(Results!C48=\"\",\"\",Results!B48)","v":""},null,"",null,{"$error":"#VALUE!"},{"$error":"#VALUE!"},{"$error":"#VALUE!"},{"$error":"#VALUE!"},{"$error":"#VALUE!"},{"$error":"#VALUE!"},{"$error":"#VALUE!"},{"$error":"#VALUE!"},{"$error":"#VALUE!"},{"$error":"#VALUE!"}]
[null,null,null,null,null,null,null,null,{"$f":"IF(Results!C49=\"\",\"\",Results!B49)","v":""},null,"",null,{"$error":"#VALUE!"},{"$error":"#VALUE!"},{"$error":"#VALUE!"},{"$error":"#VALUE!"},{"$error":"#VALUE!"},{"$error":"#VALUE!"},{"$error":"#VALUE!"},{"$error":"#VALUE!"},{"$error":"#VALUE!"},{"$error":"#VALUE!"}]
[null,null,null,null,null,null,null,null,{"$f":"IF(Results!C50=\"\",\"\",Results!B50)","v":""},null,"",null,{"$error":"#VALUE!"},{"$error":"#VALUE!"},{"$error":"#VALUE!"},{"$error":"#VALUE!"},{"$error":"#VALUE!"},{"$error":"#VALUE!"},{"$error":"#VALUE!"},{"$error":"#VALUE!"},{"$error":"#VALUE!"},{"$error":"#VALUE!"}]
[null,null,null,null,null,null,null,null,{"$f":"IF(Results!C51=\"\",\"\",Results!B51)","v":""},null,"",null,{"$error":"#VALUE!"},{"$error":"#VALUE!"},{"$error":"#VALUE!"},{"$error":"#VALUE!"},{"$error":"#VALUE!"},{"$error":"#VALUE!"},{"$error":"#VALUE!"},{"$error":"#VALUE!"},{"$error":"#VALUE!"},{"$error":"#VALUE!"}]
[null,null,null,null,null,null,null,null,{"$f":"IF(Results!C52=\"\",\"\",Results!B52)","v":""},null,"",null,{"$error":"#VALUE!"},{"$error":"#VALUE!"},{"$error":"#VALUE!"},{"$error":"#VALUE!"},{"$error":"#VALUE!"},{"$error":"#VALUE!"},{"$error":"#VALUE!"},{"$error":"#VALUE!"},{"$error":"#VALUE!"},{"$error":"#VALUE!"}]
[null,null,null,null,null,null,null,null,{"$f":"IF(Results!C53=\"\",\"\",Results!B53)","v":""},null,"",null,{"$error":"#VALUE!"},{"$error":"#VALUE!"},{"$error":"#VALUE!"},{"$error":"#VALUE!"},{"$error":"#VALUE!"},{"$error":"#VALUE!"},{"$error":"#VALUE!"},{"$error":"#VALUE!"},{"$error":"#VALUE!"},{"$error":"#VALUE!"}]
[null,null,null,null,null,null,null,null,{"$f":"IF(Results!C54=\"\",\"\",Results!B54)","v":""},null,"",null,{"$error":"#VALUE!"},{"$error":"#VALUE!"},{"$error":"#VALUE!"},{"$error":"#VALUE!"},{"$error":"#VALUE!"},{"$error":"#VALUE!"},{"$error":"#VALUE!"},{"$error":"#VALUE!"},{"$error":"#VALUE!"},{"$error":"#VALUE!"}]
[null,null,null,null,null,null,null,null,{"$f":"IF(Results!C55=\"\",\"\",Results!B55)","v":""},null,"",null,{"$error":"#VALUE!"},{"$error":"#VALUE!"},{"$error":"#VALUE!"},{"$error":"#VALUE!"},{"$error":"#VALUE!"},{"$error":"#VALUE!"},{"$error":"#VALUE!"},{"$error":"#VALUE!"},{"$error":"#VALUE!"},{"$error":"#VALUE!"}]
[null,null,null,null,null,null,null,null,{"$f":"IF(Results!C56=\"\",\"\",Results!B56)","v":""},null,"",null,{"$error":"#VALUE!"},{"$error":"#VALUE!"},{"$error":"#VALUE!"},{"$error":"#VALUE!"},{"$error":"#VALUE!"},{"$error":"#VALUE!"},{"$error":"#VALUE!"},{"$error":"#VALUE!"},{"$error":"#VALUE!"},{"$error":"#VALUE!"}]
[null,null,null,null,null,null,null,null,{"$f":"IF(Results!C57=\"\",\"\",Results!B57)","v":""},null,"",null,{"$error":"#VALUE!"},{"$error":"#VALUE!"},{"$error":"#VALUE!"},{"$error":"#VALUE!"},{"$error":"#VALUE!"},{"$error":"#VALUE!"},{"$error":"#VALUE!"},{"$error":"#VALUE!"},{"$error":"#VALUE!"},{"$error":"#VALUE!"}]
[null,null,null,null,null,null,null,null,{"$f":"IF(Results!C58=\"\",\"\",Results!B58)","v":""},null,"",null,{"$error":"#VALUE!"},{"$error":"#VALUE!"},{"$error":"#VALUE!"},{"$error":"#VALUE!"},{"$error":"#VALUE!"},{"$error":"#VALUE!"},{"$error":"#VALUE!"},{"$error":"#VALUE!"},{"$error":"#VALUE!"},{"$error":"#VALUE!"}]
[null,null,null,null,null,null,null,null,{"$f":"IF(Results!C59=\"\",\"\",Results!B59)","v":""},null,"",null,{"$error":"#VALUE!"},{"$error":"#VALUE!"},{"$error":"#VALUE!"},{"$error":"#VALUE!"},{"$error":"#VALUE!"},{"$error":"#VALUE!"},{"$error":"#VALUE!"},{"$error":"#VALUE!"},{"$error":"#VALUE!"},{"$error":"#VALUE!"}]
[null,null,null,null,null,null,null,null,{"$f":"IF(Results!C60=\"\",\"\",Results!B60)","v":""},null,"",null,{"$error":"#VALUE!"},{"$error":"#VALUE!"},{"$error":"#VALUE!"},{"$error":"#VALUE!"},{"$error":"#VALUE!"},{"$error":"#VALUE!"},{"$error":"#VALUE!"},{"$error":"#VALUE!"},{"$error":"#VALUE!"},{"$error":"#VALUE!"}]
[null,null,null,null,null,null,null,null,{"$f":"IF(Results!C61=\"\",\"\",Results!B61)","v":""},null,"",null,{"$error":"#VALUE!"},{"$error":"#VALUE!"},{"$error":"#VALUE!"},{"$error":"#VALUE!"},{"$error":"#VALUE!"},{"$error":"#VALUE!"},{"$error":"#VALUE!"},{"$error":"#VALUE!"},{"$error":"#VALUE!"},{"$error":"#VALUE!"}]
[null,null,null,null,null,null,null,null,{"$f":"IF(Results!C62=\"\",\"\",Results!B62)","v":""},null,"",null,{"$error":"#VALUE!"},{"$error":"#VALUE!"},{"$error":"#VALUE!"},{"$error":"#VALUE!"},{"$error":"#VALUE!"},{"$error":"#VALUE!"},{"$error":"#VALUE!"},{"$error":"#VALUE!"},{"$error":"#VALUE!"},{"$error":"#VALUE!"}]
[null,null,null,null,null,null,null,null,{"$f":"IF(Results!C63=\"\",\"\",Results!B63)","v":""},null,"",null,{"$error":"#VALUE!"},{"$error":"#VALUE!"},{"$error":"#VALUE!"},{"$error":"#VALUE!"},{"$error":"#VALUE!"},{"$error":"#VALUE!"},{"$error":"#VALUE!"},{"$error":"#VALUE!"},{"$error":"#VALUE!"},{"$error":"#VALUE!"}]
[null,null,null,null,null,null,null,null,{"$f":"IF(Results!C64=\"\",\"\",Results!B64)","v":""},null,"",null,{"$error":"#VALUE!"},{"$error":"#VALUE!"},{"$error":"#VALUE!"},{"$error":"#VALUE!"},{"$error":"#VALUE!"},{"$error":"#VALUE!"},{"$error":"#VALUE!"},{"$error":"#VALUE!"},{"$error":"#VALUE!"},{"$error":"#VALUE!"}]
[null,null,null,null,null,null,null,null,{"$f":"IF(Results!C65=\"\",\"\",Results!B65)","v":""},null,"",null,{"$error":"#VALUE!"},{"$error":"#VALUE!"},{"$error":"#VALUE!"},{"$error":"#VALUE!"},{"$error":"#VALUE!"},{"$error":"#VALUE!"},{"$error":"#VALUE!"},{"$error":"#VALUE!"},{"$error":"#VALUE!"},{"$error":"#VALUE!"}]
[null,null,null,null,null,null,null,null,{"$f":"IF(Results!C66=\"\",\"\",Results!B66)","v":""},null,"",null,{"$error":"#VALUE!"},{"$error":"#VALUE!"},{"$error":"#VALUE!"},{"$error":"#VALUE!"},{"$error":"#VALUE!"},{"$error":"#VALUE!"},{"$error":"#VALUE!"},{"$error":"#VALUE!"},{"$error":"#VALUE!"},{"$error":"#VALUE!"}]
[null,null,null,null,null,null,null,null,{"$f":"IF(Results!C67=\"\",\"\",Results!B67)","v":""},null,"",null,{"$error":"#VALUE!"},{"$error":"#VALUE!"},{"$error":"#VALUE!"},{"$error":"#VALUE!"},{"$error":"#VALUE!"},{"$error":"#VALUE!"},{"$error":"#VALUE!"},{"$error":"#VALUE!"},{"$error":"#VALUE!"},{"$error":"#VALUE!"}]
[null,null,null,null,null,null,null,null,{"$f":"IF(Results!C68=\"\",\"\",Results!B68)","v":""},null,"",null,{"$error":"#VALUE!"},{"$error":"#VALUE!"},{"$error":"#VALUE!"},{"$error":"#VALUE!"},{"$error":"#VALUE!"},{"$error":"#VALUE!"},{"$error":"#VALUE!"},{"$error":"#VALUE!"},{"$error":"#VALUE!"},{"$error":"#VALUE!"}]
[null,null,null,null,null,null,null,null,{"$f":"IF(Results!C69=\"\",\"\",Results!B69)","v":""},null,"",null,{"$error":"#VALUE!"},{"$error":"#VALUE!"},{"$error":"#VALUE!"},{"$error":"#VALUE!"},{"$error":"#VALUE!"},{"$error":"#VALUE!"},{"$error":"#VALUE!"},{"$error":"#VALUE!"},{"$error":"#VALUE!"},{"$error":"#VALUE!"}]
[null,null,null,null,null,null,null,null,{"$f":"IF(Results!C70=\"\",\"\",Results!B70)","v":""},null,"",null,{"$error":"#VALUE!"},{"$error":"#VALUE!"},{"$error":"#VALUE!"},{"$error":"#VALUE!"},{"$error":"#VALUE!"},{"$error":"#VALUE!"},{"$error":"#VALUE!"},{"$error":"#VALUE!"},{"$error":"#VALUE!"},{"$error":"#VALUE!"}]
[null,null,null,null,null,null,null,null,{"$f":"IF(Results!C71=\"\",\"\",Results!B71)","v":""},null,"",null,{"$error":"#VALUE!"},{"$error":"#VALUE!"},{"$error":"#VALUE!"},{"$error":"#VALUE!"},{"$error":"#VALUE!"},{"$error":"#VALUE!"},{"$error":"#VALUE!"},{"$error":"#VALUE!"},{"$error":"#VALUE!"},{"$error":"#VALUE!"}]
[null,null,null,null,null,null,null,null,{"$f":"IF(Results!C72=\"\",\"\",Results!B72)","v":""},null,"",null,{"$error":"#VALUE!"},{"$error":"#VALUE!"},{"$error":"#VALUE!"},{"$error":"#VALUE!"},{"$error":"#VALUE!"},{"$error":"#VALUE!"},{"$error":"#VALUE!"},{"$error":"#VALUE!"},{"$error":"#VALUE!"},{"$error":"#VALUE!"}]
[null,null,null,null,null,null,null,null,{"$f":"IF(Results!C73=\"\",\"\",Results!B73)","v":""},null,"",null,{"$error":"#VALUE!"},{"$error":"#VALUE!"},{"$error":"#VALUE!"},{"$error":"#VALUE!"},{"$error":"#VALUE!"},{"$error":"#VALUE!"},{"$error":"#VALUE!"},{"$error":"#VALUE!"},{"$error":"#VALUE!"},{"$error":"#VALUE!"}]
[null,null,null,null,null,null,null,null,{"$f":"IF(Results!C74=\"\",\"\",Results!B74)","v":""},null,"",null,{"$error":"#VALUE!"},{"$error":"#VALUE!"},{"$error":"#VALUE!"},{"$error":"#VALUE!"},{"$error":"#VALUE!"},{"$error":"#VALUE!"},{"$error":"#VALUE!"},{"$error":"#VALUE!"},{"$error":"#VALUE!"},{"$error":"#VALUE!"}]
[null,null,null,null,null,null,null,null,{"$f":"IF(Results!C75=\"\",\"\",Results!B75)","v":""},null,"",null,{"$error":"#VALUE!"},{"$error":"#VALUE!"},{"$error":"#VALUE!"},{"$error":"#VALUE!"},{"$error":"#VALUE!"},{"$error":"#VALUE!"},{"$error":"#VALUE!"},{"$error":"#VALUE!"},{"$error":"#VALUE!"},{"$error":"#VALUE!"}]
[null,null,null,null,null,null,null,null,{"$f":"IF(Results!C76=\"\",\"\",Results!B76)","v":""},null,"",null,{"$error":"#VALUE!"},{"$error":"#VALUE!"},{"$error":"#VALUE!"},{"$error":"#VALUE!"},{"$error":"#VALUE!"},{"$error":"#VALUE!"},{"$error":"#VALUE!"},{"$error":"#VALUE!"},{"$error":"#VALUE!"},{"$error":"#VALUE!"}]
[null,null,null,null,null,null,null,null,{"$f":"IF(Results!C77=\"\",\"\",Results!B77)","v":""},null,"",null,{"$error":"#VALUE!"},{"$error":"#VALUE!"},{"$error":"#VALUE!"},{"$error":"#VALUE!"},{"$error":"#VALUE!"},{"$error":"#VALUE!"},{"$error":"#VALUE!"},{"$error":"#VALUE!"},{"$error":"#VALUE!"},{"$error":"#VALUE!"}]
[null,null,null,null,null,null,null,null,{"$f":"IF(Results!C78=\"\",\"\",Results!B78)","v":""},null,"",null,{"$error":"#VALUE!"},{"$error":"#VALUE!"},{"$error":"#VALUE!"},{"$error":"#VALUE!"},{"$error":"#VALUE!"},{"$error":"#VALUE!"},{"$error":"#VALUE!"},{"$error":"#VALUE!"},{"$error":"#VALUE!"},{"$error":"#VALUE!"}]
[null,null,null,null,null,null,null,null,{"$f":"IF(Results!C79=\"\",\"\",Results!B79)","v":""},null,"",null,{"$error":"#VALUE!"},{"$error":"#VALUE!"},{"$error":"#VALUE!"},{"$error":"#VALUE!"},{"$error":"#VALUE!"},{"$error":"#VALUE!"},{"$error":"#VALUE!"},{"$error":"#VALUE!"},{"$error":"#VALUE!"},{"$error":"#VALUE!"}]
[null,null,null,null,null,null,null,null,{"$f":"IF(Results!C80=\"\",\"\",Results!B80)","v":""},null,"",null,{"$error":"#VALUE!"},{"$error":"#VALUE!"},{"$error":"#VALUE!"},{"$error":"#VALUE!"},{"$error":"#VALUE!"},{"$error":"#VALUE!"},{"$error":"#VALUE!"},{"$error":"#VALUE!"},{"$error":"#VALUE!"},{"$error":"#VALUE!"}]
[null,null,null,null,null,null,null,null,{"$f":"IF(Results!C81=\"\",\"\",Results!B81)","v":""},null,"",null,{"$error":"#VALUE!"},{"$error":"#VALUE!"},{"$error":"#VALUE!"},{"$error":"#VALUE!"},{"$error":"#VALUE!"},{"$error":"#VALUE!"},{"$error":"#VALUE!"},{"$error":"#VALUE!"},{"$error":"#VALUE!"},{"$error":"#VALUE!"}]
[null,null,null,null,null,null,null,null,{"$f":"IF(Results!C82=\"\",\"\",Results!B82)","v":""},null,"",null,{"$error":"#VALUE!"},{"$error":"#VALUE!"},{"$error":"#VALUE!"},{"$error":"#VALUE!"},{"$error":"#VALUE!"},{"$error":"#VALUE!"},{"$error":"#VALUE!"},{"$error":"#VALUE!"},{"$error":"#VALUE!"},{"$error":"#VALUE!"}]
[null,null,null,null,null,null,null,null,{"$f":"IF(Results!C83=\"\",\"\",Results!B83)","v":""},null,"",null,{"$error":"#VALUE!"},{"$error":"#VALUE!"},{"$error":"#VALUE!"},{"$error":"#VALUE!"},{"$error":"#VALUE!"},{"$error":"#VALUE!"},{"$error":"#VALUE!"},{"$error":"#VALUE!"},{"$error":"#VALUE!"},{"$error":"#VALUE!"}]
[null,null,null,null,null,null,null,null,{"$f":"IF(Results!C84=\"\",\"\",Results!B84)","v":""},null,"",null,{"$error":"#VALUE!"},{"$error":"#VALUE!"},{"$error":"#VALUE!"},{"$error":"#VALUE!"},{"$error":"#VALUE!"},{"$error":"#VALUE!"},{"$error":"#VALUE!"},{"$error":"#VALUE!"},{"$error":"#VALUE!"},{"$error":"#VALUE!"}]
[null,null,null,null,null,null,null,null,{"$f":"IF(Results!C85=\"\",\"\",Results!B85)","v":""},null,"",null,{"$error":"#VALUE!"},{"$error":"#VALUE!"},{"$error":"#VALUE!"},{"$error":"#VALUE!"},{"$error":"#VALUE!"},{"$error":"#VALUE!"},{"$error":"#VALUE!"},{"$error":"#VALUE!"},{"$error":"#VALUE!"},{"$error":"#VALUE!"}]
[null,null,null,null,null,null,null,null,{"$f":"IF(Results!C86=\"\",\"\",Results!B86)","v":""},null,"",null,{"$error":"#VALUE!"},{"$error":"#VALUE!"},{"$error":"#VALUE!"},{"$error":"#VALUE!"},{"$error":"#VALUE!"},{"$error":"#VALUE!"},{"$error":"#VALUE!"},{"$error":"#VALUE!"},{"$error":"#VALUE!"},{"$error":"#VALUE!"}]
[null,null,null,null,null,null,null,null,{"$f":"IF(Results!C87=\"\",\"\",Results!B87)","v":""},null,"",null,{"$error":"#VALUE!"},{"$error":"#VALUE!"},{"$error":"#VALUE!"},{"$error":"#VALUE!"},{"$error":"#VALUE!"},{"$error":"#VALUE!"},{"$error":"#VALUE!"},{"$error":"#VALUE!"},{"$error":"#VALUE!"},{"$error":"#VALUE!"}]
[null,null,null,null,null,null,null,null,{"$f":"IF(Results!C88=\"\",\"\",Results!B88)","v":""},null,"",null,{"$error":"#VALUE!"},{"$error":"#VALUE!"},{"$error":"#VALUE!"},{"$error":"#VALUE!"},{"$error":"#VALUE!"},{"$error":"#VALUE!"},{"$error":"#VALUE!"},{"$error":"#VALUE!"},{"$error":"#VALUE!"},{"$error":"#VALUE!"}]
[null,null,null,null,null,null,null,null,{"$f":"IF(Results!C89=\"\",\"\",Results!B89)","v":""},null,"",null,{"$error":"#VALUE!"},{"$error":"#VALUE!"},{"$error":"#VALUE!"},{"$error":"#VALUE!"},{"$error":"#VALUE!"},{"$error":"#VALUE!"},{"$error":"#VALUE!"},{"$error":"#VALUE!"},{"$error":"#VALUE!"},{"$error":"#VALUE!"}]
[null,null,null,null,null,null,null,null,{"$f":"IF(Results!C90=\"\",\"\",Results!B90)","v":""},null,"",null,{"$error":"#VALUE!"},{"$error":"#VALUE!"},{"$error":"#VALUE!"},{"$error":"#VALUE!"},{"$error":"#VALUE!"},{"$error":"#VALUE!"},{"$error":"#VALUE!"},{"$error":"#VALUE!"},{"$error":"#VALUE!"},{"$error":"#VALUE!"}]
[null,null,null,null,null,null,null,null,{"$f":"IF(Results!C91=\"\",\"\",Results!B91)","v":""},null,"",null,{"$error":"#VALUE!"},{"$error":"#VALUE!"},{"$error":"#VALUE!"},{"$error":"#VALUE!"},{"$error":"#VALUE!"},{"$error":"#VALUE!"},{"$error":"#VALUE!"},{"$error":"#VALUE!"},{"$error":"#VALUE!"},{"$error":"#VALUE!"}]
[null,null,null,null,null,null,null,null,{"$f":"IF(Results!C92=\"\",\"\",Results!B92)","v":""},null,"",null,{"$error":"#VALUE!"},{"$error":"#VALUE!"},{"$error":"#VALUE!"},{"$error":"#VALUE!"},{"$error":"#VALUE!"},{"$error":"#VALUE!"},{"$error":"#VALUE!"},{"$error":"#VALUE!"},{"$error":"#VALUE!"},{"$error":"#VALUE!"}]
[null,null,null,null,null,null,null,null,{"$f":"IF(Results!C93=\"\",\"\",Results!B93)","v":""},null,"",null,{"$error":"#VALUE!"},{"$error":"#VALUE!"},{"$error":"#VALUE!"},{"$error":"#VALUE!"},{"$error":"#VALUE!"},{"$error":"#VALUE!"},{"$error":"#VALUE!"},{"$error":"#VALUE!"},{"$error":"#VALUE!"},{"$error":"#VALUE!"}]
[null,null,null,null,null,null,null,null,{"$f":"IF(Results!C94=\"\",\"\",Results!B94)","v":""},null,"",null,{"$error":"#VALUE!"},{"$error":"#VALUE!"},{"$error":"#VALUE!"},{"$error":"#VALUE!"},{"$error":"#VALUE!"},{"$error":"#VALUE!"},{"$error":"#VALUE!"},{"$error":"#VALUE!"},{"$error":"#VALUE!"},{"$error":"#VALUE!"}]
[null,null,null,null,null,null,null,null,{"$f":"IF(Results!C95=\"\",\"\",Results!B95)","v":""},null,"",null,{"$error":"#VALUE!"},{"$error":"#VALUE!"},{"$error":"#VALUE!"},{"$error":"#VALUE!"},{"$error":"#VALUE!"},{"$error":"#VALUE!"},{"$error":"#VALUE!"},{"$error":"#VALUE!"},{"$error":"#VALUE!"},{"$error":"#VALUE!"}]
[null,null,null,null,null,null,null,null,{"$f":"IF(Results!C96=\"\",\"\",Results!B96)","v":""},null,"",null,{"$error":"#VALUE!"},{"$error":"#VALUE!"},{"$error":"#VALUE!"},{"$error":"#VALUE!"},{"$error":"#VALUE!"},{"$error":"#VALUE!"},{"$error":"#VALUE!"},{"$error":"#VALUE!"},{"$error":"#VALUE!"},{"$error":"#VALUE!"}]
[null,null,null,null,null,null,null,null,{"$f":"IF(Results!C97=\"\",\"\",Results!B97)","v":""},null,"",null,{"$error":"#VALUE!"},{"$error":"#VALUE!"},{"$error":"#VALUE!"},{"$error":"#VALUE!"},{"$error":"#VALUE!"},{"$error":"#VALUE!"},{"$error":"#VALUE!"},{"$error":"#VALUE!"},{"$error":"#VALUE!"},{"$error":"#VALUE!"}]
[null,null,null,null,null,null,null,null,{"$f":"IF(Results!C98=\"\",\"\",Results!B98)","v":""},null,{"$f":"IF($C$6=\"\",\"\",IF(I98=\"\",\"\",50-SUM(Q98:V98)))","v":""},null,{"$f":"SEARCH($C$6,J98)","v":{"$error":"#VALUE!"}},{"$f":"SEARCH($D$6,J98)","v":{"$error":"#VALUE!"}},{"$f":"SEARCH($E$6,J98)","v":{"$error":"#VALUE!"}},{"$f":"SEARCH($F$6,J98)","v":{"$error":"#VALUE!"}},{"$f":"IF((N98-M98)<0,$C$8,0)","v":{"$error":"#VALUE!"}},{"$f":"IF((O98-M98)<0,$C$8+$D$8,0)","v":{"$error":"#VALUE!"}},{"$f":"IF((P98-M98)<0,$C$8+$D$8+$E$8,0)","v":{"$error":"#VALUE!"}},{"$f":"IF((O98-N98)<0,$D$8,0)","v":{"$error":"#VALUE!"}},{"$f":"IF((P98-N98)<0,$D$8+$E$8,0)","v":{"$error":"#VALUE!"}},{"$f":"IF((P98-O98)<0,$E$8,0)","v":{"$error":"#VALUE!"}}]
[null,null,null,null,null,null,null,null,{"$f":"IF(Results!C99=\"\",\"\",Results!B99)","v":""},null,"",null,{"$error":"#VALUE!"},{"$error":"#VALUE!"},{"$error":"#VALUE!"},{"$error":"#VALUE!"},{"$error":"#VALUE!"},{"$error":"#VALUE!"},{"$error":"#VALUE!"},{"$error":"#VALUE!"},{"$error":"#VALUE!"},{"$error":"#VALUE!"}]
[null,null,null,null,null,null,null,null,{"$f":"IF(Results!C100=\"\",\"\",Results!B100)","v":""},null,"",null,{"$error":"#VALUE!"},{"$error":"#VALUE!"},{"$error":"#VALUE!"},{"$error":"#VALUE!"},{"$error":"#VALUE!"},{"$error":"#VALUE!"},{"$error":"#VALUE!"},{"$error":"#VALUE!"},{"$error":"#VALUE!"},{"$error":"#VALUE!"}]
[null,null,null,null,null,null,null,null,{"$f":"IF(Results!C101=\"\",\"\",Results!B101)","v":""},null,"",null,{"$error":"#VALUE!"},{"$error":"#VALUE!"},{"$error":"#VALUE!"},{"$error":"#VALUE!"},{"$error":"#VALUE!"},{"$error":"#VALUE!"},{"$error":"#VALUE!"},{"$error":"#VALUE!"},{"$error":"#VALUE!"},{"$error":"#VALUE!"}]
[null,null,null,null,null,null,null,null,{"$f":"IF(Results!C102=\"\",\"\",Results!B102)","v":""},null,"",null,{"$error":"#VALUE!"},{"$error":"#VALUE!"},{"$error":"#VALUE!"},{"$error":"#VALUE!"},{"$error":"#VALUE!"},{"$error":"#VALUE!"},{"$error":"#VALUE!"},{"$error":"#VALUE!"},{"$error":"#VALUE!"},{"$error":"#VALUE!"}]
[null,null,null,null,null,null,null,null,{"$f":"IF(Results!C103=\"\",\"\",Results!B103)","v":""},null,"",null,{"$error":"#VALUE!"},{"$error":"#VALUE!"},{"$error":"#VALUE!"},{"$error":"#VALUE!"},{"$error":"#VALUE!"},{"$error":"#VALUE!"},{"$error":"#VALUE!"},{"$error":"#VALUE!"},{"$error":"#VALUE!"},{"$error":"#VALUE!"}]
[null,null,null,null,null,null,null,null,{"$f":"IF(Results!C104=\"\",\"\",Results!B104)","v":""},null,{"$f":"IF($C$6=\"\",\"\",IF(I104=\"\",\"\",50-SUM(Q104:V104)))","v":""},null,{"$f":"SEARCH($C$6,J104)","v":{"$error":"#VALUE!"}},{"$f":"SEARCH($D$6,J104)","v":{"$error":"#VALUE!"}},{"$f":"SEARCH($E$6,J104)","v":{"$error":"#VALUE!"}},{"$f":"SEARCH($F$6,J104)","v":{"$error":"#VALUE!"}},{"$f":"IF((N104-M104)<0,$C$8,0)","v":{"$error":"#VALUE!"}},{"$f":"IF((O104-M104)<0,$C$8+$D$8,0)","v":{"$error":"#VALUE!"}},{"$f":"IF((P104-M104)<0,$C$8+$D$8+$E$8,0)","v":{"$error":"#VALUE!"}},{"$f":"IF((O104-N104)<0,$D$8,0)","v":{"$error":"#VALUE!"}},{"$f":"IF((P104-N104)<0,$D$8+$E$8,0)","v":{"$error":"#VALUE!"}},{"$f":"IF((P104-O104)<0,$E$8,0)","v":{"$error":"#VALUE!"}}]
[null,null,null,null,null,null,null,null,{"$f":"IF(Results!C105=\"\",\"\",Results!B105)","v":""},null,"",null,{"$error":"#VALUE!"},{"$error":"#VALUE!"},{"$error":"#VALUE!"},{"$error":"#VALUE!"},{"$error":"#VALUE!"},{"$error":"#VALUE!"},{"$error":"#VALUE!"},{"$error":"#VALUE!"},{"$error":"#VALUE!"},{"$error":"#VALUE!"}]
[null,null,null,null,null,null,null,null,{"$f":"IF(Results!C106=\"\",\"\",Results!B106)","v":""},null,"",null,{"$error":"#VALUE!"},{"$error":"#VALUE!"},{"$error":"#VALUE!"},{"$error":"#VALUE!"},{"$error":"#VALUE!"},{"$error":"#VALUE!"},{"$error":"#VALUE!"},{"$error":"#VALUE!"},{"$error":"#VALUE!"},{"$error":"#VALUE!"}]
[null,null,null,null,null,null,null,null,{"$f":"IF(Results!C107=\"\",\"\",Results!B107)","v":""},null,"",null,{"$error":"#VALUE!"},{"$error":"#VALUE!"},{"$error":"#VALUE!"},{"$error":"#VALUE!"},{"$error":"#VALUE!"},{"$error":"#VALUE!"},{"$error":"#VALUE!"},{"$error":"#VALUE!"},{"$error":"#VALUE!"},{"$error":"#VALUE!"}]
[null,null,null,null,null,null,null,null,{"$f":"IF(Results!C108=\"\",\"\",Results!B108)","v":""},null,"",null,{"$error":"#VALUE!"},{"$error":"#VALUE!"},{"$error":"#VALUE!"},{"$error":"#VALUE!"},{"$error":"#VALUE!"},{"$error":"#VALUE!"},{"$error":"#VALUE!"},{"$error":"#VALUE!"},{"$error":"#VALUE!"},{"$error":"#VALUE!"}]
[null,null,null,null,null,null,null,null,{"$f":"IF(Results!C109=\"\",\"\",Results!B109)","v":""},null,"",null,{"$error":"#VALUE!"},{"$error":"#VALUE!"},{"$error":"#VALUE!"},{"$error":"#VALUE!"},{"$error":"#VALUE!"},{"$error":"#VALUE!"},{"$error":"#VALUE!"},{"$error":"#VALUE!"},{"$error":"#VALUE!"},{"$error":"#VALUE!"}]
[null,null,null,null,null,null,null,null,{"$f":"IF(Results!C110=\"\",\"\",Results!B110)","v":""},null,"",null,{"$error":"#VALUE!"},{"$error":"#VALUE!"},{"$error":"#VALUE!"},{"$error":"#VALUE!"},{"$error":"#VALUE!"},{"$error":"#VALUE!"},{"$error":"#VALUE!"},{"$error":"#VALUE!"},{"$error":"#VALUE!"},{"$error":"#VALUE!"}]
[null,null,null,null,null,null,null,null,{"$f":"IF(Results!C111=\"\",\"\",Results!B111)","v":""},null,"",null,{"$error":"#VALUE!"},{"$error":"#VALUE!"},{"$error":"#VALUE!"},{"$error":"#VALUE!"},{"$error":"#VALUE!"},{"$error":"#VALUE!"},{"$error":"#VALUE!"},{"$error":"#VALUE!"},{"$error":"#VALUE!"},{"$error":"#VALUE!"}]
[null,null,null,null,null,null,null,null,{"$f":"IF(Results!C112=\"\",\"\",Results!B112)","v":""},null,"",null,{"$error":"#VALUE!"},{"$error":"#VALUE!"},{"$error":"#VALUE!"},{"$error":"#VALUE!"},{"$error":"#VALUE!"},{"$error":"#VALUE!"},{"$error":"#VALUE!"},{"$error":"#VALUE!"},{"$error":"#VALUE!"},{"$error":"#VALUE!"}]
[null,null,null,null,null,null,null,null,{"$f":"IF(Results!C113=\"\",\"\",Results!B113)","v":""},null,"",null,{"$error":"#VALUE!"},{"$error":"#VALUE!"},{"$error":"#VALUE!"},{"$error":"#VALUE!"},{"$error":"#VALUE!"},{"$error":"#VALUE!"},{"$error":"#VALUE!"},{"$error":"#VALUE!"},{"$error":"#VALUE!"},{"$error":"#VALUE!"}]
[null,null,null,null,null,null,null,null,{"$f":"IF(Results!C114=\"\",\"\",Results!B114)","v":""},null,"",null,{"$error":"#VALUE!"},{"$error":"#VALUE!"},{"$error":"#VALUE!"},{"$error":"#VALUE!"},{"$error":"#VALUE!"},{"$error":"#VALUE!"},{"$error":"#VALUE!"},{"$error":"#VALUE!"},{"$error":"#VALUE!"},{"$error":"#VALUE!"}]
[null,null,null,null,null,null,null,null,{"$f":"IF(Results!C115=\"\",\"\",Results!B115)","v":""},null,"",null,{"$error":"#VALUE!"},{"$error":"#VALUE!"},{"$error":"#VALUE!"},{"$error":"#VALUE!"},{"$error":"#VALUE!"},{"$error":"#VALUE!"},{"$error":"#VALUE!"},{"$error":"#VALUE!"},{"$error":"#VALUE!"},{"$error":"#VALUE!"}]
[null,null,null,null,null,null,null,null,{"$f":"IF(Results!C116=\"\",\"\",Results!B116)","v":""},null,"",null,{"$error":"#VALUE!"},{"$error":"#VALUE!"},{"$error":"#VALUE!"},{"$error":"#VALUE!"},{"$error":"#VALUE!"},{"$error":"#VALUE!"},{"$error":"#VALUE!"},{"$error":"#VALUE!"},{"$error":"#VALUE!"},{"$error":"#VALUE!"}]
[null,null,null,null,null,null,null,null,{"$f":"IF(Results!C117=\"\",\"\",Results!B117)","v":""},null,"",null,{"$error":"#VALUE!"},{"$error":"#VALUE!"},{"$error":"#VALUE!"},{"$error":"#VALUE!"},{"$error":"#VALUE!"},{"$error":"#VALUE!"},{"$error":"#VALUE!"},{"$error":"#VALUE!"},{"$error":"#VALUE!"},{"$error":"#VALUE!"}]
[null,null,null,null,null,null,null,null,{"$f":"IF(Results!C118=\"\",\"\",Results!B118)","v":""},null,"",null,{"$error":"#VALUE!"},{"$error":"#VALUE!"},{"$error":"#VALUE!"},{"$error":"#VALUE!"},{"$error":"#VALUE!"},{"$error":"#VALUE!"},{"$error":"#VALUE!"},{"$error":"#VALUE!"},{"$error":"#VALUE!"},{"$error":"#VALUE!"}]
[null,null,null,null,null,null,null,null,{"$f":"IF(Results!C119=\"\",\"\",Results!B119)","v":""},null,"",null,{"$error":"#VALUE!"},{"$error":"#VALUE!"},{"$error":"#VALUE!"},{"$error":"#VALUE!"},{"$error":"#VALUE!"},{"$error":"#VALUE!"},{"$error":"#VALUE!"},{"$error":"#VALUE!"},{"$error":"#VALUE!"},{"$error":"#VALUE!"}]
[null,null,null,null,null,null,null,null,{"$f":"IF(Results!C120=\"\",\"\",Results!B120)","v":""},null,"",null,{"$error":"#VALUE!"},{"$error":"#VALUE!"},{"$error":"#VALUE!"},{"$error":"#VALUE!"},{"$error":"#VALUE!"},{"$error":"#VALUE!"},{"$error":"#VALUE!"},{"$error":"#VALUE!"},{"$error":"#VALUE!"},{"$error":"#VALUE!"}]
[null,null,null,null,null,null,null,null,{"$f":"IF(Results!C121=\"\",\"\",Results!B121)","v":""},null,"",null,{"$error":"#VALUE!"},{"$error":"#VALUE!"},{"$error":"#VALUE!"},{"$error":"#VALUE!"},{"$error":"#VALUE!"},{"$error":"#VALUE!"},{"$error":"#VALUE!"},{"$error":"#VALUE!"},{"$error":"#VALUE!"},{"$error":"#VALUE!"}]
[null,null,null,null,null,null,null,null,{"$f":"IF(Results!C122=\"\",\"\",Results!B122)","v":""},null,"",null,{"$error":"#VALUE!"},{"$error":"#VALUE!"},{"$error":"#VALUE!"},{"$error":"#VALUE!"},{"$error":"#VALUE!"},{"$error":"#VALUE!"},{"$error":"#VALUE!"},{"$error":"#VALUE!"},{"$error":"#VALUE!"},{"$error":"#VALUE!"}]
[null,null,null,null,null,null,null,null,{"$f":"IF(Results!C123=\"\",\"\",Results!B123)","v":""},null,"",null,{"$error":"#VALUE!"},{"$error":"#VALUE!"},{"$error":"#VALUE!"},{"$error":"#VALUE!"},{"$error":"#VALUE!"},{"$error":"#VALUE!"},{"$error":"#VALUE!"},{"$error":"#VALUE!"},{"$error":"#VALUE!"},{"$error":"#VALUE!"}]
[null,null,null,null,null,null,null,null,{"$f":"IF(Results!C124=\"\",\"\",Results!B124)","v":""},null,"",null,{"$error":"#VALUE!"},{"$error":"#VALUE!"},{"$error":"#VALUE!"},{"$error":"#VALUE!"},{"$error":"#VALUE!"},{"$error":"#VALUE!"},{"$error":"#VALUE!"},{"$error":"#VALUE!"},{"$error":"#VALUE!"},{"$error":"#VALUE!"}]
[null,null,null,null,null,null,null,null,{"$f":"IF(Results!C125=\"\",\"\",Results!B125)","v":""},null,"",null,{"$error":"#VALUE!"},{"$error":"#VALUE!"},{"$error":"#VALUE!"},{"$error":"#VALUE!"},{"$error":"#VALUE!"},{"$error":"#VALUE!"},{"$error":"#VALUE!"},{"$error":"#VALUE!"},{"$error":"#VALUE!"},{"$error":"#VALUE!"}]
[null,null,null,null,null,null,null,null,{"$f":"IF(Results!C126=\"\",\"\",Results!B126)","v":""},null,"",null,{"$error":"#VALUE!"},{"$error":"#VALUE!"},{"$error":"#VALUE!"},{"$error":"#VALUE!"},{"$error":"#VALUE!"},{"$error":"#VALUE!"},{"$error":"#VALUE!"},{"$error":"#VALUE!"},{"$error":"#VALUE!"},{"$error":"#VALUE!"}]
[null,null,null,null,null,null,null,null,{"$f":"IF(Results!C127=\"\",\"\",Results!B127)","v":""},null,"",null,{"$error":"#VALUE!"},{"$error":"#VALUE!"},{"$error":"#VALUE!"},{"$error":"#VALUE!"},{"$error":"#VALUE!"},{"$error":"#VALUE!"},{"$error":"#VALUE!"},{"$error":"#VALUE!"},{"$error":"#VALUE!"},{"$error":"#VALUE!"}]
[null,null,null,null,null,null,null,null,{"$f":"IF(Results!C128=\"\",\"\",Results!B128)","v":""},null,"",null,{"$error":"#VALUE!"},{"$error":"#VALUE!"},{"$error":"#VALUE!"},{"$error":"#VALUE!"},{"$error":"#VALUE!"},{"$error":"#VALUE!"},{"$error":"#VALUE!"},{"$error":"#VALUE!"},{"$error":"#VALUE!"},{"$error":"#VALUE!"}]
[null,null,null,null,null,null,null,null,{"$f":"IF(Results!C129=\"\",\"\",Results!B129)","v":""},null,"",null,{"$error":"#VALUE!"},{"$error":"#VALUE!"},{"$error":"#VALUE!"},{"$error":"#VALUE!"},{"$error":"#VALUE!"},{"$error":"#VALUE!"},{"$error":"#VALUE!"},{"$error":"#VALUE!"},{"$error":"#VALUE!"},{"$error":"#VALUE!"}]
[null,null,null,null,null,null,null,null,{"$f":"IF(Results!C130=\"\",\"\",Results!B130)","v":""},null,"",null,{"$error":"#VALUE!"},{"$error":"#VALUE!"},{"$error":"#VALUE!"},{"$error":"#VALUE!"},{"$error":"#VALUE!"},{"$error":"#VALUE!"},{"$error":"#VALUE!"},{"$error":"#VALUE!"},{"$error":"#VALUE!"},{"$error":"#VALUE!"}]
[null,null,null,null,null,null,null,null,{"$f":"IF(Results!C131=\"\",\"\",Results!B131)","v":""},null,"",null,{"$error":"#VALUE!"},{"$error":"#VALUE!"},{"$error":"#VALUE!"},{"$error":"#VALUE!"},{"$error":"#VALUE!"},{"$error":"#VALUE!"},{"$error":"#VALUE!"},{"$error":"#VALUE!"},{"$error":"#VALUE!"},{"$error":"#VALUE!"}]
[null,null,null,null,null,null,null,null,{"$f":"IF(Results!C132=\"\",\"\",Results!B132)","v":""},null,"",null,{"$error":"#VALUE!"},{"$error":"#VALUE!"},{"$error":"#VALUE!"},{"$error":"#VALUE!"},{"$error":"#VALUE!"},{"$error":"#VALUE!"},{"$error":"#VALUE!"},{"$error":"#VALUE!"},{"$error":"#VALUE!"},{"$error":"#VALUE!"}]
[null,null,null,null,null,null,null,null,{"$f":"IF(Results!C133=\"\",\"\",Results!B133)","v":""},null,"",null,{"$error":"#VALUE!"},{"$error":"#VALUE!"},{"$error":"#VALUE!"},{"$error":"#VALUE!"},{"$error":"#VALUE!"},{"$error":"#VALUE!"},{"$error":"#VALUE!"},{"$error":"#VALUE!"},{"$error":"#VALUE!"},{"$error":"#VALUE!"}]
[null,null,null,null,null,null,null,null,{"$f":"IF(Results!C134=\"\",\"\",Results!B134)","v":""},null,"",null,{"$error":"#VALUE!"},{"$error":"#VALUE!"},{"$error":"#VALUE!"},{"$error":"#VALUE!"},{"$error":"#VALUE!"},{"$error":"#VALUE!"},{"$error":"#VALUE!"},{"$error":"#VALUE!"},{"$error":"#VALUE!"},{"$error":"#VALUE!"}]
[null,null,null,null,null,null,null,null,{"$f":"IF(Results!C135=\"\",\"\",Results!B135)","v":""},null,"",null,{"$error":"#VALUE!"},{"$error":"#VALUE!"},{"$error":"#VALUE!"},{"$error":"#VALUE!"},{"$error":"#VALUE!"},{"$error":"#VALUE!"},{"$error":"#VALUE!"},{"$error":"#VALUE!"},{"$error":"#VALUE!"},{"$error":"#VALUE!"}]
[null,null,null,null,null,null,null,null,{"$f":"IF(Results!C136=\"\",\"\",Results!B136)","v":""},null,"",null,{"$error":"#VALUE!"},{"$error":"#VALUE!"},{"$error":"#VALUE!"},{"$error":"#VALUE!"},{"$error":"#VALUE!"},{"$error":"#VALUE!"},{"$error":"#VALUE!"},{"$error":"#VALUE!"},{"$error":"#VALUE!"},{"$error":"#VALUE!"}]
[null,null,null,null,null,null,null,null,{"$f":"IF(Results!C137=\"\",\"\",Results!B137)","v":""},null,"",null,{"$error":"#VALUE!"},{"$error":"#VALUE!"},{"$error":"#VALUE!"},{"$error":"#VALUE!"},{"$error":"#VALUE!"},{"$error":"#VALUE!"},{"$error":"#VALUE!"},{"$error":"#VALUE!"},{"$error":"#VALUE!"},{"$error":"#VALUE!"}]
[null,null,null,null,null,null,null,null,{"$f":"IF(Results!C138=\"\",\"\",Results!B138)","v":""},null,"",null,{"$error":"#VALUE!"},{"$error":"#VALUE!"},{"$error":"#VALUE!"},{"$error":"#VALUE!"},{"$error":"#VALUE!"},{"$error":"#VALUE!"},{"$error":"#VALUE!"},{"$error":"#VALUE!"},{"$error":"#VALUE!"},{"$error":"#VALUE!"}]
[null,null,null,null,null,null,null,null,{"$f":"IF(Results!C139=\"\",\"\",Results!B139)","v":""},null,"",null,{"$error":"#VALUE!"},{"$error":"#VALUE!"},{"$error":"#VALUE!"},{"$error":"#VALUE!"},{"$error":"#VALUE!"},{"$error":"#VALUE!"},{"$error":"#VALUE!"},{"$error":"#VALUE!"},{"$error":"#VALUE!"},{"$error":"#VALUE!"}]
[null,null,null,null,null,null,null,null,{"$f":"IF(Results!C140=\"\",\"\",Results!B140)","v":""},null,"",null,{"$error":"#VALUE!"},{"$error":"#VALUE!"},{"$error":"#VALUE!"},{"$error":"#VALUE!"},{"$error":"#VALUE!"},{"$error":"#VALUE!"},{"$error":"#VALUE!"},{"$error":"#VALUE!"},{"$error":"#VALUE!"},{"$error":"#VALUE!"}]
[null,null,null,null,null,null,null,null,{"$f":"IF(Results!C141=\"\",\"\",Results!B141)","v":""},null,"",null,{"$error":"#VALUE!"},{"$error":"#VALUE!"},{"$error":"#VALUE!"},{"$error":"#VALUE!"},{"$error":"#VALUE!"},{"$error":"#VALUE!"},{"$error":"#VALUE!"},{"$error":"#VALUE!"},{"$error":"#VALUE!"},{"$error":"#VALUE!"}]
[null,null,null,null,null,null,null,null,{"$f":"IF(Results!C142=\"\",\"\",Results!B142)","v":""},null,"",null,{"$error":"#VALUE!"},{"$error":"#VALUE!"},{"$error":"#VALUE!"},{"$error":"#VALUE!"},{"$error":"#VALUE!"},{"$error":"#VALUE!"},{"$error":"#VALUE!"},{"$error":"#VALUE!"},{"$error":"#VALUE!"},{"$error":"#VALUE!"}]
[null,null,null,null,null,null,null,null,{"$f":"IF(Results!C143=\"\",\"\",Results!B143)","v":""},null,"",null,{"$error":"#VALUE!"},{"$error":"#VALUE!"},{"$error":"#VALUE!"},{"$error":"#VALUE!"},{"$error":"#VALUE!"},{"$error":"#VALUE!"},{"$error":"#VALUE!"},{"$error":"#VALUE!"},{"$error":"#VALUE!"},{"$error":"#VALUE!"}]
[null,null,null,null,null,null,null,null,{"$f":"IF(Results!C144=\"\",\"\",Results!B144)","v":""},null,"",null,{"$error":"#VALUE!"},{"$error":"#VALUE!"},{"$error":"#VALUE!"},{"$error":"#VALUE!"},{"$error":"#VALUE!"},{"$error":"#VALUE!"},{"$error":"#VALUE!"},{"$error":"#VALUE!"},{"$error":"#VALUE!"},{"$error":"#VALUE!"}]
[null,null,null,null,null,null,null,null,{"$f":"IF(Results!C145=\"\",\"\",Results!B145)","v":""},null,"",null,{"$error":"#VALUE!"},{"$error":"#VALUE!"},{"$error":"#VALUE!"},{"$error":"#VALUE!"},{"$error":"#VALUE!"},{"$error":"#VALUE!"},{"$error":"#VALUE!"},{"$error":"#VALUE!"},{"$error":"#VALUE!"},{"$error":"#VALUE!"}]
[null,null,null,null,null,null,null,null,{"$f":"IF(Results!C146=\"\",\"\",Results!B146)","v":""},null,"",null,{"$error":"#VALUE!"},{"$error":"#VALUE!"},{"$error":"#VALUE!"},{"$error":"#VALUE!"},{"$error":"#VALUE!"},{"$error":"#VALUE!"},{"$error":"#VALUE!"},{"$error":"#VALUE!"},{"$error":"#VALUE!"},{"$error":"#VALUE!"}]
[null,null,null,null,null,null,null,null,{"$f":"IF(Results!C147=\"\",\"\",Results!B147)","v":""},null,{"$f":"IF($C$6=\"\",\"\",IF(I147=\"\",\"\",50-SUM(Q147:V147)))","v":""},null,{"$f":"SEARCH($C$6,J147)","v":{"$error":"#VALUE!"}},{"$f":"SEARCH($D$6,J147)","v":{"$error":"#VALUE!"}},{"$f":"SEARCH($E$6,J147)","v":{"$error":"#VALUE!"}},{"$f":"SEARCH($F$6,J147)","v":{"$error":"#VALUE!"}},{"$f":"IF((N147-M147)<0,$C$8,0)","v":{"$error":"#VALUE!"}},{"$f":"IF((O147-M147)<0,$C$8+$D$8,0)","v":{"$error":"#VALUE!"}},{"$f":"IF((P147-M147)<0,$C$8+$D$8+$E$8,0)","v":{"$error":"#VALUE!"}},{"$f":"IF((O147-N147)<0,$D$8,0)","v":{"$error":"#VALUE!"}},{"$f":"IF((P147-N147)<0,$D$8+$E$8,0)","v":{"$error":"#VALUE!"}},{"$f":"IF((P147-O147)<0,$E$8,0)","v":{"$error":"#VALUE!"}}]
[null,null,null,null,null,null,null,null,{"$f":"IF(Results!C148=\"\",\"\",Results!B148)","v":""},null,"",null,{"$error":"#VALUE!"},{"$error":"#VALUE!"},{"$error":"#VALUE!"},{"$error":"#VALUE!"},{"$error":"#VALUE!"},{"$error":"#VALUE!"},{"$error":"#VALUE!"},{"$error":"#VALUE!"},{"$error":"#VALUE!"},{"$error":"#VALUE!"}]
[null,null,null,null,null,null,null,null,{"$f":"IF(Results!C149=\"\",\"\",Results!B149)","v":""},null,"",null,{"$error":"#VALUE!"},{"$error":"#VALUE!"},{"$error":"#VALUE!"},{"$error":"#VALUE!"},{"$error":"#VALUE!"},{"$error":"#VALUE!"},{"$error":"#VALUE!"},{"$error":"#VALUE!"},{"$error":"#VALUE!"},{"$error":"#VALUE!"}]
[null,null,null,null,null,null,null,null,{"$f":"IF(Results!C150=\"\",\"\",Results!B150)","v":""},null,"",null,{"$error":"#VALUE!"},{"$error":"#VALUE!"},{"$error":"#VALUE!"},{"$error":"#VALUE!"},{"$error":"#VALUE!"},{"$error":"#VALUE!"},{"$error":"#VALUE!"},{"$error":"#VALUE!"},{"$error":"#VALUE!"},{"$error":"#VALUE!"}]
[null,null,null,null,null,null,null,null,{"$f":"IF(Results!C151=\"\",\"\",Results!B151)","v":""},null,"",null,{"$error":"#VALUE!"},{"$error":"#VALUE!"},{"$error":"#VALUE!"},{"$error":"#VALUE!"},{"$error":"#VALUE!"},{"$error":"#VALUE!"},{"$error":"#VALUE!"},{"$error":"#VALUE!"},{"$error":"#VALUE!"},{"$error":"#VALUE!"}]
[null,null,null,null,null,null,null,null,{"$f":"IF(Results!C152=\"\",\"\",Results!B152)","v":""},null,"",null,{"$error":"#VALUE!"},{"$error":"#VALUE!"},{"$error":"#VALUE!"},{"$error":"#VALUE!"},{"$error":"#VALUE!"},{"$error":"#VALUE!"},{"$error":"#VALUE!"},{"$error":"#VALUE!"},{"$error":"#VALUE!"},{"$error":"#VALUE!"}]
[null,null,null,null,null,null,null,null,{"$f":"IF(Results!C153=\"\",\"\",Results!B153)","v":""},null,"",null,{"$error":"#VALUE!"},{"$error":"#VALUE!"},{"$error":"#VALUE!"},{"$error":"#VALUE!"},{"$error":"#VALUE!"},{"$error":"#VALUE!"},{"$error":"#VALUE!"},{"$error":"#VALUE!"},{"$error":"#VALUE!"},{"$error":"#VALUE!"}]
[null,null,null,null,null,null,null,null,{"$f":"IF(Results!C154=\"\",\"\",Results!B154)","v":""},null,"",null,{"$error":"#VALUE!"},{"$error":"#VALUE!"},{"$error":"#VALUE!"},{"$error":"#VALUE!"},{"$error":"#VALUE!"},{"$error":"#VALUE!"},{"$error":"#VALUE!"},{"$error":"#VALUE!"},{"$error":"#VALUE!"},{"$error":"#VALUE!"}]
[null,null,null,null,null,null,null,null,{"$f":"IF(Results!C155=\"\",\"\",Results!B155)","v":""},null,"",null,{"$error":"#VALUE!"},{"$error":"#VALUE!"},{"$error":"#VALUE!"},{"$error":"#VALUE!"},{"$error":"#VALUE!"},{"$error":"#VALUE!"},{"$error":"#VALUE!"},{"$error":"#VALUE!"},{"$error":"#VALUE!"},{"$error":"#VALUE!"}]
[null,null,null,null,null,null,null,null,{"$f":"IF(Results!C156=\"\",\"\",Results!B156)","v":""},null,"",null,{"$error":"#VALUE!"},{"$error":"#VALUE!"},{"$error":"#VALUE!"},{"$error":"#VALUE!"},{"$error":"#VALUE!"},{"$error":"#VALUE!"},{"$error":"#VALUE!"},{"$error":"#VALUE!"},{"$error":"#VALUE!"},{"$error":"#VALUE!"}]
[null,null,null,null,null,null,null,null,{"$f":"IF(Results!C157=\"\",\"\",Results!B157)","v":""},null,"",null,{"$error":"#VALUE!"},{"$error":"#VALUE!"},{"$error":"#VALUE!"},{"$error":"#VALUE!"},{"$error":"#VALUE!"},{"$error":"#VALUE!"},{"$error":"#VALUE!"},{"$error":"#VALUE!"},{"$error":"#VALUE!"},{"$error":"#VALUE!"}]
[null,null,null,null,null,null,null,null,{"$f":"IF(Results!C158=\"\",\"\",Results!B158)","v":""},null,"",null,{"$error":"#VALUE!"},{"$error":"#VALUE!"},{"$error":"#VALUE!"},{"$error":"#VALUE!"},{"$error":"#VALUE!"},{"$error":"#VALUE!"},{"$error":"#VALUE!"},{"$error":"#VALUE!"},{"$error":"#VALUE!"},{"$error":"#VALUE!"}]
[null,null,null,null,null,null,null,null,{"$f":"IF(Results!C159=\"\",\"\",Results!B159)","v":""},null,"",null,{"$error":"#VALUE!"},{"$error":"#VALUE!"},{"$error":"#VALUE!"},{"$error":"#VALUE!"},{"$error":"#VALUE!"},{"$error":"#VALUE!"},{"$error":"#VALUE!"},{"$error":"#VALUE!"},{"$error":"#VALUE!"},{"$error":"#VALUE!"}]
[null,null,null,null,null,null,null,null,{"$f":"IF(Results!C160=\"\",\"\",Results!B160)","v":""},null,"",null,{"$error":"#VALUE!"},{"$error":"#VALUE!"},{"$error":"#VALUE!"},{"$error":"#VALUE!"},{"$error":"#VALUE!"},{"$error":"#VALUE!"},{"$error":"#VALUE!"},{"$error":"#VALUE!"},{"$error":"#VALUE!"},{"$error":"#VALUE!"}]
[null,null,null,null,null,null,null,null,{"$f":"IF(Results!C161=\"\",\"\",Results!B161)","v":""},null,"",null,{"$error":"#VALUE!"},{"$error":"#VALUE!"},{"$error":"#VALUE!"},{"$error":"#VALUE!"},{"$error":"#VALUE!"},{"$error":"#VALUE!"},{"$error":"#VALUE!"},{"$error":"#VALUE!"},{"$error":"#VALUE!"},{"$error":"#VALUE!"}]
[null,null,null,null,null,null,null,null,{"$f":"IF(Results!C162=\"\",\"\",Results!B162)","v":""},null,"",null,{"$error":"#VALUE!"},{"$error":"#VALUE!"},{"$error":"#VALUE!"},{"$error":"#VALUE!"},{"$error":"#VALUE!"},{"$error":"#VALUE!"},{"$error":"#VALUE!"},{"$error":"#VALUE!"},{"$error":"#VALUE!"},{"$error":"#VALUE!"}]
[null,null,null,null,null,null,null,null,{"$f":"IF(Results!C163=\"\",\"\",Results!B163)","v":""},null,"",null,{"$error":"#VALUE!"},{"$error":"#VALUE!"},{"$error":"#VALUE!"},{"$error":"#VALUE!"},{"$error":"#VALUE!"},{"$error":"#VALUE!"},{"$error":"#VALUE!"},{"$error":"#VALUE!"},{"$error":"#VALUE!"},{"$error":"#VALUE!"}]
[null,null,null,null,null,null,null,null,{"$f":"IF(Results!C164=\"\",\"\",Results!B164)","v":""},null,"",null,{"$error":"#VALUE!"},{"$error":"#VALUE!"},{"$error":"#VALUE!"},{"$error":"#VALUE!"},{"$error":"#VALUE!"},{"$error":"#VALUE!"},{"$error":"#VALUE!"},{"$error":"#VALUE!"},{"$error":"#VALUE!"},{"$error":"#VALUE!"}]
[null,null,null,null,null,null,null,null,{"$f":"IF(Results!C165=\"\",\"\",Results!B165)","v":""},null,"",null,{"$error":"#VALUE!"},{"$error":"#VALUE!"},{"$error":"#VALUE!"},{"$error":"#VALUE!"},{"$error":"#VALUE!"},{"$error":"#VALUE!"},{"$error":"#VALUE!"},{"$error":"#VALUE!"},{"$error":"#VALUE!"},{"$error":"#VALUE!"}]
[null,null,null,null,null,null,null,null,{"$f":"IF(Results!C166=\"\",\"\",Results!B166)","v":""},null,"",null,{"$error":"#VALUE!"},{"$error":"#VALUE!"},{"$error":"#VALUE!"},{"$error":"#VALUE!"},{"$error":"#VALUE!"},{"$error":"#VALUE!"},{"$error":"#VALUE!"},{"$error":"#VALUE!"},{"$error":"#VALUE!"},{"$error":"#VALUE!"}]
[null,null,null,null,null,null,null,null,{"$f":"IF(Results!C167=\"\",\"\",Results!B167)","v":""},null,"",null,{"$error":"#VALUE!"},{"$error":"#VALUE!"},{"$error":"#VALUE!"},{"$error":"#VALUE!"},{"$error":"#VALUE!"},{"$error":"#VALUE!"},{"$error":"#VALUE!"},{"$error":"#VALUE!"},{"$error":"#VALUE!"},{"$error":"#VALUE!"}]
[null,null,null,null,null,null,null,null,{"$f":"IF(Results!C168=\"\",\"\",Results!B168)","v":""},null,"",null,{"$error":"#VALUE!"},{"$error":"#VALUE!"},{"$error":"#VALUE!"},{"$error":"#VALUE!"},{"$error":"#VALUE!"},{"$error":"#VALUE!"},{"$error":"#VALUE!"},{"$error":"#VALUE!"},{"$error":"#VALUE!"},{"$error":"#VALUE!"}]
[null,null,null,null,null,null,null,null,{"$f":"IF(Results!C169=\"\",\"\",Results!B169)","v":""},null,"",null,{"$error":"#VALUE!"},{"$error":"#VALUE!"},{"$error":"#VALUE!"},{"$error":"#VALUE!"},{"$error":"#VALUE!"},{"$error":"#VALUE!"},{"$error":"#VALUE!"},{"$error":"#VALUE!"},{"$error":"#VALUE!"},{"$error":"#VALUE!"}]
[null,null,null,null,null,null,null,null,{"$f":"IF(Results!C170=\"\",\"\",Results!B170)","v":""},null,"",null,{"$error":"#VALUE!"},{"$error":"#VALUE!"},{"$error":"#VALUE!"},{"$error":"#VALUE!"},{"$error":"#VALUE!"},{"$error":"#VALUE!"},{"$error":"#VALUE!"},{"$error":"#VALUE!"},{"$error":"#VALUE!"},{"$error":"#VALUE!"}]
[null,null,null,null,null,null,null,null,{"$f":"IF(Results!C171=\"\",\"\",Results!B171)","v":""},null,"",null,{"$error":"#VALUE!"},{"$error":"#VALUE!"},{"$error":"#VALUE!"},{"$error":"#VALUE!"},{"$error":"#VALUE!"},{"$error":"#VALUE!"},{"$error":"#VALUE!"},{"$error":"#VALUE!"},{"$error":"#VALUE!"},{"$error":"#VALUE!"}]
[null,null,null,null,null,null,null,null,{"$f":"IF(Results!C172=\"\",\"\",Results!B172)","v":""},null,"",null,{"$error":"#VALUE!"},{"$error":"#VALUE!"},{"$error":"#VALUE!"},{"$error":"#VALUE!"},{"$error":"#VALUE!"},{"$error":"#VALUE!"},{"$error":"#VALUE!"},{"$error":"#VALUE!"},{"$error":"#VALUE!"},{"$error":"#VALUE!"}]
[null,null,null,null,null,null,null,null,{"$f":"IF(Results!C173=\"\",\"\",Results!B173)","v":""},null,"",null,{"$error":"#VALUE!"},{"$error":"#VALUE!"},{"$error":"#VALUE!"},{"$error":"#VALUE!"},{"$error":"#VALUE!"},{"$error":"#VALUE!"},{"$error":"#VALUE!"},{"$error":"#VALUE!"},{"$error":"#VALUE!"},{"$error":"#VALUE!"}]
[null,null,null,null,null,null,null,null,{"$f":"IF(Results!C174=\"\",\"\",Results!B174)","v":""},null,"",null,{"$error":"#VALUE!"},{"$error":"#VALUE!"},{"$error":"#VALUE!"},{"$error":"#VALUE!"},{"$error":"#VALUE!"},{"$error":"#VALUE!"},{"$error":"#VALUE!"},{"$error":"#VALUE!"},{"$error":"#VALUE!"},{"$error":"#VALUE!"}]
[null,null,null,null,null,null,null,null,{"$f":"IF(Results!C175=\"\",\"\",Results!B175)","v":""},null,"",null,{"$error":"#VALUE!"},{"$error":"#VALUE!"},{"$error":"#VALUE!"},{"$error":"#VALUE!"},{"$error":"#VALUE!"},{"$error":"#VALUE!"},{"$error":"#VALUE!"},{"$error":"#VALUE!"},{"$error":"#VALUE!"},{"$error":"#VALUE!"}]
[null,null,null,null,null,null,null,null,{"$f":"IF(Results!C176=\"\",\"\",Results!B176)","v":""},null,"",null,{"$error":"#VALUE!"},{"$error":"#VALUE!"},{"$error":"#VALUE!"},{"$error":"#VALUE!"},{"$error":"#VALUE!"},{"$error":"#VALUE!"},{"$error":"#VALUE!"},{"$error":"#VALUE!"},{"$error":"#VALUE!"},{"$error":"#VALUE!"}]
[null,null,null,null,null,null,null,null,{"$f":"IF(Results!C177=\"\",\"\",Results!B177)","v":""},null,"",null,{"$error":"#VALUE!"},{"$error":"#VALUE!"},{"$error":"#VALUE!"},{"$error":"#VALUE!"},{"$error":"#VALUE!"},{"$error":"#VALUE!"},{"$error":"#VALUE!"},{"$error":"#VALUE!"},{"$error":"#VALUE!"},{"$error":"#VALUE!"}]
[null,null,null,null,null,null,null,null,{"$f":"IF(Results!C178=\"\",\"\",Results!B178)","v":""},null,"",null,{"$error":"#VALUE!"},{"$error":"#VALUE!"},{"$error":"#VALUE!"},{"$error":"#VALUE!"},{"$error":"#VALUE!"},{"$error":"#VALUE!"},{"$error":"#VALUE!"},{"$error":"#VALUE!"},{"$error":"#VALUE!"},{"$error":"#VALUE!"}]
[null,null,null,null,null,null,null,null,{"$f":"IF(Results!C179=\"\",\"\",Results!B179)","v":""},null,"",null,{"$error":"#VALUE!"},{"$error":"#VALUE!"},{"$error":"#VALUE!"},{"$error":"#VALUE!"},{"$error":"#VALUE!"},{"$error":"#VALUE!"},{"$error":"#VALUE!"},{"$error":"#VALUE!"},{"$error":"#VALUE!"},{"$error":"#VALUE!"}]
[null,null,null,null,null,null,null,null,{"$f":"IF(Results!C180=\"\",\"\",Results!B180)","v":""},null,"",null,{"$error":"#VALUE!"},{"$error":"#VALUE!"},{"$error":"#VALUE!"},{"$error":"#VALUE!"},{"$error":"#VALUE!"},{"$error":"#VALUE!"},{"$error":"#VALUE!"},{"$error":"#VALUE!"},{"$error":"#VALUE!"},{"$error":"#VALUE!"}]
[null,null,null,null,null,null,null,null,{"$f":"IF(Results!C181=\"\",\"\",Results!B181)","v":""},null,"",null,{"$error":"#VALUE!"},{"$error":"#VALUE!"},{"$error":"#VALUE!"},{"$error":"#VALUE!"},{"$error":"#VALUE!"},{"$error":"#VALUE!"},{"$error":"#VALUE!"},{"$error":"#VALUE!"},{"$error":"#VALUE!"},{"$error":"#VALUE!"}]
[null,null,null,null,null,null,null,null,{"$f":"IF(Results!C182=\"\",\"\",Results!B182)","v":""},null,"",null,{"$error":"#VALUE!"},{"$error":"#VALUE!"},{"$error":"#VALUE!"},{"$error":"#VALUE!"},{"$error":"#VALUE!"},{"$error":"#VALUE!"},{"$error":"#VALUE!"},{"$error":"#VALUE!"},{"$error":"#VALUE!"},{"$error":"#VALUE!"}]
[null,null,null,null,null,null,null,null,{"$f":"IF(Results!C183=\"\",\"\",Results!B183)","v":""},null,"",null,{"$error":"#VALUE!"},{"$error":"#VALUE!"},{"$error":"#VALUE!"},{"$error":"#VALUE!"},{"$error":"#VALUE!"},{"$error":"#VALUE!"},{"$error":"#VALUE!"},{"$error":"#VALUE!"},{"$error":"#VALUE!"},{"$error":"#VALUE!"}]
[null,null,null,null,null,null,null,null,{"$f":"IF(Results!C184=\"\",\"\",Results!B184)","v":""},null,"",null,{"$error":"#VALUE!"},{"$error":"#VALUE!"},{"$error":"#VALUE!"},{"$error":"#VALUE!"},{"$error":"#VALUE!"},{"$error":"#VALUE!"},{"$error":"#VALUE!"},{"$error":"#VALUE!"},{"$error":"#VALUE!"},{"$error":"#VALUE!"}]
[null,null,null,null,null,null,null,null,{"$f":"IF(Results!C185=\"\",\"\",Results!B185)","v":""},null,"",null,{"$error":"#VALUE!"},{"$error":"#VALUE!"},{"$error":"#VALUE!"},{"$error":"#VALUE!"},{"$error":"#VALUE!"},{"$error":"#VALUE!"},{"$error":"#VALUE!"},{"$error":"#VALUE!"},{"$error":"#VALUE!"},{"$error":"#VALUE!"}]
[null,null,null,null,null,null,null,null,{"$f":"IF(Results!C186=\"\",\"\",Results!B186)","v":""},null,"",null,{"$error":"#VALUE!"},{"$error":"#VALUE!"},{"$error":"#VALUE!"},{"$error":"#VALUE!"},{"$error":"#VALUE!"},{"$error":"#VALUE!"},{"$error":"#VALUE!"},{"$error":"#VALUE!"},{"$error":"#VALUE!"},{"$error":"#VALUE!"}]
[null,null,null,null,null,null,null,null,{"$f":"IF(Results!C187=\"\",\"\",Results!B187)","v":""},null,"",null,{"$error":"#VALUE!"},{"$error":"#VALUE!"},{"$error":"#VALUE!"},{"$error":"#VALUE!"},{"$error":"#VALUE!"},{"$error":"#VALUE!"},{"$error":"#VALUE!"},{"$error":"#VALUE!"},{"$error":"#VALUE!"},{"$error":"#VALUE!"}]
[null,null,null,null,null,null,null,null,{"$f":"IF(Results!C188=\"\",\"\",Results!B188)","v":""},null,"",null,{"$error":"#VALUE!"},{"$error":"#VALUE!"},{"$error":"#VALUE!"},{"$error":"#VALUE!"},{"$error":"#VALUE!"},{"$error":"#VALUE!"},{"$error":"#VALUE!"},{"$error":"#VALUE!"},{"$error":"#VALUE!"},{"$error":"#VALUE!"}]
[null,null,null,null,null,null,null,null,{"$f":"IF(Results!C189=\"\",\"\",Results!B189)","v":""},null,"",null,{"$error":"#VALUE!"},{"$error":"#VALUE!"},{"$error":"#VALUE!"},{"$error":"#VALUE!"},{"$error":"#VALUE!"},{"$error":"#VALUE!"},{"$error":"#VALUE!"},{"$error":"#VALUE!"},{"$error":"#VALUE!"},{"$error":"#VALUE!"}]
[null,null,null,null,null,null,null,null,{"$f":"IF(Results!C190=\"\",\"\",Results!B190)","v":""},null,"",null,{"$error":"#VALUE!"},{"$error":"#VALUE!"},{"$error":"#VALUE!"},{"$error":"#VALUE!"},{"$error":"#VALUE!"},{"$error":"#VALUE!"},{"$error":"#VALUE!"},{"$error":"#VALUE!"},{"$error":"#VALUE!"},{"$error":"#VALUE!"}]
[null,null,null,null,null,null,null,null,{"$f":"IF(Results!C191=\"\",\"\",Results!B191)","v":""},null,"",null,{"$error":"#VALUE!"},{"$error":"#VALUE!"},{"$error":"#VALUE!"},{"$error":"#VALUE!"},{"$error":"#VALUE!"},{"$error":"#VALUE!"},{"$error":"#VALUE!"},{"$error":"#VALUE!"},{"$error":"#VALUE!"},{"$error":"#VALUE!"}]
[null,null,null,null,null,null,null,null,{"$f":"IF(Results!C192=\"\",\"\",Results!B192)","v":""},null,"",null,{"$error":"#VALUE!"},{"$error":"#VALUE!"},{"$error":"#VALUE!"},{"$error":"#VALUE!"},{"$error":"#VALUE!"},{"$error":"#VALUE!"},{"$error":"#VALUE!"},{"$error":"#VALUE!"},{"$error":"#VALUE!"},{"$error":"#VALUE!"}]
[null,null,null,null,null,null,null,null,{"$f":"IF(Results!C193=\"\",\"\",Results!B193)","v":""},null,"",null,{"$error":"#VALUE!"},{"$error":"#VALUE!"},{"$error":"#VALUE!"},{"$error":"#VALUE!"},{"$error":"#VALUE!"},{"$error":"#VALUE!"},{"$error":"#VALUE!"},{"$error":"#VALUE!"},{"$error":"#VALUE!"},{"$error":"#VALUE!"}]
[null,null,null,null,null,null,null,null,{"$f":"IF(Results!C194=\"\",\"\",Results!B194)","v":""},null,"",null,{"$error":"#VALUE!"},{"$error":"#VALUE!"},{"$error":"#VALUE!"},{"$error":"#VALUE!"},{"$error":"#VALUE!"},{"$error":"#VALUE!"},{"$error":"#VALUE!"},{"$error":"#VALUE!"},{"$error":"#VALUE!"},{"$error":"#VALUE!"}]
[null,null,null,null,null,null,null,null,{"$f":"IF(Results!C195=\"\",\"\",Results!B195)","v":""},null,"",null,{"$error":"#VALUE!"},{"$error":"#VALUE!"},{"$error":"#VALUE!"},{"$error":"#VALUE!"},{"$error":"#VALUE!"},{"$error":"#VALUE!"},{"$error":"#VALUE!"},{"$error":"#VALUE!"},{"$error":"#VALUE!"},{"$error":"#VALUE!"}]
[null,null,null,null,null,null,null,null,{"$f":"IF(Results!C196=\"\",\"\",Results!B196)","v":""},null,"",null,{"$error":"#VALUE!"},{"$error":"#VALUE!"},{"$error":"#VALUE!"},{"$error":"#VALUE!"},{"$error":"#VALUE!"},{"$error":"#VALUE!"},{"$error":"#VALUE!"},{"$error":"#VALUE!"},{"$error":"#VALUE!"},{"$error":"#VALUE!"}]
[null,null,null,null,null,null,null,null,{"$f":"IF(Results!C197=\"\",\"\",Results!B197)","v":""},null,"",null,{"$error":"#VALUE!"},{"$error":"#VALUE!"},{"$error":"#VALUE!"},{"$error":"#VALUE!"},{"$error":"#VALUE!"},{"$error":"#VALUE!"},{"$error":"#VALUE!"},{"$error":"#VALUE!"},{"$error":"#VALUE!"},{"$error":"#VALUE!"}]
[null,null,null,null,null,null,null,null,{"$f":"IF(Results!C198=\"\",\"\",Results!B198)","v":""},null,"",null,{"$error":"#VALUE!"},{"$error":"#VALUE!"},{"$error":"#VALUE!"},{"$error":"#VALUE!"},{"$error":"#VALUE!"},{"$error":"#VALUE!"},{"$error":"#VALUE!"},{"$error":"#VALUE!"},{"$error":"#VALUE!"},{"$error":"#VALUE!"}]
[null,null,null,null,null,null,null,null,{"$f":"IF(Results!C199=\"\",\"\",Results!B199)","v":""},null,"",null,{"$error":"#VALUE!"},{"$error":"#VALUE!"},{"$error":"#VALUE!"},{"$error":"#VALUE!"},{"$error":"#VALUE!"},{"$error":"#VALUE!"},{"$error":"#VALUE!"},{"$error":"#VALUE!"},{"$error":"#VALUE!"},{"$error":"#VALUE!"}]
[null,null,null,null,null,null,null,null,{"$f":"IF(Results!C200=\"\",\"\",Results!B200)","v":""},null,"",null,{"$error":"#VALUE!"},{"$error":"#VALUE!"},{"$error":"#VALUE!"},{"$error":"#VALUE!"},{"$error":"#VALUE!"},{"$error":"#VALUE!"},{"$error":"#VALUE!"},{"$error":"#VALUE!"},{"$error":"#VALUE!"},{"$error":"#VALUE!"}]
[null,null,null,null,null,null,null,null,{"$f":"IF(Results!C201=\"\",\"\",Results!B201)","v":""},null,"",null,{"$error":"#VALUE!"},{"$error":"#VALUE!"},{"$error":"#VALUE!"},{"$error":"#VALUE!"},{"$error":"#VALUE!"},{"$error":"#VALUE!"},{"$error":"#VALUE!"},{"$error":"#VALUE!"},{"$error":"#VALUE!"},{"$error":"#VALUE!"}]
[null,null,null,null,null,null,null,null,{"$f":"IF(Results!C202=\"\",\"\",Results!B202)","v":""},null,"",null,{"$error":"#VALUE!"},{"$error":"#VALUE!"},{"$error":"#VALUE!"},{"$error":"#VALUE!"},{"$error":"#VALUE!"},{"$error":"#VALUE!"},{"$error":"#VALUE!"},{"$error":"#VALUE!"},{"$error":"#VALUE!"},{"$error":"#VALUE!"}]
[null,null,null,null,null,null,null,null,{"$f":"IF(Results!C203=\"\",\"\",Results!B203)","v":""},null,"",null,{"$error":"#VALUE!"},{"$error":"#VALUE!"},{"$error":"#VALUE!"},{"$error":"#VALUE!"},{"$error":"#VALUE!"},{"$error":"#VALUE!"},{"$error":"#VALUE!"},{"$error":"#VALUE!"},{"$error":"#VALUE!"},{"$error":"#VALUE!"}]

{"sheet":"Group2","index":3,"n_rows":203,"n_cols":22,"rows_kept":203,"cut":false,"hidden":false,"merged":[[1,3,1,8]]}
[]
[null,null,"Group 2 :"]
[null,null,null,null,null,null,null,null,"Entrant No","Placings","Score",null,"J1","J2","J3","J4","PO","QO","RO","QP","RP","RQ"]
[null,null,null,null,null,null,null,null,{"$f":"IF(Results!C4=\"\",\"\",Results!B4)","v":""},null,{"$f":"IF($C$6=\"\",\"\",IF(I4=\"\",\"\",50-SUM(Q4:V4)))","v":""},null,{"$f":"SEARCH($C$6,J4)","v":{"$error":"#VALUE!"}},{"$f":"SEARCH($D$6,J4)","v":{"$error":"#VALUE!"}},{"$f":"SEARCH($E$6,J4)","v":{"$error":"#VALUE!"}},{"$f":"SEARCH($F$6,J4)","v":{"$error":"#VALUE!"}},{"$f":"IF((N4-M4)<0,$C$8,0)","v":{"$error":"#VALUE!"}},{"$f":"IF((O4-M4)<0,$C$8+$D$8,0)","v":{"$error":"#VALUE!"}},{"$f":"IF((P4-M4)<0,$C$8+$D$8+$E$8,0)","v":{"$error":"#VALUE!"}},{"$f":"IF((O4-N4)<0,$D$8,0)","v":{"$error":"#VALUE!"}},{"$f":"IF((P4-N4)<0,$D$8+$E$8,0)","v":{"$error":"#VALUE!"}},{"$f":"IF((P4-O4)<0,$E$8,0)","v":{"$error":"#VALUE!"}}]
[null,null,"Judge's Placings",null,null,null,null,null,{"$f":"IF(Results!C5=\"\",\"\",Results!B5)","v":""},null,{"$f":"IF($C$6=\"\",\"\",IF(I5=\"\",\"\",50-SUM(Q5:V5)))","v":""},null,{"$error":"#VALUE!"},{"$error":"#VALUE!"},{"$error":"#VALUE!"},{"$error":"#VALUE!"},{"$error":"#VALUE!"},{"$error":"#VALUE!"},{"$error":"#VALUE!"},{"$error":"#VALUE!"},{"$error":"#VALUE!"},{"$error":"#VALUE!"}]
[null,null,null,null,null,null,null,null,{"$f":"IF(Results!C6=\"\",\"\",Results!B6)","v":""},null,"",null,{"$error":"#VALUE!"},{"$error":"#VALUE!"},{"$error":"#VALUE!"},{"$error":"#VALUE!"},{"$error":"#VALUE!"},{"$error":"#VALUE!"},{"$error":"#VALUE!"},{"$error":"#VALUE!"},{"$error":"#VALUE!"},{"$error":"#VALUE!"}]
[null,null,"Judge's Cuts",null,null,null,null,null,{"$f":"IF(Results!C7=\"\",\"\",Results!B7)","v":""},null,"",null,{"$error":"#VALUE!"},{"$error":"#VALUE!"},{"$error":"#VALUE!"},{"$error":"#VALUE!"},{"$error":"#VALUE!"},{"$error":"#VALUE!"},{"$error":"#VALUE!"},{"$error":"#VALUE!"},{"$error":"#VALUE!"},{"$error":"#VALUE!"}]
[null,null,null,null,null,null,null,null,{"$f":"IF(Results!C8=\"\",\"\",Results!B8)","v":""},null,"",null,{"$error":"#VALUE!"},{"$error":"#VALUE!"},{"$error":"#VALUE!"},{"$error":"#VALUE!"},{"$error":"#VALUE!"},{"$error":"#VALUE!"},{"$error":"#VALUE!"},{"$error":"#VALUE!"},{"$error":"#VALUE!"},{"$error":"#VALUE!"}]
[null,null,null,null,null,null,null,null,{"$f":"IF(Results!C9=\"\",\"\",Results!B9)","v":""},null,"",null,{"$error":"#VALUE!"},{"$error":"#VALUE!"},{"$error":"#VALUE!"},{"$error":"#VALUE!"},{"$error":"#VALUE!"},{"$error":"#VALUE!"},{"$error":"#VALUE!"},{"$error":"#VALUE!"},{"$error":"#VALUE!"},{"$error":"#VALUE!"}]
[null,null,{"$f":"IF($C$8=\"\",\"\",IF(($C$8+$D$8+$E$8)<3,\"WARNING : Cuts total less than 3\",\"\"))","v":""},null,null,null,null,null,{"$f":"IF(Results!C10=\"\",\"\",Results!B10)","v":""},null,"",null,{"$error":"#VALUE!"},{"$error":"#VALUE!"},{"$error":"#VALUE!"},{"$error":"#VALUE!"},{"$error":"#VALUE!"},{"$error":"#VALUE!"},{"$error":"#VALUE!"},{"$error":"#VALUE!"},{"$error":"#VALUE!"},{"$error":"#VALUE!"}]
[null,null,{"$f":"IF(($C$8+$D$8+$E$8)>15,\"WARNING : Cuts total more than 15\",\"\")","v":""},null,null,null,null,null,{"$f":"IF(Results!C11=\"\",\"\",Results!B11)","v":""},null,"",null,{"$error":"#VALUE!"},{"$error":"#VALUE!"},{"$error":"#VALUE!"},{"$error":"#VALUE!"},{"$error":"#VALUE!"},{"$error":"#VALUE!"},{"$error":"#VALUE!"},{"$error":"#VALUE!"},{"$error":"#VALUE!"},{"$error":"#VALUE!"}]
[null,null,{"$f":"IF(AND(($C$8+$D$8+$E$8)>=15,$D$8>5),\"WARNING : Middle cut more than 5\",\"\")","v":""},null,null,null,null,null,{"$f":"IF(Results!C12=\"\",\"\",Results!B12)","v":""},null,"",null,{"$error":"#VALUE!"},{"$error":"#VALUE!"},{"$error":"#VALUE!"},{"$error":"#VALUE!"},{"$error":"#VALUE!"},{"$error":"#VALUE!"},{"$error":"#VALUE!"},{"$error":"#VALUE!"},{"$error":"#VALUE!"},{"$error":"#VALUE!"}]
[null,null,{"$f":"IF(AND(($C$8+$D$8+$E$8)=14,$D$8>8),\"WARNING : Middle cut more than 8\",\"\")","v":""},null,null,null,null,null,{"$f":"IF(Results!C13=\"\",\"\",Results!B13)","v":""},null,"",null,{"$error":"#VALUE!"},{"$error":"#VALUE!"},{"$error":"#VALUE!"},{"$error":"#VALUE!"},{"$error":"#VALUE!"},{"$error":"#VALUE!"},{"$error":"#VALUE!"},{"$error":"#VALUE!"},{"$error":"#VALUE!"},{"$error":"#VALUE!"}]
[null,null,{"$f":"IF(AND(C10=\"\",C11=\"\",C12=\"\",C13=\"\"),\"\",\"Please discuss with Judge\")","v":""},null,null,null,null,null,{"$f":"IF(Results!C14=\"\",\"\",Results!B14)","v":""},null,"",null,{"$error":"#VALUE!"},{"$error":"#VALUE!"},{"$error":"#VALUE!"},{"$error":"#VALUE!"},{"$error":"#VALUE!"},{"$error":"#VALUE!"},{"$error":"#VALUE!"},{"$error":"#VALUE!"},{"$error":"#VALUE!"},{"$error":"#VALUE!"}]
[null,null,null,null,null,null,null,null,{"$f":"IF(Results!C15=\"\",\"\",Results!B15)","v":""},null,"",null,{"$error":"#VALUE!"},{"$error":"#VALUE!"},{"$error":"#VALUE!"},{"$error":"#VALUE!"},{"$error":"#VALUE!"},{"$error":"#VALUE!"},{"$error":"#VALUE!"},{"$error":"#VALUE!"},{"$error":"#VALUE!"},{"$error":"#VALUE!"}]
[null,null,null,null,null,null,null,null,{"$f":"IF(Results!C16=\"\",\"\",Results!B16)","v":""},null,"",null,{"$error":"#VALUE!"},{"$error":"#VALUE!"},{"$error":"#VALUE!"},{"$error":"#VALUE!"},{"$error":"#VALUE!"},{"$error":"#VALUE!"},{"$error":"#VALUE!"},{"$error":"#VALUE!"},{"$error":"#VALUE!"},{"$error":"#VALUE!"}]
[null,null,null,null,null,null,null,null,{"$f":"IF(Results!C17=\"\",\"\",Results!B17)","v":""},null,"",null,{"$error":"#VALUE!"},{"$error":"#VALUE!"},{"$error":"#VALUE!"},{"$error":"#VALUE!"},{"$error":"#VALUE!"},{"$error":"#VALUE!"},{"$error":"#VALUE!"},{"$error":"#VALUE!"},{"$error":"#VALUE!"},{"$error":"#VALUE!"}]
[null,null,null,null,null,null,null,null,{"$f":"IF(Results!C18=\"\",\"\",Results!B18)","v":""},null,"",null,{"$error":"#VALUE!"},{"$error":"#VALUE!"},{"$error":"#VALUE!"},{"$error":"#VALUE!"},{"$error":"#VALUE!"},{"$error":"#VALUE!"},{"$error":"#VALUE!"},{"$error":"#VALUE!"},{"$error":"#VALUE!"},{"$error":"#VALUE!"}]
[null,null,null,null,null,null,null,null,{"$f":"IF(Results!C19=\"\",\"\",Results!B19)","v":""},null,"",null,{"$error":"#VALUE!"},{"$error":"#VALUE!"},{"$error":"#VALUE!"},{"$error":"#VALUE!"},{"$error":"#VALUE!"},{"$error":"#VALUE!"},{"$error":"#VALUE!"},{"$error":"#VALUE!"},{"$error":"#VALUE!"},{"$error":"#VALUE!"}]
[null,null,null,null,null,null,null,null,{"$f":"IF(Results!C20=\"\",\"\",Results!B20)","v":""},null,"",null,{"$error":"#VALUE!"},{"$error":"#VALUE!"},{"$error":"#VALUE!"},{"$error":"#VALUE!"},{"$error":"#VALUE!"},{"$error":"#VALUE!"},{"$error":"#VALUE!"},{"$error":"#VALUE!"},{"$error":"#VALUE!"},{"$error":"#VALUE!"}]
[null,null,null,null,null,null,null,null,{"$f":"IF(Results!C21=\"\",\"\",Results!B21)","v":""},null,"",null,{"$error":"#VALUE!"},{"$error":"#VALUE!"},{"$error":"#VALUE!"},{"$error":"#VALUE!"},{"$error":"#VALUE!"},{"$error":"#VALUE!"},{"$error":"#VALUE!"},{"$error":"#VALUE!"},{"$error":"#VALUE!"},{"$error":"#VALUE!"}]
[null,null,null,null,null,null,null,null,{"$f":"IF(Results!C22=\"\",\"\",Results!B22)","v":""},null,"",null,{"$error":"#VALUE!"},{"$error":"#VALUE!"},{"$error":"#VALUE!"},{"$error":"#VALUE!"},{"$error":"#VALUE!"},{"$error":"#VALUE!"},{"$error":"#VALUE!"},{"$error":"#VALUE!"},{"$error":"#VALUE!"},{"$error":"#VALUE!"}]
[null,null,null,null,null,null,null,null,{"$f":"IF(Results!C23=\"\",\"\",Results!B23)","v":""},null,"",null,{"$error":"#VALUE!"},{"$error":"#VALUE!"},{"$error":"#VALUE!"},{"$error":"#VALUE!"},{"$error":"#VALUE!"},{"$error":"#VALUE!"},{"$error":"#VALUE!"},{"$error":"#VALUE!"},{"$error":"#VALUE!"},{"$error":"#VALUE!"}]
[null,null,null,null,null,null,null,null,{"$f":"IF(Results!C24=\"\",\"\",Results!B24)","v":""},null,"",null,{"$f":"SEARCH($C$6,J24)","v":{"$error":"#VALUE!"}},{"$f":"SEARCH($D$6,J24)","v":{"$error":"#VALUE!"}},{"$f":"SEARCH($E$6,J24)","v":{"$error":"#VALUE!"}},{"$f":"SEARCH($F$6,J24)","v":{"$error":"#VALUE!"}},{"$f":"IF((N24-M24)<0,$C$8,0)","v":{"$error":"#VALUE!"}},{"$f":"IF((O24-M24)<0,$C$8+$D$8,0)","v":{"$error":"#VALUE!"}},{"$f":"IF((P24-M24)<0,$C$8+$D$8+$E$8,0)","v":{"$error":"#VALUE!"}},{"$f":"IF((O24-N24)<0,$D$8,0)","v":{"$error":"#VALUE!"}},{"$f":"IF((P24-N24)<0,$D$8+$E$8,0)","v":{"$error":"#VALUE!"}},{"$f":"IF((P24-O24)<0,$E$8,0)","v":{"$error":"#VALUE!"}}]
[null,null,null,null,null,null,null,null,{"$f":"IF(Results!C25=\"\",\"\",Results!B25)","v":""},null,"",null,{"$error":"#VALUE!"},{"$error":"#VALUE!"},{"$error":"#VALUE!"},{"$error":"#VALUE!"},{"$error":"#VALUE!"},{"$error":"#VALUE!"},{"$error":"#VALUE!"},{"$error":"#VALUE!"},{"$error":"#VALUE!"},{"$error":"#VALUE!"}]
[null,null,null,null,null,null,null,null,{"$f":"IF(Results!C26=\"\",\"\",Results!B26)","v":""},null,"",null,{"$error":"#VALUE!"},{"$error":"#VALUE!"},{"$error":"#VALUE!"},{"$error":"#VALUE!"},{"$error":"#VALUE!"},{"$error":"#VALUE!"},{"$error":"#VALUE!"},{"$error":"#VALUE!"},{"$error":"#VALUE!"},{"$error":"#VALUE!"}]
[null,null,null,null,null,null,null,null,{"$f":"IF(Results!C27=\"\",\"\",Results!B27)","v":""},null,"",null,{"$error":"#VALUE!"},{"$error":"#VALUE!"},{"$error":"#VALUE!"},{"$error":"#VALUE!"},{"$error":"#VALUE!"},{"$error":"#VALUE!"},{"$error":"#VALUE!"},{"$error":"#VALUE!"},{"$error":"#VALUE!"},{"$error":"#VALUE!"}]
[null,null,null,null,null,null,null,null,{"$f":"IF(Results!C28=\"\",\"\",Results!B28)","v":""},null,"",null,{"$error":"#VALUE!"},{"$error":"#VALUE!"},{"$error":"#VALUE!"},{"$error":"#VALUE!"},{"$error":"#VALUE!"},{"$error":"#VALUE!"},{"$error":"#VALUE!"},{"$error":"#VALUE!"},{"$error":"#VALUE!"},{"$error":"#VALUE!"}]
[null,null,null,null,null,null,null,null,{"$f":"IF(Results!C29=\"\",\"\",Results!B29)","v":""},null,"",null,{"$error":"#VALUE!"},{"$error":"#VALUE!"},{"$error":"#VALUE!"},{"$error":"#VALUE!"},{"$error":"#VALUE!"},{"$error":"#VALUE!"},{"$error":"#VALUE!"},{"$error":"#VALUE!"},{"$error":"#VALUE!"},{"$error":"#VALUE!"}]
[null,null,null,null,null,null,null,null,{"$f":"IF(Results!C30=\"\",\"\",Results!B30)","v":""},null,"",null,{"$error":"#VALUE!"},{"$error":"#VALUE!"},{"$error":"#VALUE!"},{"$error":"#VALUE!"},{"$error":"#VALUE!"},{"$error":"#VALUE!"},{"$error":"#VALUE!"},{"$error":"#VALUE!"},{"$error":"#VALUE!"},{"$error":"#VALUE!"}]
[null,null,null,null,null,null,null,null,{"$f":"IF(Results!C31=\"\",\"\",Results!B31)","v":""},null,"",null,{"$error":"#VALUE!"},{"$error":"#VALUE!"},{"$error":"#VALUE!"},{"$error":"#VALUE!"},{"$error":"#VALUE!"},{"$error":"#VALUE!"},{"$error":"#VALUE!"},{"$error":"#VALUE!"},{"$error":"#VALUE!"},{"$error":"#VALUE!"}]
[null,null,null,null,null,null,null,null,{"$f":"IF(Results!C32=\"\",\"\",Results!B32)","v":""},null,"",null,{"$error":"#VALUE!"},{"$error":"#VALUE!"},{"$error":"#VALUE!"},{"$error":"#VALUE!"},{"$error":"#VALUE!"},{"$error":"#VALUE!"},{"$error":"#VALUE!"},{"$error":"#VALUE!"},{"$error":"#VALUE!"},{"$error":"#VALUE!"}]
[null,null,null,null,null,null,null,null,{"$f":"IF(Results!C33=\"\",\"\",Results!B33)","v":""},null,"",null,{"$error":"#VALUE!"},{"$error":"#VALUE!"},{"$error":"#VALUE!"},{"$error":"#VALUE!"},{"$error":"#VALUE!"},{"$error":"#VALUE!"},{"$error":"#VALUE!"},{"$error":"#VALUE!"},{"$error":"#VALUE!"},{"$error":"#VALUE!"}]
[null,null,null,null,null,null,null,null,{"$f":"IF(Results!C34=\"\",\"\",Results!B34)","v":""},null,{"$f":"IF($C$6=\"\",\"\",IF(I34=\"\",\"\",50-SUM(Q34:V34)))","v":""},null,{"$f":"SEARCH($C$6,J34)","v":{"$error":"#VALUE!"}},{"$f":"SEARCH($D$6,J34)","v":{"$error":"#VALUE!"}},{"$f":"SEARCH($E$6,J34)","v":{"$error":"#VALUE!"}},{"$f":"SEARCH($F$6,J34)","v":{"$error":"#VALUE!"}},{"$f":"IF((N34-M34)<0,$C$8,0)","v":{"$error":"#VALUE!"}},{"$f":"IF((O34-M34)<0,$C$8+$D$8,0)","v":{"$error":"#VALUE!"}},{"$f":"IF((P34-M34)<0,$C$8+$D$8+$E$8,0)","v":{"$error":"#VALUE!"}},{"$f":"IF((O34-N34)<0,$D$8,0)","v":{"$error":"#VALUE!"}},{"$f":"IF((P34-N34)<0,$D$8+$E$8,0)","v":{"$error":"#VALUE!"}},{"$f":"IF((P34-O34)<0,$E$8,0)","v":{"$error":"#VALUE!"}}]
[null,null,null,null,null,null,null,null,{"$f":"IF(Results!C35=\"\",\"\",Results!B35)","v":""},null,"",null,{"$error":"#VALUE!"},{"$error":"#VALUE!"},{"$error":"#VALUE!"},{"$error":"#VALUE!"},{"$error":"#VALUE!"},{"$error":"#VALUE!"},{"$error":"#VALUE!"},{"$error":"#VALUE!"},{"$error":"#VALUE!"},{"$error":"#VALUE!"}]
[null,null,null,null,null,null,null,null,{"$f":"IF(Results!C36=\"\",\"\",Results!B36)","v":""},null,"",null,{"$error":"#VALUE!"},{"$error":"#VALUE!"},{"$error":"#VALUE!"},{"$error":"#VALUE!"},{"$error":"#VALUE!"},{"$error":"#VALUE!"},{"$error":"#VALUE!"},{"$error":"#VALUE!"},{"$error":"#VALUE!"},{"$error":"#VALUE!"}]
[null,null,null,null,null,null,null,null,{"$f":"IF(Results!C37=\"\",\"\",Results!B37)","v":""},null,"",null,{"$error":"#VALUE!"},{"$error":"#VALUE!"},{"$error":"#VALUE!"},{"$error":"#VALUE!"},{"$error":"#VALUE!"},{"$error":"#VALUE!"},{"$error":"#VALUE!"},{"$error":"#VALUE!"},{"$error":"#VALUE!"},{"$error":"#VALUE!"}]
[null,null,null,null,null,null,null,null,{"$f":"IF(Results!C38=\"\",\"\",Results!B38)","v":""},null,"",null,{"$error":"#VALUE!"},{"$error":"#VALUE!"},{"$error":"#VALUE!"},{"$error":"#VALUE!"},{"$error":"#VALUE!"},{"$error":"#VALUE!"},{"$error":"#VALUE!"},{"$error":"#VALUE!"},{"$error":"#VALUE!"},{"$error":"#VALUE!"}]
[null,null,null,null,null,null,null,null,{"$f":"IF(Results!C39=\"\",\"\",Results!B39)","v":""},null,"",null,{"$error":"#VALUE!"},{"$error":"#VALUE!"},{"$error":"#VALUE!"},{"$error":"#VALUE!"},{"$error":"#VALUE!"},{"$error":"#VALUE!"},{"$error":"#VALUE!"},{"$error":"#VALUE!"},{"$error":"#VALUE!"},{"$error":"#VALUE!"}]
[null,null,null,null,null,null,null,null,{"$f":"IF(Results!C40=\"\",\"\",Results!B40)","v":""},null,"",null,{"$error":"#VALUE!"},{"$error":"#VALUE!"},{"$error":"#VALUE!"},{"$error":"#VALUE!"},{"$error":"#VALUE!"},{"$error":"#VALUE!"},{"$error":"#VALUE!"},{"$error":"#VALUE!"},{"$error":"#VALUE!"},{"$error":"#VALUE!"}]
[null,null,null,null,null,null,null,null,{"$f":"IF(Results!C41=\"\",\"\",Results!B41)","v":""},null,"",null,{"$error":"#VALUE!"},{"$error":"#VALUE!"},{"$error":"#VALUE!"},{"$error":"#VALUE!"},{"$error":"#VALUE!"},{"$error":"#VALUE!"},{"$error":"#VALUE!"},{"$error":"#VALUE!"},{"$error":"#VALUE!"},{"$error":"#VALUE!"}]
[null,null,null,null,null,null,null,null,{"$f":"IF(Results!C42=\"\",\"\",Results!B42)","v":""},null,"",null,{"$error":"#VALUE!"},{"$error":"#VALUE!"},{"$error":"#VALUE!"},{"$error":"#VALUE!"},{"$error":"#VALUE!"},{"$error":"#VALUE!"},{"$error":"#VALUE!"},{"$error":"#VALUE!"},{"$error":"#VALUE!"},{"$error":"#VALUE!"}]
[null,null,null,null,null,null,null,null,{"$f":"IF(Results!C43=\"\",\"\",Results!B43)","v":""},null,"",null,{"$error":"#VALUE!"},{"$error":"#VALUE!"},{"$error":"#VALUE!"},{"$error":"#VALUE!"},{"$error":"#VALUE!"},{"$error":"#VALUE!"},{"$error":"#VALUE!"},{"$error":"#VALUE!"},{"$error":"#VALUE!"},{"$error":"#VALUE!"}]
[null,null,null,null,null,null,null,null,{"$f":"IF(Results!C44=\"\",\"\",Results!B44)","v":""},null,"",null,{"$error":"#VALUE!"},{"$error":"#VALUE!"},{"$error":"#VALUE!"},{"$error":"#VALUE!"},{"$error":"#VALUE!"},{"$error":"#VALUE!"},{"$error":"#VALUE!"},{"$error":"#VALUE!"},{"$error":"#VALUE!"},{"$error":"#VALUE!"}]
[null,null,null,null,null,null,null,null,{"$f":"IF(Results!C45=\"\",\"\",Results!B45)","v":""},null,"",null,{"$error":"#VALUE!"},{"$error":"#VALUE!"},{"$error":"#VALUE!"},{"$error":"#VALUE!"},{"$error":"#VALUE!"},{"$error":"#VALUE!"},{"$error":"#VALUE!"},{"$error":"#VALUE!"},{"$error":"#VALUE!"},{"$error":"#VALUE!"}]
[null,null,null,null,null,null,null,null,{"$f":"IF(Results!C46=\"\",\"\",Results!B46)","v":""},null,"",null,{"$error":"#VALUE!"},{"$error":"#VALUE!"},{"$error":"#VALUE!"},{"$error":"#VALUE!"},{"$error":"#VALUE!"},{"$error":"#VALUE!"},{"$error":"#VALUE!"},{"$error":"#VALUE!"},{"$error":"#VALUE!"},{"$error":"#VALUE!"}]
[null,null,null,null,null,null,null,null,{"$f":"IF(Results!C47=\"\",\"\",Results!B47)","v":""},null,"",null,{"$error":"#VALUE!"},{"$error":"#VALUE!"},{"$error":"#VALUE!"},{"$error":"#VALUE!"},{"$error":"#VALUE!"},{"$error":"#VALUE!"},{"$error":"#VALUE!"},{"$error":"#VALUE!"},{"$error":"#VALUE!"},{"$error":"#VALUE!"}]
[null,null,null,null,null,null,null,null,{"$f":"IF(Results!C48=\"\",\"\",Results!B48)","v":""},null,"",null,{"$error":"#VALUE!"},{"$error":"#VALUE!"},{"$error":"#VALUE!"},{"$error":"#VALUE!"},{"$error":"#VALUE!"},{"$error":"#VALUE!"},{"$error":"#VALUE!"},{"$error":"#VALUE!"},{"$error":"#VALUE!"},{"$error":"#VALUE!"}]
[null,null,null,null,null,null,null,null,{"$f":"IF(Results!C49=\"\",\"\",Results!B49)","v":""},null,"",null,{"$error":"#VALUE!"},{"$error":"#VALUE!"},{"$error":"#VALUE!"},{"$error":"#VALUE!"},{"$error":"#VALUE!"},{"$error":"#VALUE!"},{"$error":"#VALUE!"},{"$error":"#VALUE!"},{"$error":"#VALUE!"},{"$error":"#VALUE!"}]
[null,null,null,null,null,null,null,null,{"$f":"IF(Results!C50=\"\",\"\",Results!B50)","v":""},null,"",null,{"$error":"#VALUE!"},{"$error":"#VALUE!"},{"$error":"#VALUE!"},{"$error":"#VALUE!"},{"$error":"#VALUE!"},{"$error":"#VALUE!"},{"$error":"#VALUE!"},{"$error":"#VALUE!"},{"$error":"#VALUE!"},{"$error":"#VALUE!"}]
[null,null,null,null,null,null,null,null,{"$f":"IF(Results!C51=\"\",\"\",Results!B51)","v":""},null,"",null,{"$error":"#VALUE!"},{"$error":"#VALUE!"},{"$error":"#VALUE!"},{"$error":"#VALUE!"},{"$error":"#VALUE!"},{"$error":"#VALUE!"},{"$error":"#VALUE!"},{"$error":"#VALUE!"},{"$error":"#VALUE!"},{"$error":"#VALUE!"}]
[null,null,null,null,null,null,null,null,{"$f":"IF(Results!C52=\"\",\"\",Results!B52)","v":""},null,"",null,{"$error":"#VALUE!"},{"$error":"#VALUE!"},{"$error":"#VALUE!"},{"$error":"#VALUE!"},{"$error":"#VALUE!"},{"$error":"#VALUE!"},{"$error":"#VALUE!"},{"$error":"#VALUE!"},{"$error":"#VALUE!"},{"$error":"#VALUE!"}]
[null,null,null,null,null,null,null,null,{"$f":"IF(Results!C53=\"\",\"\",Results!B53)","v":""},null,"",null,{"$error":"#VALUE!"},{"$error":"#VALUE!"},{"$error":"#VALUE!"},{"$error":"#VALUE!"},{"$error":"#VALUE!"},{"$error":"#VALUE!"},{"$error":"#VALUE!"},{"$error":"#VALUE!"},{"$error":"#VALUE!"},{"$error":"#VALUE!"}]
[null,null,null,null,null,null,null,null,{"$f":"IF(Results!C54=\"\",\"\",Results!B54)","v":""},null,"",null,{"$error":"#VALUE!"},{"$error":"#VALUE!"},{"$error":"#VALUE!"},{"$error":"#VALUE!"},{"$error":"#VALUE!"},{"$error":"#VALUE!"},{"$error":"#VALUE!"},{"$error":"#VALUE!"},{"$error":"#VALUE!"},{"$error":"#VALUE!"}]
[null,null,null,null,null,null,null,null,{"$f":"IF(Results!C55=\"\",\"\",Results!B55)","v":""},null,"",null,{"$error":"#VALUE!"},{"$error":"#VALUE!"},{"$error":"#VALUE!"},{"$error":"#VALUE!"},{"$error":"#VALUE!"},{"$error":"#VALUE!"},{"$error":"#VALUE!"},{"$error":"#VALUE!"},{"$error":"#VALUE!"},{"$error":"#VALUE!"}]
[null,null,null,null,null,null,null,null,{"$f":"IF(Results!C56=\"\",\"\",Results!B56)","v":""},null,"",null,{"$error":"#VALUE!"},{"$error":"#VALUE!"},{"$error":"#VALUE!"},{"$error":"#VALUE!"},{"$error":"#VALUE!"},{"$error":"#VALUE!"},{"$error":"#VALUE!"},{"$error":"#VALUE!"},{"$error":"#VALUE!"},{"$error":"#VALUE!"}]
[null,null,null,null,null,null,null,null,{"$f":"IF(Results!C57=\"\",\"\",Results!B57)","v":""},null,"",null,{"$error":"#VALUE!"},{"$error":"#VALUE!"},{"$error":"#VALUE!"},{"$error":"#VALUE!"},{"$error":"#VALUE!"},{"$error":"#VALUE!"},{"$error":"#VALUE!"},{"$error":"#VALUE!"},{"$error":"#VALUE!"},{"$error":"#VALUE!"}]
[null,null,null,null,null,null,null,null,{"$f":"IF(Results!C58=\"\",\"\",Results!B58)","v":""},null,"",null,{"$error":"#VALUE!"},{"$error":"#VALUE!"},{"$error":"#VALUE!"},{"$error":"#VALUE!"},{"$error":"#VALUE!"},{"$error":"#VALUE!"},{"$error":"#VALUE!"},{"$error":"#VALUE!"},{"$error":"#VALUE!"},{"$error":"#VALUE!"}]
[null,null,null,null,null,null,null,null,{"$f":"IF(Results!C59=\"\",\"\",Results!B59)","v":""},null,"",null,{"$error":"#VALUE!"},{"$error":"#VALUE!"},{"$error":"#VALUE!"},{"$error":"#VALUE!"},{"$error":"#VALUE!"},{"$error":"#VALUE!"},{"$error":"#VALUE!"},{"$error":"#VALUE!"},{"$error":"#VALUE!"},{"$error":"#VALUE!"}]
[null,null,null,null,null,null,null,null,{"$f":"IF(Results!C60=\"\",\"\",Results!B60)","v":""},null,"",null,{"$error":"#VALUE!"},{"$error":"#VALUE!"},{"$error":"#VALUE!"},{"$error":"#VALUE!"},{"$error":"#VALUE!"},{"$error":"#VALUE!"},{"$error":"#VALUE!"},{"$error":"#VALUE!"},{"$error":"#VALUE!"},{"$error":"#VALUE!"}]
[null,null,null,null,null,null,null,null,{"$f":"IF(Results!C61=\"\",\"\",Results!B61)","v":""},null,"",null,{"$error":"#VALUE!"},{"$error":"#VALUE!"},{"$error":"#VALUE!"},{"$error":"#VALUE!"},{"$error":"#VALUE!"},{"$error":"#VALUE!"},{"$error":"#VALUE!"},{"$error":"#VALUE!"},{"$error":"#VALUE!"},{"$error":"#VALUE!"}]
[null,null,null,null,null,null,null,null,{"$f":"IF(Results!C62=\"\",\"\",Results!B62)","v":""},null,"",null,{"$error":"#VALUE!"},{"$error":"#VALUE!"},{"$error":"#VALUE!"},{"$error":"#VALUE!"},{"$error":"#VALUE!"},{"$error":"#VALUE!"},{"$error":"#VALUE!"},{"$error":"#VALUE!"},{"$error":"#VALUE!"},{"$error":"#VALUE!"}]
[null,null,null,null,null,null,null,null,{"$f":"IF(Results!C63=\"\",\"\",Results!B63)","v":""},null,"",null,{"$error":"#VALUE!"},{"$error":"#VALUE!"},{"$error":"#VALUE!"},{"$error":"#VALUE!"},{"$error":"#VALUE!"},{"$error":"#VALUE!"},{"$error":"#VALUE!"},{"$error":"#VALUE!"},{"$error":"#VALUE!"},{"$error":"#VALUE!"}]
[null,null,null,null,null,null,null,null,{"$f":"IF(Results!C64=\"\",\"\",Results!B64)","v":""},null,"",null,{"$error":"#VALUE!"},{"$error":"#VALUE!"},{"$error":"#VALUE!"},{"$error":"#VALUE!"},{"$error":"#VALUE!"},{"$error":"#VALUE!"},{"$error":"#VALUE!"},{"$error":"#VALUE!"},{"$error":"#VALUE!"},{"$error":"#VALUE!"}]
[null,null,null,null,null,null,null,null,{"$f":"IF(Results!C65=\"\",\"\",Results!B65)","v":""},null,"",null,{"$error":"#VALUE!"},{"$error":"#VALUE!"},{"$error":"#VALUE!"},{"$error":"#VALUE!"},{"$error":"#VALUE!"},{"$error":"#VALUE!"},{"$error":"#VALUE!"},{"$error":"#VALUE!"},{"$error":"#VALUE!"},{"$error":"#VALUE!"}]
[null,null,null,null,null,null,null,null,{"$f":"IF(Results!C66=\"\",\"\",Results!B66)","v":""},null,"",null,{"$error":"#VALUE!"},{"$error":"#VALUE!"},{"$error":"#VALUE!"},{"$error":"#VALUE!"},{"$error":"#VALUE!"},{"$error":"#VALUE!"},{"$error":"#VALUE!"},{"$error":"#VALUE!"},{"$error":"#VALUE!"},{"$error":"#VALUE!"}]
[null,null,null,null,null,null,null,null,{"$f":"IF(Results!C67=\"\",\"\",Results!B67)","v":""},null,"",null,{"$error":"#VALUE!"},{"$error":"#VALUE!"},{"$error":"#VALUE!"},{"$error":"#VALUE!"},{"$error":"#VALUE!"},{"$error":"#VALUE!"},{"$error":"#VALUE!"},{"$error":"#VALUE!"},{"$error":"#VALUE!"},{"$error":"#VALUE!"}]
[null,null,null,null,null,null,null,null,{"$f":"IF(Results!C68=\"\",\"\",Results!B68)","v":""},null,"",null,{"$error":"#VALUE!"},{"$error":"#VALUE!"},{"$error":"#VALUE!"},{"$error":"#VALUE!"},{"$error":"#VALUE!"},{"$error":"#VALUE!"},{"$error":"#VALUE!"},{"$error":"#VALUE!"},{"$error":"#VALUE!"},{"$error":"#VALUE!"}]
[null,null,null,null,null,null,null,null,{"$f":"IF(Results!C69=\"\",\"\",Results!B69)","v":""},null,"",null,{"$error":"#VALUE!"},{"$error":"#VALUE!"},{"$error":"#VALUE!"},{"$error":"#VALUE!"},{"$error":"#VALUE!"},{"$error":"#VALUE!"},{"$error":"#VALUE!"},{"$error":"#VALUE!"},{"$error":"#VALUE!"},{"$error":"#VALUE!"}]
[null,null,null,null,null,null,null,null,{"$f":"IF(Results!C70=\"\",\"\",Results!B70)","v":""},null,"",null,{"$error":"#VALUE!"},{"$error":"#VALUE!"},{"$error":"#VALUE!"},{"$error":"#VALUE!"},{"$error":"#VALUE!"},{"$error":"#VALUE!"},{"$error":"#VALUE!"},{"$error":"#VALUE!"},{"$error":"#VALUE!"},{"$error":"#VALUE!"}]
[null,null,null,null,null,null,null,null,{"$f":"IF(Results!C71=\"\",\"\",Results!B71)","v":""},null,"",null,{"$error":"#VALUE!"},{"$error":"#VALUE!"},{"$error":"#VALUE!"},{"$error":"#VALUE!"},{"$error":"#VALUE!"},{"$error":"#VALUE!"},{"$error":"#VALUE!"},{"$error":"#VALUE!"},{"$error":"#VALUE!"},{"$error":"#VALUE!"}]
[null,null,null,null,null,null,null,null,{"$f":"IF(Results!C72=\"\",\"\",Results!B72)","v":""},null,"",null,{"$error":"#VALUE!"},{"$error":"#VALUE!"},{"$error":"#VALUE!"},{"$error":"#VALUE!"},{"$error":"#VALUE!"},{"$error":"#VALUE!"},{"$error":"#VALUE!"},{"$error":"#VALUE!"},{"$error":"#VALUE!"},{"$error":"#VALUE!"}]
[null,null,null,null,null,null,null,null,{"$f":"IF(Results!C73=\"\",\"\",Results!B73)","v":""},null,"",null,{"$error":"#VALUE!"},{"$error":"#VALUE!"},{"$error":"#VALUE!"},{"$error":"#VALUE!"},{"$error":"#VALUE!"},{"$error":"#VALUE!"},{"$error":"#VALUE!"},{"$error":"#VALUE!"},{"$error":"#VALUE!"},{"$error":"#VALUE!"}]
[null,null,null,null,null,null,null,null,{"$f":"IF(Results!C74=\"\",\"\",Results!B74)","v":""},null,"",null,{"$error":"#VALUE!"},{"$error":"#VALUE!"},{"$error":"#VALUE!"},{"$error":"#VALUE!"},{"$error":"#VALUE!"},{"$error":"#VALUE!"},{"$error":"#VALUE!"},{"$error":"#VALUE!"},{"$error":"#VALUE!"},{"$error":"#VALUE!"}]
[null,null,null,null,null,null,null,null,{"$f":"IF(Results!C75=\"\",\"\",Results!B75)","v":""},null,"",null,{"$error":"#VALUE!"},{"$error":"#VALUE!"},{"$error":"#VALUE!"},{"$error":"#VALUE!"},{"$error":"#VALUE!"},{"$error":"#VALUE!"},{"$error":"#VALUE!"},{"$error":"#VALUE!"},{"$error":"#VALUE!"},{"$error":"#VALUE!"}]
[null,null,null,null,null,null,null,null,{"$f":"IF(Results!C76=\"\",\"\",Results!B76)","v":""},null,"",null,{"$error":"#VALUE!"},{"$error":"#VALUE!"},{"$error":"#VALUE!"},{"$error":"#VALUE!"},{"$error":"#VALUE!"},{"$error":"#VALUE!"},{"$error":"#VALUE!"},{"$error":"#VALUE!"},{"$error":"#VALUE!"},{"$error":"#VALUE!"}]
[null,null,null,null,null,null,null,null,{"$f":"IF(Results!C77=\"\",\"\",Results!B77)","v":""},null,"",null,{"$error":"#VALUE!"},{"$error":"#VALUE!"},{"$error":"#VALUE!"},{"$error":"#VALUE!"},{"$error":"#VALUE!"},{"$error":"#VALUE!"},{"$error":"#VALUE!"},{"$error":"#VALUE!"},{"$error":"#VALUE!"},{"$error":"#VALUE!"}]
[null,null,null,null,null,null,null,null,{"$f":"IF(Results!C78=\"\",\"\",Results!B78)","v":""},null,"",null,{"$error":"#VALUE!"},{"$error":"#VALUE!"},{"$error":"#VALUE!"},{"$error":"#VALUE!"},{"$error":"#VALUE!"},{"$error":"#VALUE!"},{"$error":"#VALUE!"},{"$error":"#VALUE!"},{"$error":"#VALUE!"},{"$error":"#VALUE!"}]
[null,null,null,null,null,null,null,null,{"$f":"IF(Results!C79=\"\",\"\",Results!B79)","v":""},null,"",null,{"$error":"#VALUE!"},{"$error":"#VALUE!"},{"$error":"#VALUE!"},{"$error":"#VALUE!"},{"$error":"#VALUE!"},{"$error":"#VALUE!"},{"$error":"#VALUE!"},{"$error":"#VALUE!"},{"$error":"#VALUE!"},{"$error":"#VALUE!"}]
[null,null,null,null,null,null,null,null,{"$f":"IF(Results!C80=\"\",\"\",Results!B80)","v":""},null,"",null,{"$error":"#VALUE!"},{"$error":"#VALUE!"},{"$error":"#VALUE!"},{"$error":"#VALUE!"},{"$error":"#VALUE!"},{"$error":"#VALUE!"},{"$error":"#VALUE!"},{"$error":"#VALUE!"},{"$error":"#VALUE!"},{"$error":"#VALUE!"}]
[null,null,null,null,null,null,null,null,{"$f":"IF(Results!C81=\"\",\"\",Results!B81)","v":""},null,"",null,{"$error":"#VALUE!"},{"$error":"#VALUE!"},{"$error":"#VALUE!"},{"$error":"#VALUE!"},{"$error":"#VALUE!"},{"$error":"#VALUE!"},{"$error":"#VALUE!"},{"$error":"#VALUE!"},{"$error":"#VALUE!"},{"$error":"#VALUE!"}]
[null,null,null,null,null,null,null,null,{"$f":"IF(Results!C82=\"\",\"\",Results!B82)","v":""},null,"",null,{"$error":"#VALUE!"},{"$error":"#VALUE!"},{"$error":"#VALUE!"},{"$error":"#VALUE!"},{"$error":"#VALUE!"},{"$error":"#VALUE!"},{"$error":"#VALUE!"},{"$error":"#VALUE!"},{"$error":"#VALUE!"},{"$error":"#VALUE!"}]
[null,null,null,null,null,null,null,null,{"$f":"IF(Results!C83=\"\",\"\",Results!B83)","v":""},null,"",null,{"$error":"#VALUE!"},{"$error":"#VALUE!"},{"$error":"#VALUE!"},{"$error":"#VALUE!"},{"$error":"#VALUE!"},{"$error":"#VALUE!"},{"$error":"#VALUE!"},{"$error":"#VALUE!"},{"$error":"#VALUE!"},{"$error":"#VALUE!"}]
[null,null,null,null,null,null,null,null,{"$f":"IF(Results!C84=\"\",\"\",Results!B84)","v":""},null,"",null,{"$error":"#VALUE!"},{"$error":"#VALUE!"},{"$error":"#VALUE!"},{"$error":"#VALUE!"},{"$error":"#VALUE!"},{"$error":"#VALUE!"},{"$error":"#VALUE!"},{"$error":"#VALUE!"},{"$error":"#VALUE!"},{"$error":"#VALUE!"}]
[null,null,null,null,null,null,null,null,{"$f":"IF(Results!C85=\"\",\"\",Results!B85)","v":""},null,"",null,{"$error":"#VALUE!"},{"$error":"#VALUE!"},{"$error":"#VALUE!"},{"$error":"#VALUE!"},{"$error":"#VALUE!"},{"$error":"#VALUE!"},{"$error":"#VALUE!"},{"$error":"#VALUE!"},{"$error":"#VALUE!"},{"$error":"#VALUE!"}]
[null,null,null,null,null,null,null,null,{"$f":"IF(Results!C86=\"\",\"\",Results!B86)","v":""},null,"",null,{"$error":"#VALUE!"},{"$error":"#VALUE!"},{"$error":"#VALUE!"},{"$error":"#VALUE!"},{"$error":"#VALUE!"},{"$error":"#VALUE!"},{"$error":"#VALUE!"},{"$error":"#VALUE!"},{"$error":"#VALUE!"},{"$error":"#VALUE!"}]
[null,null,null,null,null,null,null,null,{"$f":"IF(Results!C87=\"\",\"\",Results!B87)","v":""},null,"",null,{"$error":"#VALUE!"},{"$error":"#VALUE!"},{"$error":"#VALUE!"},{"$error":"#VALUE!"},{"$error":"#VALUE!"},{"$error":"#VALUE!"},{"$error":"#VALUE!"},{"$error":"#VALUE!"},{"$error":"#VALUE!"},{"$error":"#VALUE!"}]
[null,null,null,null,null,null,null,null,{"$f":"IF(Results!C88=\"\",\"\",Results!B88)","v":""},null,"",null,{"$error":"#VALUE!"},{"$error":"#VALUE!"},{"$error":"#VALUE!"},{"$error":"#VALUE!"},{"$error":"#VALUE!"},{"$error":"#VALUE!"},{"$error":"#VALUE!"},{"$error":"#VALUE!"},{"$error":"#VALUE!"},{"$error":"#VALUE!"}]
[null,null,null,null,null,null,null,null,{"$f":"IF(Results!C89=\"\",\"\",Results!B89)","v":""},null,"",null,{"$error":"#VALUE!"},{"$error":"#VALUE!"},{"$error":"#VALUE!"},{"$error":"#VALUE!"},{"$error":"#VALUE!"},{"$error":"#VALUE!"},{"$error":"#VALUE!"},{"$error":"#VALUE!"},{"$error":"#VALUE!"},{"$error":"#VALUE!"}]
[null,null,null,null,null,null,null,null,{"$f":"IF(Results!C90=\"\",\"\",Results!B90)","v":""},null,"",null,{"$error":"#VALUE!"},{"$error":"#VALUE!"},{"$error":"#VALUE!"},{"$error":"#VALUE!"},{"$error":"#VALUE!"},{"$error":"#VALUE!"},{"$error":"#VALUE!"},{"$error":"#VALUE!"},{"$error":"#VALUE!"},{"$error":"#VALUE!"}]
[null,null,null,null,null,null,null,null,{"$f":"IF(Results!C91=\"\",\"\",Results!B91)","v":""},null,"",null,{"$error":"#VALUE!"},{"$error":"#VALUE!"},{"$error":"#VALUE!"},{"$error":"#VALUE!"},{"$error":"#VALUE!"},{"$error":"#VALUE!"},{"$error":"#VALUE!"},{"$error":"#VALUE!"},{"$error":"#VALUE!"},{"$error":"#VALUE!"}]
[null,null,null,null,null,null,null,null,{"$f":"IF(Results!C92=\"\",\"\",Results!B92)","v":""},null,"",null,{"$error":"#VALUE!"},{"$error":"#VALUE!"},{"$error":"#VALUE!"},{"$error":"#VALUE!"},{"$error":"#VALUE!"},{"$error":"#VALUE!"},{"$error":"#VALUE!"},{"$error":"#VALUE!"},{"$error":"#VALUE!"},{"$error":"#VALUE!"}]
[null,null,null,null,null,null,null,null,{"$f":"IF(Results!C93=\"\",\"\",Results!B93)","v":""},null,"",null,{"$error":"#VALUE!"},{"$error":"#VALUE!"},{"$error":"#VALUE!"},{"$error":"#VALUE!"},{"$error":"#VALUE!"},{"$error":"#VALUE!"},{"$error":"#VALUE!"},{"$error":"#VALUE!"},{"$error":"#VALUE!"},{"$error":"#VALUE!"}]
[null,null,null,null,null,null,null,null,{"$f":"IF(Results!C94=\"\",\"\",Results!B94)","v":""},null,"",null,{"$error":"#VALUE!"},{"$error":"#VALUE!"},{"$error":"#VALUE!"},{"$error":"#VALUE!"},{"$error":"#VALUE!"},{"$error":"#VALUE!"},{"$error":"#VALUE!"},{"$error":"#VALUE!"},{"$error":"#VALUE!"},{"$error":"#VALUE!"}]
[null,null,null,null,null,null,null,null,{"$f":"IF(Results!C95=\"\",\"\",Results!B95)","v":""},null,"",null,{"$error":"#VALUE!"},{"$error":"#VALUE!"},{"$error":"#VALUE!"},{"$error":"#VALUE!"},{"$error":"#VALUE!"},{"$error":"#VALUE!"},{"$error":"#VALUE!"},{"$error":"#VALUE!"},{"$error":"#VALUE!"},{"$error":"#VALUE!"}]
[null,null,null,null,null,null,null,null,{"$f":"IF(Results!C96=\"\",\"\",Results!B96)","v":""},null,"",null,{"$error":"#VALUE!"},{"$error":"#VALUE!"},{"$error":"#VALUE!"},{"$error":"#VALUE!"},{"$error":"#VALUE!"},{"$error":"#VALUE!"},{"$error":"#VALUE!"},{"$error":"#VALUE!"},{"$error":"#VALUE!"},{"$error":"#VALUE!"}]
[null,null,null,null,null,null,null,null,{"$f":"IF(Results!C97=\"\",\"\",Results!B97)","v":""},null,"",null,{"$error":"#VALUE!"},{"$error":"#VALUE!"},{"$error":"#VALUE!"},{"$error":"#VALUE!"},{"$error":"#VALUE!"},{"$error":"#VALUE!"},{"$error":"#VALUE!"},{"$error":"#VALUE!"},{"$error":"#VALUE!"},{"$error":"#VALUE!"}]
[null,null,null,null,null,null,null,null,{"$f":"IF(Results!C98=\"\",\"\",Results!B98)","v":""},null,{"$f":"IF($C$6=\"\",\"\",IF(I98=\"\",\"\",50-SUM(Q98:V98)))","v":""},null,{"$f":"SEARCH($C$6,J98)","v":{"$error":"#VALUE!"}},{"$f":"SEARCH($D$6,J98)","v":{"$error":"#VALUE!"}},{"$f":"SEARCH($E$6,J98)","v":{"$error":"#VALUE!"}},{"$f":"SEARCH($F$6,J98)","v":{"$error":"#VALUE!"}},{"$f":"IF((N98-M98)<0,$C$8,0)","v":{"$error":"#VALUE!"}},{"$f":"IF((O98-M98)<0,$C$8+$D$8,0)","v":{"$error":"#VALUE!"}},{"$f":"IF((P98-M98)<0,$C$8+$D$8+$E$8,0)","v":{"$error":"#VALUE!"}},{"$f":"IF((O98-N98)<0,$D$8,0)","v":{"$error":"#VALUE!"}},{"$f":"IF((P98-N98)<0,$D$8+$E$8,0)","v":{"$error":"#VALUE!"}},{"$f":"IF((P98-O98)<0,$E$8,0)","v":{"$error":"#VALUE!"}}]
[null,null,null,null,null,null,null,null,{"$f":"IF(Results!C99=\"\",\"\",Results!B99)","v":""},null,"",null,{"$error":"#VALUE!"},{"$error":"#VALUE!"},{"$error":"#VALUE!"},{"$error":"#VALUE!"},{"$error":"#VALUE!"},{"$error":"#VALUE!"},{"$error":"#VALUE!"},{"$error":"#VALUE!"},{"$error":"#VALUE!"},{"$error":"#VALUE!"}]
[null,null,null,null,null,null,null,null,{"$f":"IF(Results!C100=\"\",\"\",Results!B100)","v":""},null,"",null,{"$error":"#VALUE!"},{"$error":"#VALUE!"},{"$error":"#VALUE!"},{"$error":"#VALUE!"},{"$error":"#VALUE!"},{"$error":"#VALUE!"},{"$error":"#VALUE!"},{"$error":"#VALUE!"},{"$error":"#VALUE!"},{"$error":"#VALUE!"}]
[null,null,null,null,null,null,null,null,{"$f":"IF(Results!C101=\"\",\"\",Results!B101)","v":""},null,"",null,{"$error":"#VALUE!"},{"$error":"#VALUE!"},{"$error":"#VALUE!"},{"$error":"#VALUE!"},{"$error":"#VALUE!"},{"$error":"#VALUE!"},{"$error":"#VALUE!"},{"$error":"#VALUE!"},{"$error":"#VALUE!"},{"$error":"#VALUE!"}]
[null,null,null,null,null,null,null,null,{"$f":"IF(Results!C102=\"\",\"\",Results!B102)","v":""},null,"",null,{"$error":"#VALUE!"},{"$error":"#VALUE!"},{"$error":"#VALUE!"},{"$error":"#VALUE!"},{"$error":"#VALUE!"},{"$error":"#VALUE!"},{"$error":"#VALUE!"},{"$error":"#VALUE!"},{"$error":"#VALUE!"},{"$error":"#VALUE!"}]
[null,null,null,null,null,null,null,null,{"$f":"IF(Results!C103=\"\",\"\",Results!B103)","v":""},null,"",null,{"$error":"#VALUE!"},{"$error":"#VALUE!"},{"$error":"#VALUE!"},{"$error":"#VALUE!"},{"$error":"#VALUE!"},{"$error":"#VALUE!"},{"$error":"#VALUE!"},{"$error":"#VALUE!"},{"$error":"#VALUE!"},{"$error":"#VALUE!"}]
[null,null,null,null,null,null,null,null,{"$f":"IF(Results!C104=\"\",\"\",Results!B104)","v":""},null,{"$f":"IF($C$6=\"\",\"\",IF(I104=\"\",\"\",50-SUM(Q104:V104)))","v":""},null,{"$f":"SEARCH($C$6,J104)","v":{"$error":"#VALUE!"}},{"$f":"SEARCH($D$6,J104)","v":{"$error":"#VALUE!"}},{"$f":"SEARCH($E$6,J104)","v":{"$error":"#VALUE!"}},{"$f":"SEARCH($F$6,J104)","v":{"$error":"#VALUE!"}},{"$f":"IF((N104-M104)<0,$C$8,0)","v":{"$error":"#VALUE!"}},{"$f":"IF((O104-M104)<0,$C$8+$D$8,0)","v":{"$error":"#VALUE!"}},{"$f":"IF((P104-M104)<0,$C$8+$D$8+$E$8,0)","v":{"$error":"#VALUE!"}},{"$f":"IF((O104-N104)<0,$D$8,0)","v":{"$error":"#VALUE!"}},{"$f":"IF((P104-N104)<0,$D$8+$E$8,0)","v":{"$error":"#VALUE!"}},{"$f":"IF((P104-O104)<0,$E$8,0)","v":{"$error":"#VALUE!"}}]
[null,null,null,null,null,null,null,null,{"$f":"IF(Results!C105=\"\",\"\",Results!B105)","v":""},null,"",null,{"$error":"#VALUE!"},{"$error":"#VALUE!"},{"$error":"#VALUE!"},{"$error":"#VALUE!"},{"$error":"#VALUE!"},{"$error":"#VALUE!"},{"$error":"#VALUE!"},{"$error":"#VALUE!"},{"$error":"#VALUE!"},{"$error":"#VALUE!"}]
[null,null,null,null,null,null,null,null,{"$f":"IF(Results!C106=\"\",\"\",Results!B106)","v":""},null,"",null,{"$error":"#VALUE!"},{"$error":"#VALUE!"},{"$error":"#VALUE!"},{"$error":"#VALUE!"},{"$error":"#VALUE!"},{"$error":"#VALUE!"},{"$error":"#VALUE!"},{"$error":"#VALUE!"},{"$error":"#VALUE!"},{"$error":"#VALUE!"}]
[null,null,null,null,null,null,null,null,{"$f":"IF(Results!C107=\"\",\"\",Results!B107)","v":""},null,"",null,{"$error":"#VALUE!"},{"$error":"#VALUE!"},{"$error":"#VALUE!"},{"$error":"#VALUE!"},{"$error":"#VALUE!"},{"$error":"#VALUE!"},{"$error":"#VALUE!"},{"$error":"#VALUE!"},{"$error":"#VALUE!"},{"$error":"#VALUE!"}]
[null,null,null,null,null,null,null,null,{"$f":"IF(Results!C108=\"\",\"\",Results!B108)","v":""},null,"",null,{"$error":"#VALUE!"},{"$error":"#VALUE!"},{"$error":"#VALUE!"},{"$error":"#VALUE!"},{"$error":"#VALUE!"},{"$error":"#VALUE!"},{"$error":"#VALUE!"},{"$error":"#VALUE!"},{"$error":"#VALUE!"},{"$error":"#VALUE!"}]
[null,null,null,null,null,null,null,null,{"$f":"IF(Results!C109=\"\",\"\",Results!B109)","v":""},null,"",null,{"$error":"#VALUE!"},{"$error":"#VALUE!"},{"$error":"#VALUE!"},{"$error":"#VALUE!"},{"$error":"#VALUE!"},{"$error":"#VALUE!"},{"$error":"#VALUE!"},{"$error":"#VALUE!"},{"$error":"#VALUE!"},{"$error":"#VALUE!"}]
[null,null,null,null,null,null,null,null,{"$f":"IF(Results!C110=\"\",\"\",Results!B110)","v":""},null,"",null,{"$error":"#VALUE!"},{"$error":"#VALUE!"},{"$error":"#VALUE!"},{"$error":"#VALUE!"},{"$error":"#VALUE!"},{"$error":"#VALUE!"},{"$error":"#VALUE!"},{"$error":"#VALUE!"},{"$error":"#VALUE!"},{"$error":"#VALUE!"}]
[null,null,null,null,null,null,null,null,{"$f":"IF(Results!C111=\"\",\"\",Results!B111)","v":""},null,"",null,{"$error":"#VALUE!"},{"$error":"#VALUE!"},{"$error":"#VALUE!"},{"$error":"#VALUE!"},{"$error":"#VALUE!"},{"$error":"#VALUE!"},{"$error":"#VALUE!"},{"$error":"#VALUE!"},{"$error":"#VALUE!"},{"$error":"#VALUE!"}]
[null,null,null,null,null,null,null,null,{"$f":"IF(Results!C112=\"\",\"\",Results!B112)","v":""},null,"",null,{"$error":"#VALUE!"},{"$error":"#VALUE!"},{"$error":"#VALUE!"},{"$error":"#VALUE!"},{"$error":"#VALUE!"},{"$error":"#VALUE!"},{"$error":"#VALUE!"},{"$error":"#VALUE!"},{"$error":"#VALUE!"},{"$error":"#VALUE!"}]
[null,null,null,null,null,null,null,null,{"$f":"IF(Results!C113=\"\",\"\",Results!B113)","v":""},null,"",null,{"$error":"#VALUE!"},{"$error":"#VALUE!"},{"$error":"#VALUE!"},{"$error":"#VALUE!"},{"$error":"#VALUE!"},{"$error":"#VALUE!"},{"$error":"#VALUE!"},{"$error":"#VALUE!"},{"$error":"#VALUE!"},{"$error":"#VALUE!"}]
[null,null,null,null,null,null,null,null,{"$f":"IF(Results!C114=\"\",\"\",Results!B114)","v":""},null,"",null,{"$error":"#VALUE!"},{"$error":"#VALUE!"},{"$error":"#VALUE!"},{"$error":"#VALUE!"},{"$error":"#VALUE!"},{"$error":"#VALUE!"},{"$error":"#VALUE!"},{"$error":"#VALUE!"},{"$error":"#VALUE!"},{"$error":"#VALUE!"}]
[null,null,null,null,null,null,null,null,{"$f":"IF(Results!C115=\"\",\"\",Results!B115)","v":""},null,"",null,{"$error":"#VALUE!"},{"$error":"#VALUE!"},{"$error":"#VALUE!"},{"$error":"#VALUE!"},{"$error":"#VALUE!"},{"$error":"#VALUE!"},{"$error":"#VALUE!"},{"$error":"#VALUE!"},{"$error":"#VALUE!"},{"$error":"#VALUE!"}]
[null,null,null,null,null,null,null,null,{"$f":"IF(Results!C116=\"\",\"\",Results!B116)","v":""},null,"",null,{"$error":"#VALUE!"},{"$error":"#VALUE!"},{"$error":"#VALUE!"},{"$error":"#VALUE!"},{"$error":"#VALUE!"},{"$error":"#VALUE!"},{"$error":"#VALUE!"},{"$error":"#VALUE!"},{"$error":"#VALUE!"},{"$error":"#VALUE!"}]
[null,null,null,null,null,null,null,null,{"$f":"IF(Results!C117=\"\",\"\",Results!B117)","v":""},null,"",null,{"$error":"#VALUE!"},{"$error":"#VALUE!"},{"$error":"#VALUE!"},{"$error":"#VALUE!"},{"$error":"#VALUE!"},{"$error":"#VALUE!"},{"$error":"#VALUE!"},{"$error":"#VALUE!"},{"$error":"#VALUE!"},{"$error":"#VALUE!"}]
[null,null,null,null,null,null,null,null,{"$f":"IF(Results!C118=\"\",\"\",Results!B118)","v":""},null,"",null,{"$error":"#VALUE!"},{"$error":"#VALUE!"},{"$error":"#VALUE!"},{"$error":"#VALUE!"},{"$error":"#VALUE!"},{"$error":"#VALUE!"},{"$error":"#VALUE!"},{"$error":"#VALUE!"},{"$error":"#VALUE!"},{"$error":"#VALUE!"}]
[null,null,null,null,null,null,null,null,{"$f":"IF(Results!C119=\"\",\"\",Results!B119)","v":""},null,"",null,{"$error":"#VALUE!"},{"$error":"#VALUE!"},{"$error":"#VALUE!"},{"$error":"#VALUE!"},{"$error":"#VALUE!"},{"$error":"#VALUE!"},{"$error":"#VALUE!"},{"$error":"#VALUE!"},{"$error":"#VALUE!"},{"$error":"#VALUE!"}]
[null,null,null,null,null,null,null,null,{"$f":"IF(Results!C120=\"\",\"\",Results!B120)","v":""},null,"",null,{"$error":"#VALUE!"},{"$error":"#VALUE!"},{"$error":"#VALUE!"},{"$error":"#VALUE!"},{"$error":"#VALUE!"},{"$error":"#VALUE!"},{"$error":"#VALUE!"},{"$error":"#VALUE!"},{"$error":"#VALUE!"},{"$error":"#VALUE!"}]
[null,null,null,null,null,null,null,null,{"$f":"IF(Results!C121=\"\",\"\",Results!B121)","v":""},null,"",null,{"$error":"#VALUE!"},{"$error":"#VALUE!"},{"$error":"#VALUE!"},{"$error":"#VALUE!"},{"$error":"#VALUE!"},{"$error":"#VALUE!"},{"$error":"#VALUE!"},{"$error":"#VALUE!"},{"$error":"#VALUE!"},{"$error":"#VALUE!"}]
[null,null,null,null,null,null,null,null,{"$f":"IF(Results!C122=\"\",\"\",Results!B122)","v":""},null,"",null,{"$error":"#VALUE!"},{"$error":"#VALUE!"},{"$error":"#VALUE!"},{"$error":"#VALUE!"},{"$error":"#VALUE!"},{"$error":"#VALUE!"},{"$error":"#VALUE!"},{"$error":"#VALUE!"},{"$error":"#VALUE!"},{"$error":"#VALUE!"}]
[null,null,null,null,null,null,null,null,{"$f":"IF(Results!C123=\"\",\"\",Results!B123)","v":""},null,"",null,{"$error":"#VALUE!"},{"$error":"#VALUE!"},{"$error":"#VALUE!"},{"$error":"#VALUE!"},{"$error":"#VALUE!"},{"$error":"#VALUE!"},{"$error":"#VALUE!"},{"$error":"#VALUE!"},{"$error":"#VALUE!"},{"$error":"#VALUE!"}]
[null,null,null,null,null,null,null,null,{"$f":"IF(Results!C124=\"\",\"\",Results!B124)","v":""},null,"",null,{"$error":"#VALUE!"},{"$error":"#VALUE!"},{"$error":"#VALUE!"},{"$error":"#VALUE!"},{"$error":"#VALUE!"},{"$error":"#VALUE!"},{"$error":"#VALUE!"},{"$error":"#VALUE!"},{"$error":"#VALUE!"},{"$error":"#VALUE!"}]
[null,null,null,null,null,null,null,null,{"$f":"IF(Results!C125=\"\",\"\",Results!B125)","v":""},null,"",null,{"$error":"#VALUE!"},{"$error":"#VALUE!"},{"$error":"#VALUE!"},{"$error":"#VALUE!"},{"$error":"#VALUE!"},{"$error":"#VALUE!"},{"$error":"#VALUE!"},{"$error":"#VALUE!"},{"$error":"#VALUE!"},{"$error":"#VALUE!"}]
[null,null,null,null,null,null,null,null,{"$f":"IF(Results!C126=\"\",\"\",Results!B126)","v":""},null,"",null,{"$error":"#VALUE!"},{"$error":"#VALUE!"},{"$error":"#VALUE!"},{"$error":"#VALUE!"},{"$error":"#VALUE!"},{"$error":"#VALUE!"},{"$error":"#VALUE!"},{"$error":"#VALUE!"},{"$error":"#VALUE!"},{"$error":"#VALUE!"}]
[null,null,null,null,null,null,null,null,{"$f":"IF(Results!C127=\"\",\"\",Results!B127)","v":""},null,"",null,{"$error":"#VALUE!"},{"$error":"#VALUE!"},{"$error":"#VALUE!"},{"$error":"#VALUE!"},{"$error":"#VALUE!"},{"$error":"#VALUE!"},{"$error":"#VALUE!"},{"$error":"#VALUE!"},{"$error":"#VALUE!"},{"$error":"#VALUE!"}]
[null,null,null,null,null,null,null,null,{"$f":"IF(Results!C128=\"\",\"\",Results!B128)","v":""},null,"",null,{"$error":"#VALUE!"},{"$error":"#VALUE!"},{"$error":"#VALUE!"},{"$error":"#VALUE!"},{"$error":"#VALUE!"},{"$error":"#VALUE!"},{"$error":"#VALUE!"},{"$error":"#VALUE!"},{"$error":"#VALUE!"},{"$error":"#VALUE!"}]
[null,null,null,null,null,null,null,null,{"$f":"IF(Results!C129=\"\",\"\",Results!B129)","v":""},null,"",null,{"$error":"#VALUE!"},{"$error":"#VALUE!"},{"$error":"#VALUE!"},{"$error":"#VALUE!"},{"$error":"#VALUE!"},{"$error":"#VALUE!"},{"$error":"#VALUE!"},{"$error":"#VALUE!"},{"$error":"#VALUE!"},{"$error":"#VALUE!"}]
[null,null,null,null,null,null,null,null,{"$f":"IF(Results!C130=\"\",\"\",Results!B130)","v":""},null,"",null,{"$error":"#VALUE!"},{"$error":"#VALUE!"},{"$error":"#VALUE!"},{"$error":"#VALUE!"},{"$error":"#VALUE!"},{"$error":"#VALUE!"},{"$error":"#VALUE!"},{"$error":"#VALUE!"},{"$error":"#VALUE!"},{"$error":"#VALUE!"}]
[null,null,null,null,null,null,null,null,{"$f":"IF(Results!C131=\"\",\"\",Results!B131)","v":""},null,"",null,{"$error":"#VALUE!"},{"$error":"#VALUE!"},{"$error":"#VALUE!"},{"$error":"#VALUE!"},{"$error":"#VALUE!"},{"$error":"#VALUE!"},{"$error":"#VALUE!"},{"$error":"#VALUE!"},{"$error":"#VALUE!"},{"$error":"#VALUE!"}]
[null,null,null,null,null,null,null,null,{"$f":"IF(Results!C132=\"\",\"\",Results!B132)","v":""},null,"",null,{"$error":"#VALUE!"},{"$error":"#VALUE!"},{"$error":"#VALUE!"},{"$error":"#VALUE!"},{"$error":"#VALUE!"},{"$error":"#VALUE!"},{"$error":"#VALUE!"},{"$error":"#VALUE!"},{"$error":"#VALUE!"},{"$error":"#VALUE!"}]
[null,null,null,null,null,null,null,null,{"$f":"IF(Results!C133=\"\",\"\",Results!B133)","v":""},null,"",null,{"$error":"#VALUE!"},{"$error":"#VALUE!"},{"$error":"#VALUE!"},{"$error":"#VALUE!"},{"$error":"#VALUE!"},{"$error":"#VALUE!"},{"$error":"#VALUE!"},{"$error":"#VALUE!"},{"$error":"#VALUE!"},{"$error":"#VALUE!"}]
[null,null,null,null,null,null,null,null,{"$f":"IF(Results!C134=\"\",\"\",Results!B134)","v":""},null,"",null,{"$error":"#VALUE!"},{"$error":"#VALUE!"},{"$error":"#VALUE!"},{"$error":"#VALUE!"},{"$error":"#VALUE!"},{"$error":"#VALUE!"},{"$error":"#VALUE!"},{"$error":"#VALUE!"},{"$error":"#VALUE!"},{"$error":"#VALUE!"}]
[null,null,null,null,null,null,null,null,{"$f":"IF(Results!C135=\"\",\"\",Results!B135)","v":""},null,"",null,{"$error":"#VALUE!"},{"$error":"#VALUE!"},{"$error":"#VALUE!"},{"$error":"#VALUE!"},{"$error":"#VALUE!"},{"$error":"#VALUE!"},{"$error":"#VALUE!"},{"$error":"#VALUE!"},{"$error":"#VALUE!"},{"$error":"#VALUE!"}]
[null,null,null,null,null,null,null,null,{"$f":"IF(Results!C136=\"\",\"\",Results!B136)","v":""},null,"",null,{"$error":"#VALUE!"},{"$error":"#VALUE!"},{"$error":"#VALUE!"},{"$error":"#VALUE!"},{"$error":"#VALUE!"},{"$error":"#VALUE!"},{"$error":"#VALUE!"},{"$error":"#VALUE!"},{"$error":"#VALUE!"},{"$error":"#VALUE!"}]
[null,null,null,null,null,null,null,null,{"$f":"IF(Results!C137=\"\",\"\",Results!B137)","v":""},null,"",null,{"$error":"#VALUE!"},{"$error":"#VALUE!"},{"$error":"#VALUE!"},{"$error":"#VALUE!"},{"$error":"#VALUE!"},{"$error":"#VALUE!"},{"$error":"#VALUE!"},{"$error":"#VALUE!"},{"$error":"#VALUE!"},{"$error":"#VALUE!"}]
[null,null,null,null,null,null,null,null,{"$f":"IF(Results!C138=\"\",\"\",Results!B138)","v":""},null,"",null,{"$error":"#VALUE!"},{"$error":"#VALUE!"},{"$error":"#VALUE!"},{"$error":"#VALUE!"},{"$error":"#VALUE!"},{"$error":"#VALUE!"},{"$error":"#VALUE!"},{"$error":"#VALUE!"},{"$error":"#VALUE!"},{"$error":"#VALUE!"}]
[null,null,null,null,null,null,null,null,{"$f":"IF(Results!C139=\"\",\"\",Results!B139)","v":""},null,"",null,{"$error":"#VALUE!"},{"$error":"#VALUE!"},{"$error":"#VALUE!"},{"$error":"#VALUE!"},{"$error":"#VALUE!"},{"$error":"#VALUE!"},{"$error":"#VALUE!"},{"$error":"#VALUE!"},{"$error":"#VALUE!"},{"$error":"#VALUE!"}]
[null,null,null,null,null,null,null,null,{"$f":"IF(Results!C140=\"\",\"\",Results!B140)","v":""},null,"",null,{"$error":"#VALUE!"},{"$error":"#VALUE!"},{"$error":"#VALUE!"},{"$error":"#VALUE!"},{"$error":"#VALUE!"},{"$error":"#VALUE!"},{"$error":"#VALUE!"},{"$error":"#VALUE!"},{"$error":"#VALUE!"},{"$error":"#VALUE!"}]
[null,null,null,null,null,null,null,null,{"$f":"IF(Results!C141=\"\",\"\",Results!B141)","v":""},null,"",null,{"$error":"#VALUE!"},{"$error":"#VALUE!"},{"$error":"#VALUE!"},{"$error":"#VALUE!"},{"$error":"#VALUE!"},{"$error":"#VALUE!"},{"$error":"#VALUE!"},{"$error":"#VALUE!"},{"$error":"#VALUE!"},{"$error":"#VALUE!"}]
[null,null,null,null,null,null,null,null,{"$f":"IF(Results!C142=\"\",\"\",Results!B142)","v":""},null,"",null,{"$error":"#VALUE!"},{"$error":"#VALUE!"},{"$error":"#VALUE!"},{"$error":"#VALUE!"},{"$error":"#VALUE!"},{"$error":"#VALUE!"},{"$error":"#VALUE!"},{"$error":"#VALUE!"},{"$error":"#VALUE!"},{"$error":"#VALUE!"}]
[null,null,null,null,null,null,null,null,{"$f":"IF(Results!C143=\"\",\"\",Results!B143)","v":""},null,"",null,{"$error":"#VALUE!"},{"$error":"#VALUE!"},{"$error":"#VALUE!"},{"$error":"#VALUE!"},{"$error":"#VALUE!"},{"$error":"#VALUE!"},{"$error":"#VALUE!"},{"$error":"#VALUE!"},{"$error":"#VALUE!"},{"$error":"#VALUE!"}]
[null,null,null,null,null,null,null,null,{"$f":"IF(Results!C144=\"\",\"\",Results!B144)","v":""},null,"",null,{"$error":"#VALUE!"},{"$error":"#VALUE!"},{"$error":"#VALUE!"},{"$error":"#VALUE!"},{"$error":"#VALUE!"},{"$error":"#VALUE!"},{"$error":"#VALUE!"},{"$error":"#VALUE!"},{"$error":"#VALUE!"},{"$error":"#VALUE!"}]
[null,null,null,null,null,null,null,null,{"$f":"IF(Results!C145=\"\",\"\",Results!B145)","v":""},null,"",null,{"$error":"#VALUE!"},{"$error":"#VALUE!"},{"$error":"#VALUE!"},{"$error":"#VALUE!"},{"$error":"#VALUE!"},{"$error":"#VALUE!"},{"$error":"#VALUE!"},{"$error":"#VALUE!"},{"$error":"#VALUE!"},{"$error":"#VALUE!"}]
[null,null,null,null,null,null,null,null,{"$f":"IF(Results!C146=\"\",\"\",Results!B146)","v":""},null,"",null,{"$error":"#VALUE!"},{"$error":"#VALUE!"},{"$error":"#VALUE!"},{"$error":"#VALUE!"},{"$error":"#VALUE!"},{"$error":"#VALUE!"},{"$error":"#VALUE!"},{"$error":"#VALUE!"},{"$error":"#VALUE!"},{"$error":"#VALUE!"}]
[null,null,null,null,null,null,null,null,{"$f":"IF(Results!C147=\"\",\"\",Results!B147)","v":""},null,"",null,{"$error":"#VALUE!"},{"$error":"#VALUE!"},{"$error":"#VALUE!"},{"$error":"#VALUE!"},{"$error":"#VALUE!"},{"$error":"#VALUE!"},{"$error":"#VALUE!"},{"$error":"#VALUE!"},{"$error":"#VALUE!"},{"$error":"#VALUE!"}]
[null,null,null,null,null,null,null,null,{"$f":"IF(Results!C148=\"\",\"\",Results!B148)","v":""},null,"",null,{"$error":"#VALUE!"},{"$error":"#VALUE!"},{"$error":"#VALUE!"},{"$error":"#VALUE!"},{"$error":"#VALUE!"},{"$error":"#VALUE!"},{"$error":"#VALUE!"},{"$error":"#VALUE!"},{"$error":"#VALUE!"},{"$error":"#VALUE!"}]
[null,null,null,null,null,null,null,null,{"$f":"IF(Results!C149=\"\",\"\",Results!B149)","v":""},null,"",null,{"$error":"#VALUE!"},{"$error":"#VALUE!"},{"$error":"#VALUE!"},{"$error":"#VALUE!"},{"$error":"#VALUE!"},{"$error":"#VALUE!"},{"$error":"#VALUE!"},{"$error":"#VALUE!"},{"$error":"#VALUE!"},{"$error":"#VALUE!"}]
[null,null,null,null,null,null,null,null,{"$f":"IF(Results!C150=\"\",\"\",Results!B150)","v":""},null,"",null,{"$error":"#VALUE!"},{"$error":"#VALUE!"},{"$error":"#VALUE!"},{"$error":"#VALUE!"},{"$error":"#VALUE!"},{"$error":"#VALUE!"},{"$error":"#VALUE!"},{"$error":"#VALUE!"},{"$error":"#VALUE!"},{"$error":"#VALUE!"}]
[null,null,null,null,null,null,null,null,{"$f":"IF(Results!C151=\"\",\"\",Results!B151)","v":""},null,"",null,{"$error":"#VALUE!"},{"$error":"#VALUE!"},{"$error":"#VALUE!"},{"$error":"#VALUE!"},{"$error":"#VALUE!"},{"$error":"#VALUE!"},{"$error":"#VALUE!"},{"$error":"#VALUE!"},{"$error":"#VALUE!"},{"$error":"#VALUE!"}]
[null,null,null,null,null,null,null,null,{"$f":"IF(Results!C152=\"\",\"\",Results!B152)","v":""},null,"",null,{"$error":"#VALUE!"},{"$error":"#VALUE!"},{"$error":"#VALUE!"},{"$error":"#VALUE!"},{"$error":"#VALUE!"},{"$error":"#VALUE!"},{"$error":"#VALUE!"},{"$error":"#VALUE!"},{"$error":"#VALUE!"},{"$error":"#VALUE!"}]
[null,null,null,null,null,null,null,null,{"$f":"IF(Results!C153=\"\",\"\",Results!B153)","v":""},null,"",null,{"$error":"#VALUE!"},{"$error":"#VALUE!"},{"$error":"#VALUE!"},{"$error":"#VALUE!"},{"$error":"#VALUE!"},{"$error":"#VALUE!"},{"$error":"#VALUE!"},{"$error":"#VALUE!"},{"$error":"#VALUE!"},{"$error":"#VALUE!"}]
[null,null,null,null,null,null,null,null,{"$f":"IF(Results!C154=\"\",\"\",Results!B154)","v":""},null,"",null,{"$error":"#VALUE!"},{"$error":"#VALUE!"},{"$error":"#VALUE!"},{"$error":"#VALUE!"},{"$error":"#VALUE!"},{"$error":"#VALUE!"},{"$error":"#VALUE!"},{"$error":"#VALUE!"},{"$error":"#VALUE!"},{"$error":"#VALUE!"}]
[null,null,null,null,null,null,null,null,{"$f":"IF(Results!C155=\"\",\"\",Results!B155)","v":""},null,"",null,{"$error":"#VALUE!"},{"$error":"#VALUE!"},{"$error":"#VALUE!"},{"$error":"#VALUE!"},{"$error":"#VALUE!"},{"$error":"#VALUE!"},{"$error":"#VALUE!"},{"$error":"#VALUE!"},{"$error":"#VALUE!"},{"$error":"#VALUE!"}]
[null,null,null,null,null,null,null,null,{"$f":"IF(Results!C156=\"\",\"\",Results!B156)","v":""},null,"",null,{"$error":"#VALUE!"},{"$error":"#VALUE!"},{"$error":"#VALUE!"},{"$error":"#VALUE!"},{"$error":"#VALUE!"},{"$error":"#VALUE!"},{"$error":"#VALUE!"},{"$error":"#VALUE!"},{"$error":"#VALUE!"},{"$error":"#VALUE!"}]
[null,null,null,null,null,null,null,null,{"$f":"IF(Results!C157=\"\",\"\",Results!B157)","v":""},null,"",null,{"$error":"#VALUE!"},{"$error":"#VALUE!"},{"$error":"#VALUE!"},{"$error":"#VALUE!"},{"$error":"#VALUE!"},{"$error":"#VALUE!"},{"$error":"#VALUE!"},{"$error":"#VALUE!"},{"$error":"#VALUE!"},{"$error":"#VALUE!"}]
[null,null,null,null,null,null,null,null,{"$f":"IF(Results!C158=\"\",\"\",Results!B158)","v":""},null,"",null,{"$error":"#VALUE!"},{"$error":"#VALUE!"},{"$error":"#VALUE!"},{"$error":"#VALUE!"},{"$error":"#VALUE!"},{"$error":"#VALUE!"},{"$error":"#VALUE!"},{"$error":"#VALUE!"},{"$error":"#VALUE!"},{"$error":"#VALUE!"}]
[null,null,null,null,null,null,null,null,{"$f":"IF(Results!C159=\"\",\"\",Results!B159)","v":""},null,"",null,{"$error":"#VALUE!"},{"$error":"#VALUE!"},{"$error":"#VALUE!"},{"$error":"#VALUE!"},{"$error":"#VALUE!"},{"$error":"#VALUE!"},{"$error":"#VALUE!"},{"$error":"#VALUE!"},{"$error":"#VALUE!"},{"$error":"#VALUE!"}]
[null,null,null,null,null,null,null,null,{"$f":"IF(Results!C160=\"\",\"\",Results!B160)","v":""},null,"",null,{"$error":"#VALUE!"},{"$error":"#VALUE!"},{"$error":"#VALUE!"},{"$error":"#VALUE!"},{"$error":"#VALUE!"},{"$error":"#VALUE!"},{"$error":"#VALUE!"},{"$error":"#VALUE!"},{"$error":"#VALUE!"},{"$error":"#VALUE!"}]
[null,null,null,null,null,null,null,null,{"$f":"IF(Results!C161=\"\",\"\",Results!B161)","v":""},null,"",null,{"$error":"#VALUE!"},{"$error":"#VALUE!"},{"$error":"#VALUE!"},{"$error":"#VALUE!"},{"$error":"#VALUE!"},{"$error":"#VALUE!"},{"$error":"#VALUE!"},{"$error":"#VALUE!"},{"$error":"#VALUE!"},{"$error":"#VALUE!"}]
[null,null,null,null,null,null,null,null,{"$f":"IF(Results!C162=\"\",\"\",Results!B162)","v":""},null,"",null,{"$error":"#VALUE!"},{"$error":"#VALUE!"},{"$error":"#VALUE!"},{"$error":"#VALUE!"},{"$error":"#VALUE!"},{"$error":"#VALUE!"},{"$error":"#VALUE!"},{"$error":"#VALUE!"},{"$error":"#VALUE!"},{"$error":"#VALUE!"}]
[null,null,null,null,null,null,null,null,{"$f":"IF(Results!C163=\"\",\"\",Results!B163)","v":""},null,"",null,{"$error":"#VALUE!"},{"$error":"#VALUE!"},{"$error":"#VALUE!"},{"$error":"#VALUE!"},{"$error":"#VALUE!"},{"$error":"#VALUE!"},{"$error":"#VALUE!"},{"$error":"#VALUE!"},{"$error":"#VALUE!"},{"$error":"#VALUE!"}]
[null,null,null,null,null,null,null,null,{"$f":"IF(Results!C164=\"\",\"\",Results!B164)","v":""},null,"",null,{"$error":"#VALUE!"},{"$error":"#VALUE!"},{"$error":"#VALUE!"},{"$error":"#VALUE!"},{"$error":"#VALUE!"},{"$error":"#VALUE!"},{"$error":"#VALUE!"},{"$error":"#VALUE!"},{"$error":"#VALUE!"},{"$error":"#VALUE!"}]
[null,null,null,null,null,null,null,null,{"$f":"IF(Results!C165=\"\",\"\",Results!B165)","v":""},null,"",null,{"$error":"#VALUE!"},{"$error":"#VALUE!"},{"$error":"#VALUE!"},{"$error":"#VALUE!"},{"$error":"#VALUE!"},{"$error":"#VALUE!"},{"$error":"#VALUE!"},{"$error":"#VALUE!"},{"$error":"#VALUE!"},{"$error":"#VALUE!"}]
[null,null,null,null,null,null,null,null,{"$f":"IF(Results!C166=\"\",\"\",Results!B166)","v":""},null,"",null,{"$error":"#VALUE!"},{"$error":"#VALUE!"},{"$error":"#VALUE!"},{"$error":"#VALUE!"},{"$error":"#VALUE!"},{"$error":"#VALUE!"},{"$error":"#VALUE!"},{"$error":"#VALUE!"},{"$error":"#VALUE!"},{"$error":"#VALUE!"}]
[null,null,null,null,null,null,null,null,{"$f":"IF(Results!C167=\"\",\"\",Results!B167)","v":""},null,"",null,{"$error":"#VALUE!"},{"$error":"#VALUE!"},{"$error":"#VALUE!"},{"$error":"#VALUE!"},{"$error":"#VALUE!"},{"$error":"#VALUE!"},{"$error":"#VALUE!"},{"$error":"#VALUE!"},{"$error":"#VALUE!"},{"$error":"#VALUE!"}]
[null,null,null,null,null,null,null,null,{"$f":"IF(Results!C168=\"\",\"\",Results!B168)","v":""},null,{"$f":"IF($C$6=\"\",\"\",IF(I168=\"\",\"\",50-SUM(Q168:V168)))","v":""},null,{"$f":"SEARCH($C$6,J168)","v":{"$error":"#VALUE!"}},{"$f":"SEARCH($D$6,J168)","v":{"$error":"#VALUE!"}},{"$f":"SEARCH($E$6,J168)","v":{"$error":"#VALUE!"}},{"$f":"SEARCH($F$6,J168)","v":{"$error":"#VALUE!"}},{"$f":"IF((N168-M168)<0,$C$8,0)","v":{"$error":"#VALUE!"}},{"$f":"IF((O168-M168)<0,$C$8+$D$8,0)","v":{"$error":"#VALUE!"}},{"$f":"IF((P168-M168)<0,$C$8+$D$8+$E$8,0)","v":{"$error":"#VALUE!"}},{"$f":"IF((O168-N168)<0,$D$8,0)","v":{"$error":"#VALUE!"}},{"$f":"IF((P168-N168)<0,$D$8+$E$8,0)","v":{"$error":"#VALUE!"}},{"$f":"IF((P168-O168)<0,$E$8,0)","v":{"$error":"#VALUE!"}}]
[null,null,null,null,null,null,null,null,{"$f":"IF(Results!C169=\"\",\"\",Results!B169)","v":""},null,"",null,{"$error":"#VALUE!"},{"$error":"#VALUE!"},{"$error":"#VALUE!"},{"$error":"#VALUE!"},{"$error":"#VALUE!"},{"$error":"#VALUE!"},{"$error":"#VALUE!"},{"$error":"#VALUE!"},{"$error":"#VALUE!"},{"$error":"#VALUE!"}]
[null,null,null,null,null,null,null,null,{"$f":"IF(Results!C170=\"\",\"\",Results!B170)","v":""},null,"",null,{"$error":"#VALUE!"},{"$error":"#VALUE!"},{"$error":"#VALUE!"},{"$error":"#VALUE!"},{"$error":"#VALUE!"},{"$error":"#VALUE!"},{"$error":"#VALUE!"},{"$error":"#VALUE!"},{"$error":"#VALUE!"},{"$error":"#VALUE!"}]
[null,null,null,null,null,null,null,null,{"$f":"IF(Results!C171=\"\",\"\",Results!B171)","v":""},null,"",null,{"$error":"#VALUE!"},{"$error":"#VALUE!"},{"$error":"#VALUE!"},{"$error":"#VALUE!"},{"$error":"#VALUE!"},{"$error":"#VALUE!"},{"$error":"#VALUE!"},{"$error":"#VALUE!"},{"$error":"#VALUE!"},{"$error":"#VALUE!"}]
[null,null,null,null,null,null,null,null,{"$f":"IF(Results!C172=\"\",\"\",Results!B172)","v":""},null,"",null,{"$error":"#VALUE!"},{"$error":"#VALUE!"},{"$error":"#VALUE!"},{"$error":"#VALUE!"},{"$error":"#VALUE!"},{"$error":"#VALUE!"},{"$error":"#VALUE!"},{"$error":"#VALUE!"},{"$error":"#VALUE!"},{"$error":"#VALUE!"}]
[null,null,null,null,null,null,null,null,{"$f":"IF(Results!C173=\"\",\"\",Results!B173)","v":""},null,"",null,{"$error":"#VALUE!"},{"$error":"#VALUE!"},{"$error":"#VALUE!"},{"$error":"#VALUE!"},{"$error":"#VALUE!"},{"$error":"#VALUE!"},{"$error":"#VALUE!"},{"$error":"#VALUE!"},{"$error":"#VALUE!"},{"$error":"#VALUE!"}]
[null,null,null,null,null,null,null,null,{"$f":"IF(Results!C174=\"\",\"\",Results!B174)","v":""},null,"",null,{"$error":"#VALUE!"},{"$error":"#VALUE!"},{"$error":"#VALUE!"},{"$error":"#VALUE!"},{"$error":"#VALUE!"},{"$error":"#VALUE!"},{"$error":"#VALUE!"},{"$error":"#VALUE!"},{"$error":"#VALUE!"},{"$error":"#VALUE!"}]
[null,null,null,null,null,null,null,null,{"$f":"IF(Results!C175=\"\",\"\",Results!B175)","v":""},null,"",null,{"$error":"#VALUE!"},{"$error":"#VALUE!"},{"$error":"#VALUE!"},{"$error":"#VALUE!"},{"$error":"#VALUE!"},{"$error":"#VALUE!"},{"$error":"#VALUE!"},{"$error":"#VALUE!"},{"$error":"#VALUE!"},{"$error":"#VALUE!"}]
[null,null,null,null,null,null,null,null,{"$f":"IF(Results!C176=\"\",\"\",Results!B176)","v":""},null,"",null,{"$error":"#VALUE!"},{"$error":"#VALUE!"},{"$error":"#VALUE!"},{"$error":"#VALUE!"},{"$error":"#VALUE!"},{"$error":"#VALUE!"},{"$error":"#VALUE!"},{"$error":"#VALUE!"},{"$error":"#VALUE!"},{"$error":"#VALUE!"}]
[null,null,null,null,null,null,null,null,{"$f":"IF(Results!C177=\"\",\"\",Results!B177)","v":""},null,"",null,{"$error":"#VALUE!"},{"$error":"#VALUE!"},{"$error":"#VALUE!"},{"$error":"#VALUE!"},{"$error":"#VALUE!"},{"$error":"#VALUE!"},{"$error":"#VALUE!"},{"$error":"#VALUE!"},{"$error":"#VALUE!"},{"$error":"#VALUE!"}]
[null,null,null,null,null,null,null,null,{"$f":"IF(Results!C178=\"\",\"\",Results!B178)","v":""},null,"",null,{"$error":"#VALUE!"},{"$error":"#VALUE!"},{"$error":"#VALUE!"},{"$error":"#VALUE!"},{"$error":"#VALUE!"},{"$error":"#VALUE!"},{"$error":"#VALUE!"},{"$error":"#VALUE!"},{"$error":"#VALUE!"},{"$error":"#VALUE!"}]
[null,null,null,null,null,null,null,null,{"$f":"IF(Results!C179=\"\",\"\",Results!B179)","v":""},null,"",null,{"$error":"#VALUE!"},{"$error":"#VALUE!"},{"$error":"#VALUE!"},{"$error":"#VALUE!"},{"$error":"#VALUE!"},{"$error":"#VALUE!"},{"$error":"#VALUE!"},{"$error":"#VALUE!"},{"$error":"#VALUE!"},{"$error":"#VALUE!"}]
[null,null,null,null,null,null,null,null,{"$f":"IF(Results!C180=\"\",\"\",Results!B180)","v":""},null,"",null,{"$error":"#VALUE!"},{"$error":"#VALUE!"},{"$error":"#VALUE!"},{"$error":"#VALUE!"},{"$error":"#VALUE!"},{"$error":"#VALUE!"},{"$error":"#VALUE!"},{"$error":"#VALUE!"},{"$error":"#VALUE!"},{"$error":"#VALUE!"}]
[null,null,null,null,null,null,null,null,{"$f":"IF(Results!C181=\"\",\"\",Results!B181)","v":""},null,"",null,{"$error":"#VALUE!"},{"$error":"#VALUE!"},{"$error":"#VALUE!"},{"$error":"#VALUE!"},{"$error":"#VALUE!"},{"$error":"#VALUE!"},{"$error":"#VALUE!"},{"$error":"#VALUE!"},{"$error":"#VALUE!"},{"$error":"#VALUE!"}]
[null,null,null,null,null,null,null,null,{"$f":"IF(Results!C182=\"\",\"\",Results!B182)","v":""},null,"",null,{"$error":"#VALUE!"},{"$error":"#VALUE!"},{"$error":"#VALUE!"},{"$error":"#VALUE!"},{"$error":"#VALUE!"},{"$error":"#VALUE!"},{"$error":"#VALUE!"},{"$error":"#VALUE!"},{"$error":"#VALUE!"},{"$error":"#VALUE!"}]
[null,null,null,null,null,null,null,null,{"$f":"IF(Results!C183=\"\",\"\",Results!B183)","v":""},null,"",null,{"$error":"#VALUE!"},{"$error":"#VALUE!"},{"$error":"#VALUE!"},{"$error":"#VALUE!"},{"$error":"#VALUE!"},{"$error":"#VALUE!"},{"$error":"#VALUE!"},{"$error":"#VALUE!"},{"$error":"#VALUE!"},{"$error":"#VALUE!"}]
[null,null,null,null,null,null,null,null,{"$f":"IF(Results!C184=\"\",\"\",Results!B184)","v":""},null,"",null,{"$error":"#VALUE!"},{"$error":"#VALUE!"},{"$error":"#VALUE!"},{"$error":"#VALUE!"},{"$error":"#VALUE!"},{"$error":"#VALUE!"},{"$error":"#VALUE!"},{"$error":"#VALUE!"},{"$error":"#VALUE!"},{"$error":"#VALUE!"}]
[null,null,null,null,null,null,null,null,{"$f":"IF(Results!C185=\"\",\"\",Results!B185)","v":""},null,"",null,{"$error":"#VALUE!"},{"$error":"#VALUE!"},{"$error":"#VALUE!"},{"$error":"#VALUE!"},{"$error":"#VALUE!"},{"$error":"#VALUE!"},{"$error":"#VALUE!"},{"$error":"#VALUE!"},{"$error":"#VALUE!"},{"$error":"#VALUE!"}]
[null,null,null,null,null,null,null,null,{"$f":"IF(Results!C186=\"\",\"\",Results!B186)","v":""},null,"",null,{"$error":"#VALUE!"},{"$error":"#VALUE!"},{"$error":"#VALUE!"},{"$error":"#VALUE!"},{"$error":"#VALUE!"},{"$error":"#VALUE!"},{"$error":"#VALUE!"},{"$error":"#VALUE!"},{"$error":"#VALUE!"},{"$error":"#VALUE!"}]
[null,null,null,null,null,null,null,null,{"$f":"IF(Results!C187=\"\",\"\",Results!B187)","v":""},null,"",null,{"$error":"#VALUE!"},{"$error":"#VALUE!"},{"$error":"#VALUE!"},{"$error":"#VALUE!"},{"$error":"#VALUE!"},{"$error":"#VALUE!"},{"$error":"#VALUE!"},{"$error":"#VALUE!"},{"$error":"#VALUE!"},{"$error":"#VALUE!"}]
[null,null,null,null,null,null,null,null,{"$f":"IF(Results!C188=\"\",\"\",Results!B188)","v":""},null,"",null,{"$error":"#VALUE!"},{"$error":"#VALUE!"},{"$error":"#VALUE!"},{"$error":"#VALUE!"},{"$error":"#VALUE!"},{"$error":"#VALUE!"},{"$error":"#VALUE!"},{"$error":"#VALUE!"},{"$error":"#VALUE!"},{"$error":"#VALUE!"}]
[null,null,null,null,null,null,null,null,{"$f":"IF(Results!C189=\"\",\"\",Results!B189)","v":""},null,"",null,{"$error":"#VALUE!"},{"$error":"#VALUE!"},{"$error":"#VALUE!"},{"$error":"#VALUE!"},{"$error":"#VALUE!"},{"$error":"#VALUE!"},{"$error":"#VALUE!"},{"$error":"#VALUE!"},{"$error":"#VALUE!"},{"$error":"#VALUE!"}]
[null,null,null,null,null,null,null,null,{"$f":"IF(Results!C190=\"\",\"\",Results!B190)","v":""},null,"",null,{"$error":"#VALUE!"},{"$error":"#VALUE!"},{"$error":"#VALUE!"},{"$error":"#VALUE!"},{"$error":"#VALUE!"},{"$error":"#VALUE!"},{"$error":"#VALUE!"},{"$error":"#VALUE!"},{"$error":"#VALUE!"},{"$error":"#VALUE!"}]
[null,null,null,null,null,null,null,null,{"$f":"IF(Results!C191=\"\",\"\",Results!B191)","v":""},null,"",null,{"$error":"#VALUE!"},{"$error":"#VALUE!"},{"$error":"#VALUE!"},{"$error":"#VALUE!"},{"$error":"#VALUE!"},{"$error":"#VALUE!"},{"$error":"#VALUE!"},{"$error":"#VALUE!"},{"$error":"#VALUE!"},{"$error":"#VALUE!"}]
[null,null,null,null,null,null,null,null,{"$f":"IF(Results!C192=\"\",\"\",Results!B192)","v":""},null,"",null,{"$error":"#VALUE!"},{"$error":"#VALUE!"},{"$error":"#VALUE!"},{"$error":"#VALUE!"},{"$error":"#VALUE!"},{"$error":"#VALUE!"},{"$error":"#VALUE!"},{"$error":"#VALUE!"},{"$error":"#VALUE!"},{"$error":"#VALUE!"}]
[null,null,null,null,null,null,null,null,{"$f":"IF(Results!C193=\"\",\"\",Results!B193)","v":""},null,"",null,{"$error":"#VALUE!"},{"$error":"#VALUE!"},{"$error":"#VALUE!"},{"$error":"#VALUE!"},{"$error":"#VALUE!"},{"$error":"#VALUE!"},{"$error":"#VALUE!"},{"$error":"#VALUE!"},{"$error":"#VALUE!"},{"$error":"#VALUE!"}]
[null,null,null,null,null,null,null,null,{"$f":"IF(Results!C194=\"\",\"\",Results!B194)","v":""},null,"",null,{"$error":"#VALUE!"},{"$error":"#VALUE!"},{"$error":"#VALUE!"},{"$error":"#VALUE!"},{"$error":"#VALUE!"},{"$error":"#VALUE!"},{"$error":"#VALUE!"},{"$error":"#VALUE!"},{"$error":"#VALUE!"},{"$error":"#VALUE!"}]
[null,null,null,null,null,null,null,null,{"$f":"IF(Results!C195=\"\",\"\",Results!B195)","v":""},null,"",null,{"$error":"#VALUE!"},{"$error":"#VALUE!"},{"$error":"#VALUE!"},{"$error":"#VALUE!"},{"$error":"#VALUE!"},{"$error":"#VALUE!"},{"$error":"#VALUE!"},{"$error":"#VALUE!"},{"$error":"#VALUE!"},{"$error":"#VALUE!"}]
[null,null,null,null,null,null,null,null,{"$f":"IF(Results!C196=\"\",\"\",Results!B196)","v":""},null,"",null,{"$error":"#VALUE!"},{"$error":"#VALUE!"},{"$error":"#VALUE!"},{"$error":"#VALUE!"},{"$error":"#VALUE!"},{"$error":"#VALUE!"},{"$error":"#VALUE!"},{"$error":"#VALUE!"},{"$error":"#VALUE!"},{"$error":"#VALUE!"}]
[null,null,null,null,null,null,null,null,{"$f":"IF(Results!C197=\"\",\"\",Results!B197)","v":""},null,"",null,{"$error":"#VALUE!"},{"$error":"#VALUE!"},{"$error":"#VALUE!"},{"$error":"#VALUE!"},{"$error":"#VALUE!"},{"$error":"#VALUE!"},{"$error":"#VALUE!"},{"$error":"#VALUE!"},{"$error":"#VALUE!"},{"$error":"#VALUE!"}]
[null,null,null,null,null,null,null,null,{"$f":"IF(Results!C198=\"\",\"\",Results!B198)","v":""},null,"",null,{"$error":"#VALUE!"},{"$error":"#VALUE!"},{"$error":"#VALUE!"},{"$error":"#VALUE!"},{"$error":"#VALUE!"},{"$error":"#VALUE!"},{"$error":"#VALUE!"},{"$error":"#VALUE!"},{"$error":"#VALUE!"},{"$error":"#VALUE!"}]
[null,null,null,null,null,null,null,null,{"$f":"IF(Results!C199=\"\",\"\",Results!B199)","v":""},null,"",null,{"$error":"#VALUE!"},{"$error":"#VALUE!"},{"$error":"#VALUE!"},{"$error":"#VALUE!"},{"$error":"#VALUE!"},{"$error":"#VALUE!"},{"$error":"#VALUE!"},{"$error":"#VALUE!"},{"$error":"#VALUE!"},{"$error":"#VALUE!"}]
[null,null,null,null,null,null,null,null,{"$f":"IF(Results!C200=\"\",\"\",Results!B200)","v":""},null,"",null,{"$error":"#VALUE!"},{"$error":"#VALUE!"},{"$error":"#VALUE!"},{"$error":"#VALUE!"},{"$error":"#VALUE!"},{"$error":"#VALUE!"},{"$error":"#VALUE!"},{"$error":"#VALUE!"},{"$error":"#VALUE!"},{"$error":"#VALUE!"}]
[null,null,null,null,null,null,null,null,{"$f":"IF(Results!C201=\"\",\"\",Results!B201)","v":""},null,"",null,{"$error":"#VALUE!"},{"$error":"#VALUE!"},{"$error":"#VALUE!"},{"$error":"#VALUE!"},{"$error":"#VALUE!"},{"$error":"#VALUE!"},{"$error":"#VALUE!"},{"$error":"#VALUE!"},{"$error":"#VALUE!"},{"$error":"#VALUE!"}]
[null,null,null,null,null,null,null,null,{"$f":"IF(Results!C202=\"\",\"\",Results!B202)","v":""},null,"",null,{"$error":"#VALUE!"},{"$error":"#VALUE!"},{"$error":"#VALUE!"},{"$error":"#VALUE!"},{"$error":"#VALUE!"},{"$error":"#VALUE!"},{"$error":"#VALUE!"},{"$error":"#VALUE!"},{"$error":"#VALUE!"},{"$error":"#VALUE!"}]
[null,null,null,null,null,null,null,null,{"$f":"IF(Results!C203=\"\",\"\",Results!B203)","v":""},null,"",null,{"$error":"#VALUE!"},{"$error":"#VALUE!"},{"$error":"#VALUE!"},{"$error":"#VALUE!"},{"$error":"#VALUE!"},{"$error":"#VALUE!"},{"$error":"#VALUE!"},{"$error":"#VALUE!"},{"$error":"#VALUE!"},{"$error":"#VALUE!"}]

{"sheet":"Group3","index":4,"n_rows":203,"n_cols":22,"rows_kept":203,"cut":false,"hidden":false,"merged":[[1,3,1,8]]}
[]
[null,null,"Group 3 :"]
[null,null,null,null,null,null,null,null,"Entrant No","Placings","Score",null,"J1","J2","J3","J4","PO","QO","RO","QP","RP","RQ"]
[null,null,null,null,null,null,null,null,{"$f":"IF(Results!C4=\"\",\"\",Results!B4)","v":""},null,{"$f":"IF($C$6=\"\",\"\",IF(I4=\"\",\"\",50-SUM(Q4:V4)))","v":""},null,{"$f":"SEARCH($C$6,J4)","v":{"$error":"#VALUE!"}},{"$f":"SEARCH($D$6,J4)","v":{"$error":"#VALUE!"}},{"$f":"SEARCH($E$6,J4)","v":{"$error":"#VALUE!"}},{"$f":"SEARCH($F$6,J4)","v":{"$error":"#VALUE!"}},{"$f":"IF((N4-M4)<0,$C$8,0)","v":{"$error":"#VALUE!"}},{"$f":"IF((O4-M4)<0,$C$8+$D$8,0)","v":{"$error":"#VALUE!"}},{"$f":"IF((P4-M4)<0,$C$8+$D$8+$E$8,0)","v":{"$error":"#VALUE!"}},{"$f":"IF((O4-N4)<0,$D$8,0)","v":{"$error":"#VALUE!"}},{"$f":"IF((P4-N4)<0,$D$8+$E$8,0)","v":{"$error":"#VALUE!"}},{"$f":"IF((P4-O4)<0,$E$8,0)","v":{"$error":"#VALUE!"}}]
[null,null,"Judge's Placings",null,null,null,null,null,{"$f":"IF(Results!C5=\"\",\"\",Results!B5)","v":""},null,{"$f":"IF($C$6=\"\",\"\",IF(I5=\"\",\"\",50-SUM(Q5:V5)))","v":""},null,{"$error":"#VALUE!"},{"$error":"#VALUE!"},{"$error":"#VALUE!"},{"$error":"#VALUE!"},{"$error":"#VALUE!"},{"$error":"#VALUE!"},{"$error":"#VALUE!"},{"$error":"#VALUE!"},{"$error":"#VALUE!"},{"$error":"#VALUE!"}]
[null,null,null,null,null,null,null,null,{"$f":"IF(Results!C6=\"\",\"\",Results!B6)","v":""},null,"",null,{"$error":"#VALUE!"},{"$error":"#VALUE!"},{"$error":"#VALUE!"},{"$error":"#VALUE!"},{"$error":"#VALUE!"},{"$error":"#VALUE!"},{"$error":"#VALUE!"},{"$error":"#VALUE!"},{"$error":"#VALUE!"},{"$error":"#VALUE!"}]
[null,null,"Judge's Cuts",null,null,null,null,null,{"$f":"IF(Results!C7=\"\",\"\",Results!B7)","v":""},null,"",null,{"$error":"#VALUE!"},{"$error":"#VALUE!"},{"$error":"#VALUE!"},{"$error":"#VALUE!"},{"$error":"#VALUE!"},{"$error":"#VALUE!"},{"$error":"#VALUE!"},{"$error":"#VALUE!"},{"$error":"#VALUE!"},{"$error":"#VALUE!"}]
[null,null,null,null,null,null,null,null,{"$f":"IF(Results!C8=\"\",\"\",Results!B8)","v":""},null,"",null,{"$error":"#VALUE!"},{"$error":"#VALUE!"},{"$error":"#VALUE!"},{"$error":"#VALUE!"},{"$error":"#VALUE!"},{"$error":"#VALUE!"},{"$error":"#VALUE!"},{"$error":"#VALUE!"},{"$error":"#VALUE!"},{"$error":"#VALUE!"}]
[null,null,null,null,null,null,null,null,{"$f":"IF(Results!C9=\"\",\"\",Results!B9)","v":""},null,"",null,{"$error":"#VALUE!"},{"$error":"#VALUE!"},{"$error":"#VALUE!"},{"$error":"#VALUE!"},{"$error":"#VALUE!"},{"$error":"#VALUE!"},{"$error":"#VALUE!"},{"$error":"#VALUE!"},{"$error":"#VALUE!"},{"$error":"#VALUE!"}]
[null,null,{"$f":"IF($C$8=\"\",\"\",IF(($C$8+$D$8+$E$8)<3,\"WARNING : Cuts total less than 3\",\"\"))","v":""},null,null,null,null,null,{"$f":"IF(Results!C10=\"\",\"\",Results!B10)","v":""},null,"",null,{"$error":"#VALUE!"},{"$error":"#VALUE!"},{"$error":"#VALUE!"},{"$error":"#VALUE!"},{"$error":"#VALUE!"},{"$error":"#VALUE!"},{"$error":"#VALUE!"},{"$error":"#VALUE!"},{"$error":"#VALUE!"},{"$error":"#VALUE!"}]
[null,null,{"$f":"IF(($C$8+$D$8+$E$8)>15,\"WARNING : Cuts total more than 15\",\"\")","v":""},null,null,null,null,null,{"$f":"IF(Results!C11=\"\",\"\",Results!B11)","v":""},null,"",null,{"$error":"#VALUE!"},{"$error":"#VALUE!"},{"$error":"#VALUE!"},{"$error":"#VALUE!"},{"$error":"#VALUE!"},{"$error":"#VALUE!"},{"$error":"#VALUE!"},{"$error":"#VALUE!"},{"$error":"#VALUE!"},{"$error":"#VALUE!"}]
[null,null,{"$f":"IF(AND(($C$8+$D$8+$E$8)>=15,$D$8>5),\"WARNING : Middle cut more than 5\",\"\")","v":""},null,null,null,null,null,{"$f":"IF(Results!C12=\"\",\"\",Results!B12)","v":""},null,"",null,{"$error":"#VALUE!"},{"$error":"#VALUE!"},{"$error":"#VALUE!"},{"$error":"#VALUE!"},{"$error":"#VALUE!"},{"$error":"#VALUE!"},{"$error":"#VALUE!"},{"$error":"#VALUE!"},{"$error":"#VALUE!"},{"$error":"#VALUE!"}]
[null,null,{"$f":"IF(AND(($C$8+$D$8+$E$8)=14,$D$8>8),\"WARNING : Middle cut more than 8\",\"\")","v":""},null,null,null,null,null,{"$f":"IF(Results!C13=\"\",\"\",Results!B13)","v":""},null,"",null,{"$error":"#VALUE!"},{"$error":"#VALUE!"},{"$error":"#VALUE!"},{"$error":"#VALUE!"},{"$error":"#VALUE!"},{"$error":"#VALUE!"},{"$error":"#VALUE!"},{"$error":"#VALUE!"},{"$error":"#VALUE!"},{"$error":"#VALUE!"}]
[null,null,{"$f":"IF(AND(C10=\"\",C11=\"\",C12=\"\",C13=\"\"),\"\",\"Please discuss with Judge\")","v":""},null,null,null,null,null,{"$f":"IF(Results!C14=\"\",\"\",Results!B14)","v":""},null,"",null,{"$error":"#VALUE!"},{"$error":"#VALUE!"},{"$error":"#VALUE!"},{"$error":"#VALUE!"},{"$error":"#VALUE!"},{"$error":"#VALUE!"},{"$error":"#VALUE!"},{"$error":"#VALUE!"},{"$error":"#VALUE!"},{"$error":"#VALUE!"}]
[null,null,null,null,null,null,null,null,{"$f":"IF(Results!C15=\"\",\"\",Results!B15)","v":""},null,"",null,{"$error":"#VALUE!"},{"$error":"#VALUE!"},{"$error":"#VALUE!"},{"$error":"#VALUE!"},{"$error":"#VALUE!"},{"$error":"#VALUE!"},{"$error":"#VALUE!"},{"$error":"#VALUE!"},{"$error":"#VALUE!"},{"$error":"#VALUE!"}]
[null,null,null,null,null,null,null,null,{"$f":"IF(Results!C16=\"\",\"\",Results!B16)","v":""},null,"",null,{"$error":"#VALUE!"},{"$error":"#VALUE!"},{"$error":"#VALUE!"},{"$error":"#VALUE!"},{"$error":"#VALUE!"},{"$error":"#VALUE!"},{"$error":"#VALUE!"},{"$error":"#VALUE!"},{"$error":"#VALUE!"},{"$error":"#VALUE!"}]
[null,null,null,null,null,null,null,null,{"$f":"IF(Results!C17=\"\",\"\",Results!B17)","v":""},null,"",null,{"$error":"#VALUE!"},{"$error":"#VALUE!"},{"$error":"#VALUE!"},{"$error":"#VALUE!"},{"$error":"#VALUE!"},{"$error":"#VALUE!"},{"$error":"#VALUE!"},{"$error":"#VALUE!"},{"$error":"#VALUE!"},{"$error":"#VALUE!"}]
[null,null,null,null,null,null,null,null,{"$f":"IF(Results!C18=\"\",\"\",Results!B18)","v":""},null,"",null,{"$error":"#VALUE!"},{"$error":"#VALUE!"},{"$error":"#VALUE!"},{"$error":"#VALUE!"},{"$error":"#VALUE!"},{"$error":"#VALUE!"},{"$error":"#VALUE!"},{"$error":"#VALUE!"},{"$error":"#VALUE!"},{"$error":"#VALUE!"}]
[null,null,null,null,null,null,null,null,{"$f":"IF(Results!C19=\"\",\"\",Results!B19)","v":""},null,"",null,{"$error":"#VALUE!"},{"$error":"#VALUE!"},{"$error":"#VALUE!"},{"$error":"#VALUE!"},{"$error":"#VALUE!"},{"$error":"#VALUE!"},{"$error":"#VALUE!"},{"$error":"#VALUE!"},{"$error":"#VALUE!"},{"$error":"#VALUE!"}]
[null,null,null,null,null,null,null,null,{"$f":"IF(Results!C20=\"\",\"\",Results!B20)","v":""},null,"",null,{"$error":"#VALUE!"},{"$error":"#VALUE!"},{"$error":"#VALUE!"},{"$error":"#VALUE!"},{"$error":"#VALUE!"},{"$error":"#VALUE!"},{"$error":"#VALUE!"},{"$error":"#VALUE!"},{"$error":"#VALUE!"},{"$error":"#VALUE!"}]
[null,null,null,null,null,null,null,null,{"$f":"IF(Results!C21=\"\",\"\",Results!B21)","v":""},null,"",null,{"$error":"#VALUE!"},{"$error":"#VALUE!"},{"$error":"#VALUE!"},{"$error":"#VALUE!"},{"$error":"#VALUE!"},{"$error":"#VALUE!"},{"$error":"#VALUE!"},{"$error":"#VALUE!"},{"$error":"#VALUE!"},{"$error":"#VALUE!"}]
[null,null,null,null,null,null,null,null,{"$f":"IF(Results!C22=\"\",\"\",Results!B22)","v":""},null,"",null,{"$error":"#VALUE!"},{"$error":"#VALUE!"},{"$error":"#VALUE!"},{"$error":"#VALUE!"},{"$error":"#VALUE!"},{"$error":"#VALUE!"},{"$error":"#VALUE!"},{"$error":"#VALUE!"},{"$error":"#VALUE!"},{"$error":"#VALUE!"}]
[null,null,null,null,null,null,null,null,{"$f":"IF(Results!C23=\"\",\"\",Results!B23)","v":""},null,"",null,{"$error":"#VALUE!"},{"$error":"#VALUE!"},{"$error":"#VALUE!"},{"$error":"#VALUE!"},{"$error":"#VALUE!"},{"$error":"#VALUE!"},{"$error":"#VALUE!"},{"$error":"#VALUE!"},{"$error":"#VALUE!"},{"$error":"#VALUE!"}]
[null,null,null,null,null,null,null,null,{"$f":"IF(Results!C24=\"\",\"\",Results!B24)","v":""},null,"",null,{"$f":"SEARCH($C$6,J24)","v":{"$error":"#VALUE!"}},{"$f":"SEARCH($D$6,J24)","v":{"$error":"#VALUE!"}},{"$f":"SEARCH($E$6,J24)","v":{"$error":"#VALUE!"}},{"$f":"SEARCH($F$6,J24)","v":{"$error":"#VALUE!"}},{"$f":"IF((N24-M24)<0,$C$8,0)","v":{"$error":"#VALUE!"}},{"$f":"IF((O24-M24)<0,$C$8+$D$8,0)","v":{"$error":"#VALUE!"}},{"$f":"IF((P24-M24)<0,$C$8+$D$8+$E$8,0)","v":{"$error":"#VALUE!"}},{"$f":"IF((O24-N24)<0,$D$8,0)","v":{"$error":"#VALUE!"}},{"$f":"IF((P24-N24)<0,$D$8+$E$8,0)","v":{"$error":"#VALUE!"}},{"$f":"IF((P24-O24)<0,$E$8,0)","v":{"$error":"#VALUE!"}}]
[null,null,null,null,null,null,null,null,{"$f":"IF(Results!C25=\"\",\"\",Results!B25)","v":""},null,"",null,{"$error":"#VALUE!"},{"$error":"#VALUE!"},{"$error":"#VALUE!"},{"$error":"#VALUE!"},{"$error":"#VALUE!"},{"$error":"#VALUE!"},{"$error":"#VALUE!"},{"$error":"#VALUE!"},{"$error":"#VALUE!"},{"$error":"#VALUE!"}]
[null,null,null,null,null,null,null,null,{"$f":"IF(Results!C26=\"\",\"\",Results!B26)","v":""},null,"",null,{"$error":"#VALUE!"},{"$error":"#VALUE!"},{"$error":"#VALUE!"},{"$error":"#VALUE!"},{"$error":"#VALUE!"},{"$error":"#VALUE!"},{"$error":"#VALUE!"},{"$error":"#VALUE!"},{"$error":"#VALUE!"},{"$error":"#VALUE!"}]
[null,null,null,null,null,null,null,null,{"$f":"IF(Results!C27=\"\",\"\",Results!B27)","v":""},null,"",null,{"$error":"#VALUE!"},{"$error":"#VALUE!"},{"$error":"#VALUE!"},{"$error":"#VALUE!"},{"$error":"#VALUE!"},{"$error":"#VALUE!"},{"$error":"#VALUE!"},{"$error":"#VALUE!"},{"$error":"#VALUE!"},{"$error":"#VALUE!"}]
[null,null,null,null,null,null,null,null,{"$f":"IF(Results!C28=\"\",\"\",Results!B28)","v":""},null,"",null,{"$error":"#VALUE!"},{"$error":"#VALUE!"},{"$error":"#VALUE!"},{"$error":"#VALUE!"},{"$error":"#VALUE!"},{"$error":"#VALUE!"},{"$error":"#VALUE!"},{"$error":"#VALUE!"},{"$error":"#VALUE!"},{"$error":"#VALUE!"}]
[null,null,null,null,null,null,null,null,{"$f":"IF(Results!C29=\"\",\"\",Results!B29)","v":""},null,"",null,{"$error":"#VALUE!"},{"$error":"#VALUE!"},{"$error":"#VALUE!"},{"$error":"#VALUE!"},{"$error":"#VALUE!"},{"$error":"#VALUE!"},{"$error":"#VALUE!"},{"$error":"#VALUE!"},{"$error":"#VALUE!"},{"$error":"#VALUE!"}]
[null,null,null,null,null,null,null,null,{"$f":"IF(Results!C30=\"\",\"\",Results!B30)","v":""},null,"",null,{"$error":"#VALUE!"},{"$error":"#VALUE!"},{"$error":"#VALUE!"},{"$error":"#VALUE!"},{"$error":"#VALUE!"},{"$error":"#VALUE!"},{"$error":"#VALUE!"},{"$error":"#VALUE!"},{"$error":"#VALUE!"},{"$error":"#VALUE!"}]
[null,null,null,null,null,null,null,null,{"$f":"IF(Results!C31=\"\",\"\",Results!B31)","v":""},null,"",null,{"$error":"#VALUE!"},{"$error":"#VALUE!"},{"$error":"#VALUE!"},{"$error":"#VALUE!"},{"$error":"#VALUE!"},{"$error":"#VALUE!"},{"$error":"#VALUE!"},{"$error":"#VALUE!"},{"$error":"#VALUE!"},{"$error":"#VALUE!"}]
[null,null,null,null,null,null,null,null,{"$f":"IF(Results!C32=\"\",\"\",Results!B32)","v":""},null,"",null,{"$error":"#VALUE!"},{"$error":"#VALUE!"},{"$error":"#VALUE!"},{"$error":"#VALUE!"},{"$error":"#VALUE!"},{"$error":"#VALUE!"},{"$error":"#VALUE!"},{"$error":"#VALUE!"},{"$error":"#VALUE!"},{"$error":"#VALUE!"}]
[null,null,null,null,null,null,null,null,{"$f":"IF(Results!C33=\"\",\"\",Results!B33)","v":""},null,"",null,{"$error":"#VALUE!"},{"$error":"#VALUE!"},{"$error":"#VALUE!"},{"$error":"#VALUE!"},{"$error":"#VALUE!"},{"$error":"#VALUE!"},{"$error":"#VALUE!"},{"$error":"#VALUE!"},{"$error":"#VALUE!"},{"$error":"#VALUE!"}]
[null,null,null,null,null,null,null,null,{"$f":"IF(Results!C34=\"\",\"\",Results!B34)","v":""},null,{"$f":"IF($C$6=\"\",\"\",IF(I34=\"\",\"\",50-SUM(Q34:V34)))","v":""},null,{"$f":"SEARCH($C$6,J34)","v":{"$error":"#VALUE!"}},{"$f":"SEARCH($D$6,J34)","v":{"$error":"#VALUE!"}},{"$f":"SEARCH($E$6,J34)","v":{"$error":"#VALUE!"}},{"$f":"SEARCH($F$6,J34)","v":{"$error":"#VALUE!"}},{"$f":"IF((N34-M34)<0,$C$8,0)","v":{"$error":"#VALUE!"}},{"$f":"IF((O34-M34)<0,$C$8+$D$8,0)","v":{"$error":"#VALUE!"}},{"$f":"IF((P34-M34)<0,$C$8+$D$8+$E$8,0)","v":{"$error":"#VALUE!"}},{"$f":"IF((O34-N34)<0,$D$8,0)","v":{"$error":"#VALUE!"}},{"$f":"IF((P34-N34)<0,$D$8+$E$8,0)","v":{"$error":"#VALUE!"}},{"$f":"IF((P34-O34)<0,$E$8,0)","v":{"$error":"#VALUE!"}}]
[null,null,null,null,null,null,null,null,{"$f":"IF(Results!C35=\"\",\"\",Results!B35)","v":""},null,"",null,{"$error":"#VALUE!"},{"$error":"#VALUE!"},{"$error":"#VALUE!"},{"$error":"#VALUE!"},{"$error":"#VALUE!"},{"$error":"#VALUE!"},{"$error":"#VALUE!"},{"$error":"#VALUE!"},{"$error":"#VALUE!"},{"$error":"#VALUE!"}]
[null,null,null,null,null,null,null,null,{"$f":"IF(Results!C36=\"\",\"\",Results!B36)","v":""},null,"",null,{"$error":"#VALUE!"},{"$error":"#VALUE!"},{"$error":"#VALUE!"},{"$error":"#VALUE!"},{"$error":"#VALUE!"},{"$error":"#VALUE!"},{"$error":"#VALUE!"},{"$error":"#VALUE!"},{"$error":"#VALUE!"},{"$error":"#VALUE!"}]
[null,null,null,null,null,null,null,null,{"$f":"IF(Results!C37=\"\",\"\",Results!B37)","v":""},null,"",null,{"$error":"#VALUE!"},{"$error":"#VALUE!"},{"$error":"#VALUE!"},{"$error":"#VALUE!"},{"$error":"#VALUE!"},{"$error":"#VALUE!"},{"$error":"#VALUE!"},{"$error":"#VALUE!"},{"$error":"#VALUE!"},{"$error":"#VALUE!"}]
[null,null,null,null,null,null,null,null,{"$f":"IF(Results!C38=\"\",\"\",Results!B38)","v":""},null,"",null,{"$error":"#VALUE!"},{"$error":"#VALUE!"},{"$error":"#VALUE!"},{"$error":"#VALUE!"},{"$error":"#VALUE!"},{"$error":"#VALUE!"},{"$error":"#VALUE!"},{"$error":"#VALUE!"},{"$error":"#VALUE!"},{"$error":"#VALUE!"}]
[null,null,null,null,null,null,null,null,{"$f":"IF(Results!C39=\"\",\"\",Results!B39)","v":""},null,"",null,{"$error":"#VALUE!"},{"$error":"#VALUE!"},{"$error":"#VALUE!"},{"$error":"#VALUE!"},{"$error":"#VALUE!"},{"$error":"#VALUE!"},{"$error":"#VALUE!"},{"$error":"#VALUE!"},{"$error":"#VALUE!"},{"$error":"#VALUE!"}]
[null,null,null,null,null,null,null,null,{"$f":"IF(Results!C40=\"\",\"\",Results!B40)","v":""},null,"",null,{"$error":"#VALUE!"},{"$error":"#VALUE!"},{"$error":"#VALUE!"},{"$error":"#VALUE!"},{"$error":"#VALUE!"},{"$error":"#VALUE!"},{"$error":"#VALUE!"},{"$error":"#VALUE!"},{"$error":"#VALUE!"},{"$error":"#VALUE!"}]
[null,null,null,null,null,null,null,null,{"$f":"IF(Results!C41=\"\",\"\",Results!B41)","v":""},null,"",null,{"$error":"#VALUE!"},{"$error":"#VALUE!"},{"$error":"#VALUE!"},{"$error":"#VALUE!"},{"$error":"#VALUE!"},{"$error":"#VALUE!"},{"$error":"#VALUE!"},{"$error":"#VALUE!"},{"$error":"#VALUE!"},{"$error":"#VALUE!"}]
[null,null,null,null,null,null,null,null,{"$f":"IF(Results!C42=\"\",\"\",Results!B42)","v":""},null,"",null,{"$error":"#VALUE!"},{"$error":"#VALUE!"},{"$error":"#VALUE!"},{"$error":"#VALUE!"},{"$error":"#VALUE!"},{"$error":"#VALUE!"},{"$error":"#VALUE!"},{"$error":"#VALUE!"},{"$error":"#VALUE!"},{"$error":"#VALUE!"}]
[null,null,null,null,null,null,null,null,{"$f":"IF(Results!C43=\"\",\"\",Results!B43)","v":""},null,"",null,{"$error":"#VALUE!"},{"$error":"#VALUE!"},{"$error":"#VALUE!"},{"$error":"#VALUE!"},{"$error":"#VALUE!"},{"$error":"#VALUE!"},{"$error":"#VALUE!"},{"$error":"#VALUE!"},{"$error":"#VALUE!"},{"$error":"#VALUE!"}]
[null,null,null,null,null,null,null,null,{"$f":"IF(Results!C44=\"\",\"\",Results!B44)","v":""},null,"",null,{"$error":"#VALUE!"},{"$error":"#VALUE!"},{"$error":"#VALUE!"},{"$error":"#VALUE!"},{"$error":"#VALUE!"},{"$error":"#VALUE!"},{"$error":"#VALUE!"},{"$error":"#VALUE!"},{"$error":"#VALUE!"},{"$error":"#VALUE!"}]
[null,null,null,null,null,null,null,null,{"$f":"IF(Results!C45=\"\",\"\",Results!B45)","v":""},null,"",null,{"$error":"#VALUE!"},{"$error":"#VALUE!"},{"$error":"#VALUE!"},{"$error":"#VALUE!"},{"$error":"#VALUE!"},{"$error":"#VALUE!"},{"$error":"#VALUE!"},{"$error":"#VALUE!"},{"$error":"#VALUE!"},{"$error":"#VALUE!"}]
[null,null,null,null,null,null,null,null,{"$f":"IF(Results!C46=\"\",\"\",Results!B46)","v":""},null,"",null,{"$error":"#VALUE!"},{"$error":"#VALUE!"},{"$error":"#VALUE!"},{"$error":"#VALUE!"},{"$error":"#VALUE!"},{"$error":"#VALUE!"},{"$error":"#VALUE!"},{"$error":"#VALUE!"},{"$error":"#VALUE!"},{"$error":"#VALUE!"}]
[null,null,null,null,null,null,null,null,{"$f":"IF(Results!C47=\"\",\"\",Results!B47)","v":""},null,"",null,{"$error":"#VALUE!"},{"$error":"#VALUE!"},{"$error":"#VALUE!"},{"$error":"#VALUE!"},{"$error":"#VALUE!"},{"$error":"#VALUE!"},{"$error":"#VALUE!"},{"$error":"#VALUE!"},{"$error":"#VALUE!"},{"$error":"#VALUE!"}]
[null,null,null,null,null,null,null,null,{"$f":"IF(Results!C48=\"\",\"\",Results!B48)","v":""},null,"",null,{"$error":"#VALUE!"},{"$error":"#VALUE!"},{"$error":"#VALUE!"},{"$error":"#VALUE!"},{"$error":"#VALUE!"},{"$error":"#VALUE!"},{"$error":"#VALUE!"},{"$error":"#VALUE!"},{"$error":"#VALUE!"},{"$error":"#VALUE!"}]
[null,null,null,null,null,null,null,null,{"$f":"IF(Results!C49=\"\",\"\",Results!B49)","v":""},null,"",null,{"$error":"#VALUE!"},{"$error":"#VALUE!"},{"$error":"#VALUE!"},{"$error":"#VALUE!"},{"$error":"#VALUE!"},{"$error":"#VALUE!"},{"$error":"#VALUE!"},{"$error":"#VALUE!"},{"$error":"#VALUE!"},{"$error":"#VALUE!"}]
[null,null,null,null,null,null,null,null,{"$f":"IF(Results!C50=\"\",\"\",Results!B50)","v":""},null,"",null,{"$error":"#VALUE!"},{"$error":"#VALUE!"},{"$error":"#VALUE!"},{"$error":"#VALUE!"},{"$error":"#VALUE!"},{"$error":"#VALUE!"},{"$error":"#VALUE!"},{"$error":"#VALUE!"},{"$error":"#VALUE!"},{"$error":"#VALUE!"}]
[null,null,null,null,null,null,null,null,{"$f":"IF(Results!C51=\"\",\"\",Results!B51)","v":""},null,"",null,{"$error":"#VALUE!"},{"$error":"#VALUE!"},{"$error":"#VALUE!"},{"$error":"#VALUE!"},{"$error":"#VALUE!"},{"$error":"#VALUE!"},{"$error":"#VALUE!"},{"$error":"#VALUE!"},{"$error":"#VALUE!"},{"$error":"#VALUE!"}]
[null,null,null,null,null,null,null,null,{"$f":"IF(Results!C52=\"\",\"\",Results!B52)","v":""},null,"",null,{"$error":"#VALUE!"},{"$error":"#VALUE!"},{"$error":"#VALUE!"},{"$error":"#VALUE!"},{"$error":"#VALUE!"},{"$error":"#VALUE!"},{"$error":"#VALUE!"},{"$error":"#VALUE!"},{"$error":"#VALUE!"},{"$error":"#VALUE!"}]
[null,null,null,null,null,null,null,null,{"$f":"IF(Results!C53=\"\",\"\",Results!B53)","v":""},null,"",null,{"$error":"#VALUE!"},{"$error":"#VALUE!"},{"$error":"#VALUE!"},{"$error":"#VALUE!"},{"$error":"#VALUE!"},{"$error":"#VALUE!"},{"$error":"#VALUE!"},{"$error":"#VALUE!"},{"$error":"#VALUE!"},{"$error":"#VALUE!"}]
[null,null,null,null,null,null,null,null,{"$f":"IF(Results!C54=\"\",\"\",Results!B54)","v":""},null,"",null,{"$error":"#VALUE!"},{"$error":"#VALUE!"},{"$error":"#VALUE!"},{"$error":"#VALUE!"},{"$error":"#VALUE!"},{"$error":"#VALUE!"},{"$error":"#VALUE!"},{"$error":"#VALUE!"},{"$error":"#VALUE!"},{"$error":"#VALUE!"}]
[null,null,null,null,null,null,null,null,{"$f":"IF(Results!C55=\"\",\"\",Results!B55)","v":""},null,"",null,{"$error":"#VALUE!"},{"$error":"#VALUE!"},{"$error":"#VALUE!"},{"$error":"#VALUE!"},{"$error":"#VALUE!"},{"$error":"#VALUE!"},{"$error":"#VALUE!"},{"$error":"#VALUE!"},{"$error":"#VALUE!"},{"$error":"#VALUE!"}]
[null,null,null,null,null,null,null,null,{"$f":"IF(Results!C56=\"\",\"\",Results!B56)","v":""},null,"",null,{"$error":"#VALUE!"},{"$error":"#VALUE!"},{"$error":"#VALUE!"},{"$error":"#VALUE!"},{"$error":"#VALUE!"},{"$error":"#VALUE!"},{"$error":"#VALUE!"},{"$error":"#VALUE!"},{"$error":"#VALUE!"},{"$error":"#VALUE!"}]
[null,null,null,null,null,null,null,null,{"$f":"IF(Results!C57=\"\",\"\",Results!B57)","v":""},null,"",null,{"$error":"#VALUE!"},{"$error":"#VALUE!"},{"$error":"#VALUE!"},{"$error":"#VALUE!"},{"$error":"#VALUE!"},{"$error":"#VALUE!"},{"$error":"#VALUE!"},{"$error":"#VALUE!"},{"$error":"#VALUE!"},{"$error":"#VALUE!"}]
[null,null,null,null,null,null,null,null,{"$f":"IF(Results!C58=\"\",\"\",Results!B58)","v":""},null,"",null,{"$error":"#VALUE!"},{"$error":"#VALUE!"},{"$error":"#VALUE!"},{"$error":"#VALUE!"},{"$error":"#VALUE!"},{"$error":"#VALUE!"},{"$error":"#VALUE!"},{"$error":"#VALUE!"},{"$error":"#VALUE!"},{"$error":"#VALUE!"}]
[null,null,null,null,null,null,null,null,{"$f":"IF(Results!C59=\"\",\"\",Results!B59)","v":""},null,"",null,{"$error":"#VALUE!"},{"$error":"#VALUE!"},{"$error":"#VALUE!"},{"$error":"#VALUE!"},{"$error":"#VALUE!"},{"$error":"#VALUE!"},{"$error":"#VALUE!"},{"$error":"#VALUE!"},{"$error":"#VALUE!"},{"$error":"#VALUE!"}]
[null,null,null,null,null,null,null,null,{"$f":"IF(Results!C60=\"\",\"\",Results!B60)","v":""},null,"",null,{"$error":"#VALUE!"},{"$error":"#VALUE!"},{"$error":"#VALUE!"},{"$error":"#VALUE!"},{"$error":"#VALUE!"},{"$error":"#VALUE!"},{"$error":"#VALUE!"},{"$error":"#VALUE!"},{"$error":"#VALUE!"},{"$error":"#VALUE!"}]
[null,null,null,null,null,null,null,null,{"$f":"IF(Results!C61=\"\",\"\",Results!B61)","v":""},null,"",null,{"$error":"#VALUE!"},{"$error":"#VALUE!"},{"$error":"#VALUE!"},{"$error":"#VALUE!"},{"$error":"#VALUE!"},{"$error":"#VALUE!"},{"$error":"#VALUE!"},{"$error":"#VALUE!"},{"$error":"#VALUE!"},{"$error":"#VALUE!"}]
[null,null,null,null,null,null,null,null,{"$f":"IF(Results!C62=\"\",\"\",Results!B62)","v":""},null,"",null,{"$error":"#VALUE!"},{"$error":"#VALUE!"},{"$error":"#VALUE!"},{"$error":"#VALUE!"},{"$error":"#VALUE!"},{"$error":"#VALUE!"},{"$error":"#VALUE!"},{"$error":"#VALUE!"},{"$error":"#VALUE!"},{"$error":"#VALUE!"}]
[null,null,null,null,null,null,null,null,{"$f":"IF(Results!C63=\"\",\"\",Results!B63)","v":""},null,"",null,{"$error":"#VALUE!"},{"$error":"#VALUE!"},{"$error":"#VALUE!"},{"$error":"#VALUE!"},{"$error":"#VALUE!"},{"$error":"#VALUE!"},{"$error":"#VALUE!"},{"$error":"#VALUE!"},{"$error":"#VALUE!"},{"$error":"#VALUE!"}]
[null,null,null,null,null,null,null,null,{"$f":"IF(Results!C64=\"\",\"\",Results!B64)","v":""},null,"",null,{"$error":"#VALUE!"},{"$error":"#VALUE!"},{"$error":"#VALUE!"},{"$error":"#VALUE!"},{"$error":"#VALUE!"},{"$error":"#VALUE!"},{"$error":"#VALUE!"},{"$error":"#VALUE!"},{"$error":"#VALUE!"},{"$error":"#VALUE!"}]
[null,null,null,null,null,null,null,null,{"$f":"IF(Results!C65=\"\",\"\",Results!B65)","v":""},null,"",null,{"$error":"#VALUE!"},{"$error":"#VALUE!"},{"$error":"#VALUE!"},{"$error":"#VALUE!"},{"$error":"#VALUE!"},{"$error":"#VALUE!"},{"$error":"#VALUE!"},{"$error":"#VALUE!"},{"$error":"#VALUE!"},{"$error":"#VALUE!"}]
[null,null,null,null,null,null,null,null,{"$f":"IF(Results!C66=\"\",\"\",Results!B66)","v":""},null,"",null,{"$error":"#VALUE!"},{"$error":"#VALUE!"},{"$error":"#VALUE!"},{"$error":"#VALUE!"},{"$error":"#VALUE!"},{"$error":"#VALUE!"},{"$error":"#VALUE!"},{"$error":"#VALUE!"},{"$error":"#VALUE!"},{"$error":"#VALUE!"}]
[null,null,null,null,null,null,null,null,{"$f":"IF(Results!C67=\"\",\"\",Results!B67)","v":""},null,"",null,{"$error":"#VALUE!"},{"$error":"#VALUE!"},{"$error":"#VALUE!"},{"$error":"#VALUE!"},{"$error":"#VALUE!"},{"$error":"#VALUE!"},{"$error":"#VALUE!"},{"$error":"#VALUE!"},{"$error":"#VALUE!"},{"$error":"#VALUE!"}]
[null,null,null,null,null,null,null,null,{"$f":"IF(Results!C68=\"\",\"\",Results!B68)","v":""},null,"",null,{"$error":"#VALUE!"},{"$error":"#VALUE!"},{"$error":"#VALUE!"},{"$error":"#VALUE!"},{"$error":"#VALUE!"},{"$error":"#VALUE!"},{"$error":"#VALUE!"},{"$error":"#VALUE!"},{"$error":"#VALUE!"},{"$error":"#VALUE!"}]
[null,null,null,null,null,null,null,null,{"$f":"IF(Results!C69=\"\",\"\",Results!B69)","v":""},null,"",null,{"$error":"#VALUE!"},{"$error":"#VALUE!"},{"$error":"#VALUE!"},{"$error":"#VALUE!"},{"$error":"#VALUE!"},{"$error":"#VALUE!"},{"$error":"#VALUE!"},{"$error":"#VALUE!"},{"$error":"#VALUE!"},{"$error":"#VALUE!"}]
[null,null,null,null,null,null,null,null,{"$f":"IF(Results!C70=\"\",\"\",Results!B70)","v":""},null,"",null,{"$error":"#VALUE!"},{"$error":"#VALUE!"},{"$error":"#VALUE!"},{"$error":"#VALUE!"},{"$error":"#VALUE!"},{"$error":"#VALUE!"},{"$error":"#VALUE!"},{"$error":"#VALUE!"},{"$error":"#VALUE!"},{"$error":"#VALUE!"}]
[null,null,null,null,null,null,null,null,{"$f":"IF(Results!C71=\"\",\"\",Results!B71)","v":""},null,"",null,{"$error":"#VALUE!"},{"$error":"#VALUE!"},{"$error":"#VALUE!"},{"$error":"#VALUE!"},{"$error":"#VALUE!"},{"$error":"#VALUE!"},{"$error":"#VALUE!"},{"$error":"#VALUE!"},{"$error":"#VALUE!"},{"$error":"#VALUE!"}]
[null,null,null,null,null,null,null,null,{"$f":"IF(Results!C72=\"\",\"\",Results!B72)","v":""},null,"",null,{"$error":"#VALUE!"},{"$error":"#VALUE!"},{"$error":"#VALUE!"},{"$error":"#VALUE!"},{"$error":"#VALUE!"},{"$error":"#VALUE!"},{"$error":"#VALUE!"},{"$error":"#VALUE!"},{"$error":"#VALUE!"},{"$error":"#VALUE!"}]
[null,null,null,null,null,null,null,null,{"$f":"IF(Results!C73=\"\",\"\",Results!B73)","v":""},null,"",null,{"$error":"#VALUE!"},{"$error":"#VALUE!"},{"$error":"#VALUE!"},{"$error":"#VALUE!"},{"$error":"#VALUE!"},{"$error":"#VALUE!"},{"$error":"#VALUE!"},{"$error":"#VALUE!"},{"$error":"#VALUE!"},{"$error":"#VALUE!"}]
[null,null,null,null,null,null,null,null,{"$f":"IF(Results!C74=\"\",\"\",Results!B74)","v":""},null,"",null,{"$error":"#VALUE!"},{"$error":"#VALUE!"},{"$error":"#VALUE!"},{"$error":"#VALUE!"},{"$error":"#VALUE!"},{"$error":"#VALUE!"},{"$error":"#VALUE!"},{"$error":"#VALUE!"},{"$error":"#VALUE!"},{"$error":"#VALUE!"}]
[null,null,null,null,null,null,null,null,{"$f":"IF(Results!C75=\"\",\"\",Results!B75)","v":""},null,"",null,{"$error":"#VALUE!"},{"$error":"#VALUE!"},{"$error":"#VALUE!"},{"$error":"#VALUE!"},{"$error":"#VALUE!"},{"$error":"#VALUE!"},{"$error":"#VALUE!"},{"$error":"#VALUE!"},{"$error":"#VALUE!"},{"$error":"#VALUE!"}]
[null,null,null,null,null,null,null,null,{"$f":"IF(Results!C76=\"\",\"\",Results!B76)","v":""},null,"",null,{"$error":"#VALUE!"},{"$error":"#VALUE!"},{"$error":"#VALUE!"},{"$error":"#VALUE!"},{"$error":"#VALUE!"},{"$error":"#VALUE!"},{"$error":"#VALUE!"},{"$error":"#VALUE!"},{"$error":"#VALUE!"},{"$error":"#VALUE!"}]
[null,null,null,null,null,null,null,null,{"$f":"IF(Results!C77=\"\",\"\",Results!B77)","v":""},null,"",null,{"$error":"#VALUE!"},{"$error":"#VALUE!"},{"$error":"#VALUE!"},{"$error":"#VALUE!"},{"$error":"#VALUE!"},{"$error":"#VALUE!"},{"$error":"#VALUE!"},{"$error":"#VALUE!"},{"$error":"#VALUE!"},{"$error":"#VALUE!"}]
[null,null,null,null,null,null,null,null,{"$f":"IF(Results!C78=\"\",\"\",Results!B78)","v":""},null,"",null,{"$error":"#VALUE!"},{"$error":"#VALUE!"},{"$error":"#VALUE!"},{"$error":"#VALUE!"},{"$error":"#VALUE!"},{"$error":"#VALUE!"},{"$error":"#VALUE!"},{"$error":"#VALUE!"},{"$error":"#VALUE!"},{"$error":"#VALUE!"}]
[null,null,null,null,null,null,null,null,{"$f":"IF(Results!C79=\"\",\"\",Results!B79)","v":""},null,"",null,{"$error":"#VALUE!"},{"$error":"#VALUE!"},{"$error":"#VALUE!"},{"$error":"#VALUE!"},{"$error":"#VALUE!"},{"$error":"#VALUE!"},{"$error":"#VALUE!"},{"$error":"#VALUE!"},{"$error":"#VALUE!"},{"$error":"#VALUE!"}]
[null,null,null,null,null,null,null,null,{"$f":"IF(Results!C80=\"\",\"\",Results!B80)","v":""},null,"",null,{"$error":"#VALUE!"},{"$error":"#VALUE!"},{"$error":"#VALUE!"},{"$error":"#VALUE!"},{"$error":"#VALUE!"},{"$error":"#VALUE!"},{"$error":"#VALUE!"},{"$error":"#VALUE!"},{"$error":"#VALUE!"},{"$error":"#VALUE!"}]
[null,null,null,null,null,null,null,null,{"$f":"IF(Results!C81=\"\",\"\",Results!B81)","v":""},null,"",null,{"$error":"#VALUE!"},{"$error":"#VALUE!"},{"$error":"#VALUE!"},{"$error":"#VALUE!"},{"$error":"#VALUE!"},{"$error":"#VALUE!"},{"$error":"#VALUE!"},{"$error":"#VALUE!"},{"$error":"#VALUE!"},{"$error":"#VALUE!"}]
[null,null,null,null,null,null,null,null,{"$f":"IF(Results!C82=\"\",\"\",Results!B82)","v":""},null,"",null,{"$error":"#VALUE!"},{"$error":"#VALUE!"},{"$error":"#VALUE!"},{"$error":"#VALUE!"},{"$error":"#VALUE!"},{"$error":"#VALUE!"},{"$error":"#VALUE!"},{"$error":"#VALUE!"},{"$error":"#VALUE!"},{"$error":"#VALUE!"}]
[null,null,null,null,null,null,null,null,{"$f":"IF(Results!C83=\"\",\"\",Results!B83)","v":""},null,"",null,{"$error":"#VALUE!"},{"$error":"#VALUE!"},{"$error":"#VALUE!"},{"$error":"#VALUE!"},{"$error":"#VALUE!"},{"$error":"#VALUE!"},{"$error":"#VALUE!"},{"$error":"#VALUE!"},{"$error":"#VALUE!"},{"$error":"#VALUE!"}]
[null,null,null,null,null,null,null,null,{"$f":"IF(Results!C84=\"\",\"\",Results!B84)","v":""},null,"",null,{"$error":"#VALUE!"},{"$error":"#VALUE!"},{"$error":"#VALUE!"},{"$error":"#VALUE!"},{"$error":"#VALUE!"},{"$error":"#VALUE!"},{"$error":"#VALUE!"},{"$error":"#VALUE!"},{"$error":"#VALUE!"},{"$error":"#VALUE!"}]
[null,null,null,null,null,null,null,null,{"$f":"IF(Results!C85=\"\",\"\",Results!B85)","v":""},null,"",null,{"$error":"#VALUE!"},{"$error":"#VALUE!"},{"$error":"#VALUE!"},{"$error":"#VALUE!"},{"$error":"#VALUE!"},{"$error":"#VALUE!"},{"$error":"#VALUE!"},{"$error":"#VALUE!"},{"$error":"#VALUE!"},{"$error":"#VALUE!"}]
[null,null,null,null,null,null,null,null,{"$f":"IF(Results!C86=\"\",\"\",Results!B86)","v":""},null,"",null,{"$error":"#VALUE!"},{"$error":"#VALUE!"},{"$error":"#VALUE!"},{"$error":"#VALUE!"},{"$error":"#VALUE!"},{"$error":"#VALUE!"},{"$error":"#VALUE!"},{"$error":"#VALUE!"},{"$error":"#VALUE!"},{"$error":"#VALUE!"}]
[null,null,null,null,null,null,null,null,{"$f":"IF(Results!C87=\"\",\"\",Results!B87)","v":""},null,"",null,{"$error":"#VALUE!"},{"$error":"#VALUE!"},{"$error":"#VALUE!"},{"$error":"#VALUE!"},{"$error":"#VALUE!"},{"$error":"#VALUE!"},{"$error":"#VALUE!"},{"$error":"#VALUE!"},{"$error":"#VALUE!"},{"$error":"#VALUE!"}]
[null,null,null,null,null,null,null,null,{"$f":"IF(Results!C88=\"\",\"\",Results!B88)","v":""},null,"",null,{"$error":"#VALUE!"},{"$error":"#VALUE!"},{"$error":"#VALUE!"},{"$error":"#VALUE!"},{"$error":"#VALUE!"},{"$error":"#VALUE!"},{"$error":"#VALUE!"},{"$error":"#VALUE!"},{"$error":"#VALUE!"},{"$error":"#VALUE!"}]
[null,null,null,null,null,null,null,null,{"$f":"IF(Results!C89=\"\",\"\",Results!B89)","v":""},null,"",null,{"$error":"#VALUE!"},{"$error":"#VALUE!"},{"$error":"#VALUE!"},{"$error":"#VALUE!"},{"$error":"#VALUE!"},{"$error":"#VALUE!"},{"$error":"#VALUE!"},{"$error":"#VALUE!"},{"$error":"#VALUE!"},{"$error":"#VALUE!"}]
[null,null,null,null,null,null,null,null,{"$f":"IF(Results!C90=\"\",\"\",Results!B90)","v":""},null,"",null,{"$error":"#VALUE!"},{"$error":"#VALUE!"},{"$error":"#VALUE!"},{"$error":"#VALUE!"},{"$error":"#VALUE!"},{"$error":"#VALUE!"},{"$error":"#VALUE!"},{"$error":"#VALUE!"},{"$error":"#VALUE!"},{"$error":"#VALUE!"}]
[null,null,null,null,null,null,null,null,{"$f":"IF(Results!C91=\"\",\"\",Results!B91)","v":""},null,"",null,{"$error":"#VALUE!"},{"$error":"#VALUE!"},{"$error":"#VALUE!"},{"$error":"#VALUE!"},{"$error":"#VALUE!"},{"$error":"#VALUE!"},{"$error":"#VALUE!"},{"$error":"#VALUE!"},{"$error":"#VALUE!"},{"$error":"#VALUE!"}]
[null,null,null,null,null,null,null,null,{"$f":"IF(Results!C92=\"\",\"\",Results!B92)","v":""},null,"",null,{"$error":"#VALUE!"},{"$error":"#VALUE!"},{"$error":"#VALUE!"},{"$error":"#VALUE!"},{"$error":"#VALUE!"},{"$error":"#VALUE!"},{"$error":"#VALUE!"},{"$error":"#VALUE!"},{"$error":"#VALUE!"},{"$error":"#VALUE!"}]
[null,null,null,null,null,null,null,null,{"$f":"IF(Results!C93=\"\",\"\",Results!B93)","v":""},null,"",null,{"$error":"#VALUE!"},{"$error":"#VALUE!"},{"$error":"#VALUE!"},{"$error":"#VALUE!"},{"$error":"#VALUE!"},{"$error":"#VALUE!"},{"$error":"#VALUE!"},{"$error":"#VALUE!"},{"$error":"#VALUE!"},{"$error":"#VALUE!"}]
[null,null,null,null,null,null,null,null,{"$f":"IF(Results!C94=\"\",\"\",Results!B94)","v":""},null,"",null,{"$error":"#VALUE!"},{"$error":"#VALUE!"},{"$error":"#VALUE!"},{"$error":"#VALUE!"},{"$error":"#VALUE!"},{"$error":"#VALUE!"},{"$error":"#VALUE!"},{"$error":"#VALUE!"},{"$error":"#VALUE!"},{"$error":"#VALUE!"}]
[null,null,null,null,null,null,null,null,{"$f":"IF(Results!C95=\"\",\"\",Results!B95)","v":""},null,"",null,{"$error":"#VALUE!"},{"$error":"#VALUE!"},{"$error":"#VALUE!"},{"$error":"#VALUE!"},{"$error":"#VALUE!"},{"$error":"#VALUE!"},{"$error":"#VALUE!"},{"$error":"#VALUE!"},{"$error":"#VALUE!"},{"$error":"#VALUE!"}]
[null,null,null,null,null,null,null,null,{"$f":"IF(Results!C96=\"\",\"\",Results!B96)","v":""},null,"",null,{"$error":"#VALUE!"},{"$error":"#VALUE!"},{"$error":"#VALUE!"},{"$error":"#VALUE!"},{"$error":"#VALUE!"},{"$error":"#VALUE!"},{"$error":"#VALUE!"},{"$error":"#VALUE!"},{"$error":"#VALUE!"},{"$error":"#VALUE!"}]
[null,null,null,null,null,null,null,null,{"$f":"IF(Results!C97=\"\",\"\",Results!B97)","v":""},null,"",null,{"$error":"#VALUE!"},{"$error":"#VALUE!"},{"$error":"#VALUE!"},{"$error":"#VALUE!"},{"$error":"#VALUE!"},{"$error":"#VALUE!"},{"$error":"#VALUE!"},{"$error":"#VALUE!"},{"$error":"#VALUE!"},{"$error":"#VALUE!"}]
[null,null,null,null,null,null,null,null,{"$f":"IF(Results!C98=\"\",\"\",Results!B98)","v":""},null,{"$f":"IF($C$6=\"\",\"\",IF(I98=\"\",\"\",50-SUM(Q98:V98)))","v":""},null,{"$f":"SEARCH($C$6,J98)","v":{"$error":"#VALUE!"}},{"$f":"SEARCH($D$6,J98)","v":{"$error":"#VALUE!"}},{"$f":"SEARCH($E$6,J98)","v":{"$error":"#VALUE!"}},{"$f":"SEARCH($F$6,J98)","v":{"$error":"#VALUE!"}},{"$f":"IF((N98-M98)<0,$C$8,0)","v":{"$error":"#VALUE!"}},{"$f":"IF((O98-M98)<0,$C$8+$D$8,0)","v":{"$error":"#VALUE!"}},{"$f":"IF((P98-M98)<0,$C$8+$D$8+$E$8,0)","v":{"$error":"#VALUE!"}},{"$f":"IF((O98-N98)<0,$D$8,0)","v":{"$error":"#VALUE!"}},{"$f":"IF((P98-N98)<0,$D$8+$E$8,0)","v":{"$error":"#VALUE!"}},{"$f":"IF((P98-O98)<0,$E$8,0)","v":{"$error":"#VALUE!"}}]
[null,null,null,null,null,null,null,null,{"$f":"IF(Results!C99=\"\",\"\",Results!B99)","v":""},null,"",null,{"$error":"#VALUE!"},{"$error":"#VALUE!"},{"$error":"#VALUE!"},{"$error":"#VALUE!"},{"$error":"#VALUE!"},{"$error":"#VALUE!"},{"$error":"#VALUE!"},{"$error":"#VALUE!"},{"$error":"#VALUE!"},{"$error":"#VALUE!"}]
[null,null,null,null,null,null,null,null,{"$f":"IF(Results!C100=\"\",\"\",Results!B100)","v":""},null,"",null,{"$error":"#VALUE!"},{"$error":"#VALUE!"},{"$error":"#VALUE!"},{"$error":"#VALUE!"},{"$error":"#VALUE!"},{"$error":"#VALUE!"},{"$error":"#VALUE!"},{"$error":"#VALUE!"},{"$error":"#VALUE!"},{"$error":"#VALUE!"}]
[null,null,null,null,null,null,null,null,{"$f":"IF(Results!C101=\"\",\"\",Results!B101)","v":""},null,"",null,{"$error":"#VALUE!"},{"$error":"#VALUE!"},{"$error":"#VALUE!"},{"$error":"#VALUE!"},{"$error":"#VALUE!"},{"$error":"#VALUE!"},{"$error":"#VALUE!"},{"$error":"#VALUE!"},{"$error":"#VALUE!"},{"$error":"#VALUE!"}]
[null,null,null,null,null,null,null,null,{"$f":"IF(Results!C102=\"\",\"\",Results!B102)","v":""},null,"",null,{"$error":"#VALUE!"},{"$error":"#VALUE!"},{"$error":"#VALUE!"},{"$error":"#VALUE!"},{"$error":"#VALUE!"},{"$error":"#VALUE!"},{"$error":"#VALUE!"},{"$error":"#VALUE!"},{"$error":"#VALUE!"},{"$error":"#VALUE!"}]
[null,null,null,null,null,null,null,null,{"$f":"IF(Results!C103=\"\",\"\",Results!B103)","v":""},null,"",null,{"$error":"#VALUE!"},{"$error":"#VALUE!"},{"$error":"#VALUE!"},{"$error":"#VALUE!"},{"$error":"#VALUE!"},{"$error":"#VALUE!"},{"$error":"#VALUE!"},{"$error":"#VALUE!"},{"$error":"#VALUE!"},{"$error":"#VALUE!"}]
[null,null,null,null,null,null,null,null,{"$f":"IF(Results!C104=\"\",\"\",Results!B104)","v":""},null,{"$f":"IF($C$6=\"\",\"\",IF(I104=\"\",\"\",50-SUM(Q104:V104)))","v":""},null,{"$f":"SEARCH($C$6,J104)","v":{"$error":"#VALUE!"}},{"$f":"SEARCH($D$6,J104)","v":{"$error":"#VALUE!"}},{"$f":"SEARCH($E$6,J104)","v":{"$error":"#VALUE!"}},{"$f":"SEARCH($F$6,J104)","v":{"$error":"#VALUE!"}},{"$f":"IF((N104-M104)<0,$C$8,0)","v":{"$error":"#VALUE!"}},{"$f":"IF((O104-M104)<0,$C$8+$D$8,0)","v":{"$error":"#VALUE!"}},{"$f":"IF((P104-M104)<0,$C$8+$D$8+$E$8,0)","v":{"$error":"#VALUE!"}},{"$f":"IF((O104-N104)<0,$D$8,0)","v":{"$error":"#VALUE!"}},{"$f":"IF((P104-N104)<0,$D$8+$E$8,0)","v":{"$error":"#VALUE!"}},{"$f":"IF((P104-O104)<0,$E$8,0)","v":{"$error":"#VALUE!"}}]
[null,null,null,null,null,null,null,null,{"$f":"IF(Results!C105=\"\",\"\",Results!B105)","v":""},null,"",null,{"$error":"#VALUE!"},{"$error":"#VALUE!"},{"$error":"#VALUE!"},{"$error":"#VALUE!"},{"$error":"#VALUE!"},{"$error":"#VALUE!"},{"$error":"#VALUE!"},{"$error":"#VALUE!"},{"$error":"#VALUE!"},{"$error":"#VALUE!"}]
[null,null,null,null,null,null,null,null,{"$f":"IF(Results!C106=\"\",\"\",Results!B106)","v":""},null,"",null,{"$error":"#VALUE!"},{"$error":"#VALUE!"},{"$error":"#VALUE!"},{"$error":"#VALUE!"},{"$error":"#VALUE!"},{"$error":"#VALUE!"},{"$error":"#VALUE!"},{"$error":"#VALUE!"},{"$error":"#VALUE!"},{"$error":"#VALUE!"}]
[null,null,null,null,null,null,null,null,{"$f":"IF(Results!C107=\"\",\"\",Results!B107)","v":""},null,"",null,{"$error":"#VALUE!"},{"$error":"#VALUE!"},{"$error":"#VALUE!"},{"$error":"#VALUE!"},{"$error":"#VALUE!"},{"$error":"#VALUE!"},{"$error":"#VALUE!"},{"$error":"#VALUE!"},{"$error":"#VALUE!"},{"$error":"#VALUE!"}]
[null,null,null,null,null,null,null,null,{"$f":"IF(Results!C108=\"\",\"\",Results!B108)","v":""},null,"",null,{"$error":"#VALUE!"},{"$error":"#VALUE!"},{"$error":"#VALUE!"},{"$error":"#VALUE!"},{"$error":"#VALUE!"},{"$error":"#VALUE!"},{"$error":"#VALUE!"},{"$error":"#VALUE!"},{"$error":"#VALUE!"},{"$error":"#VALUE!"}]
[null,null,null,null,null,null,null,null,{"$f":"IF(Results!C109=\"\",\"\",Results!B109)","v":""},null,"",null,{"$error":"#VALUE!"},{"$error":"#VALUE!"},{"$error":"#VALUE!"},{"$error":"#VALUE!"},{"$error":"#VALUE!"},{"$error":"#VALUE!"},{"$error":"#VALUE!"},{"$error":"#VALUE!"},{"$error":"#VALUE!"},{"$error":"#VALUE!"}]
[null,null,null,null,null,null,null,null,{"$f":"IF(Results!C110=\"\",\"\",Results!B110)","v":""},null,"",null,{"$error":"#VALUE!"},{"$error":"#VALUE!"},{"$error":"#VALUE!"},{"$error":"#VALUE!"},{"$error":"#VALUE!"},{"$error":"#VALUE!"},{"$error":"#VALUE!"},{"$error":"#VALUE!"},{"$error":"#VALUE!"},{"$error":"#VALUE!"}]
[null,null,null,null,null,null,null,null,{"$f":"IF(Results!C111=\"\",\"\",Results!B111)","v":""},null,"",null,{"$error":"#VALUE!"},{"$error":"#VALUE!"},{"$error":"#VALUE!"},{"$error":"#VALUE!"},{"$error":"#VALUE!"},{"$error":"#VALUE!"},{"$error":"#VALUE!"},{"$error":"#VALUE!"},{"$error":"#VALUE!"},{"$error":"#VALUE!"}]
[null,null,null,null,null,null,null,null,{"$f":"IF(Results!C112=\"\",\"\",Results!B112)","v":""},null,"",null,{"$error":"#VALUE!"},{"$error":"#VALUE!"},{"$error":"#VALUE!"},{"$error":"#VALUE!"},{"$error":"#VALUE!"},{"$error":"#VALUE!"},{"$error":"#VALUE!"},{"$error":"#VALUE!"},{"$error":"#VALUE!"},{"$error":"#VALUE!"}]
[null,null,null,null,null,null,null,null,{"$f":"IF(Results!C113=\"\",\"\",Results!B113)","v":""},null,"",null,{"$error":"#VALUE!"},{"$error":"#VALUE!"},{"$error":"#VALUE!"},{"$error":"#VALUE!"},{"$error":"#VALUE!"},{"$error":"#VALUE!"},{"$error":"#VALUE!"},{"$error":"#VALUE!"},{"$error":"#VALUE!"},{"$error":"#VALUE!"}]
[null,null,null,null,null,null,null,null,{"$f":"IF(Results!C114=\"\",\"\",Results!B114)","v":""},null,"",null,{"$error":"#VALUE!"},{"$error":"#VALUE!"},{"$error":"#VALUE!"},{"$error":"#VALUE!"},{"$error":"#VALUE!"},{"$error":"#VALUE!"},{"$error":"#VALUE!"},{"$error":"#VALUE!"},{"$error":"#VALUE!"},{"$error":"#VALUE!"}]
[null,null,null,null,null,null,null,null,{"$f":"IF(Results!C115=\"\",\"\",Results!B115)","v":""},null,"",null,{"$error":"#VALUE!"},{"$error":"#VALUE!"},{"$error":"#VALUE!"},{"$error":"#VALUE!"},{"$error":"#VALUE!"},{"$error":"#VALUE!"},{"$error":"#VALUE!"},{"$error":"#VALUE!"},{"$error":"#VALUE!"},{"$error":"#VALUE!"}]
[null,null,null,null,null,null,null,null,{"$f":"IF(Results!C116=\"\",\"\",Results!B116)","v":""},null,"",null,{"$error":"#VALUE!"},{"$error":"#VALUE!"},{"$error":"#VALUE!"},{"$error":"#VALUE!"},{"$error":"#VALUE!"},{"$error":"#VALUE!"},{"$error":"#VALUE!"},{"$error":"#VALUE!"},{"$error":"#VALUE!"},{"$error":"#VALUE!"}]
[null,null,null,null,null,null,null,null,{"$f":"IF(Results!C117=\"\",\"\",Results!B117)","v":""},null,"",null,{"$error":"#VALUE!"},{"$error":"#VALUE!"},{"$error":"#VALUE!"},{"$error":"#VALUE!"},{"$error":"#VALUE!"},{"$error":"#VALUE!"},{"$error":"#VALUE!"},{"$error":"#VALUE!"},{"$error":"#VALUE!"},{"$error":"#VALUE!"}]
[null,null,null,null,null,null,null,null,{"$f":"IF(Results!C118=\"\",\"\",Results!B118)","v":""},null,"",null,{"$error":"#VALUE!"},{"$error":"#VALUE!"},{"$error":"#VALUE!"},{"$error":"#VALUE!"},{"$error":"#VALUE!"},{"$error":"#VALUE!"},{"$error":"#VALUE!"},{"$error":"#VALUE!"},{"$error":"#VALUE!"},{"$error":"#VALUE!"}]
[null,null,null,null,null,null,null,null,{"$f":"IF(Results!C119=\"\",\"\",Results!B119)","v":""},null,"",null,{"$error":"#VALUE!"},{"$error":"#VALUE!"},{"$error":"#VALUE!"},{"$error":"#VALUE!"},{"$error":"#VALUE!"},{"$error":"#VALUE!"},{"$error":"#VALUE!"},{"$error":"#VALUE!"},{"$error":"#VALUE!"},{"$error":"#VALUE!"}]
[null,null,null,null,null,null,null,null,{"$f":"IF(Results!C120=\"\",\"\",Results!B120)","v":""},null,"",null,{"$error":"#VALUE!"},{"$error":"#VALUE!"},{"$error":"#VALUE!"},{"$error":"#VALUE!"},{"$error":"#VALUE!"},{"$error":"#VALUE!"},{"$error":"#VALUE!"},{"$error":"#VALUE!"},{"$error":"#VALUE!"},{"$error":"#VALUE!"}]
[null,null,null,null,null,null,null,null,{"$f":"IF(Results!C121=\"\",\"\",Results!B121)","v":""},null,"",null,{"$error":"#VALUE!"},{"$error":"#VALUE!"},{"$error":"#VALUE!"},{"$error":"#VALUE!"},{"$error":"#VALUE!"},{"$error":"#VALUE!"},{"$error":"#VALUE!"},{"$error":"#VALUE!"},{"$error":"#VALUE!"},{"$error":"#VALUE!"}]
[null,null,null,null,null,null,null,null,{"$f":"IF(Results!C122=\"\",\"\",Results!B122)","v":""},null,"",null,{"$error":"#VALUE!"},{"$error":"#VALUE!"},{"$error":"#VALUE!"},{"$error":"#VALUE!"},{"$error":"#VALUE!"},{"$error":"#VALUE!"},{"$error":"#VALUE!"},{"$error":"#VALUE!"},{"$error":"#VALUE!"},{"$error":"#VALUE!"}]
[null,null,null,null,null,null,null,null,{"$f":"IF(Results!C123=\"\",\"\",Results!B123)","v":""},null,"",null,{"$error":"#VALUE!"},{"$error":"#VALUE!"},{"$error":"#VALUE!"},{"$error":"#VALUE!"},{"$error":"#VALUE!"},{"$error":"#VALUE!"},{"$error":"#VALUE!"},{"$error":"#VALUE!"},{"$error":"#VALUE!"},{"$error":"#VALUE!"}]
[null,null,null,null,null,null,null,null,{"$f":"IF(Results!C124=\"\",\"\",Results!B124)","v":""},null,"",null,{"$error":"#VALUE!"},{"$error":"#VALUE!"},{"$error":"#VALUE!"},{"$error":"#VALUE!"},{"$error":"#VALUE!"},{"$error":"#VALUE!"},{"$error":"#VALUE!"},{"$error":"#VALUE!"},{"$error":"#VALUE!"},{"$error":"#VALUE!"}]
[null,null,null,null,null,null,null,null,{"$f":"IF(Results!C125=\"\",\"\",Results!B125)","v":""},null,"",null,{"$error":"#VALUE!"},{"$error":"#VALUE!"},{"$error":"#VALUE!"},{"$error":"#VALUE!"},{"$error":"#VALUE!"},{"$error":"#VALUE!"},{"$error":"#VALUE!"},{"$error":"#VALUE!"},{"$error":"#VALUE!"},{"$error":"#VALUE!"}]
[null,null,null,null,null,null,null,null,{"$f":"IF(Results!C126=\"\",\"\",Results!B126)","v":""},null,"",null,{"$error":"#VALUE!"},{"$error":"#VALUE!"},{"$error":"#VALUE!"},{"$error":"#VALUE!"},{"$error":"#VALUE!"},{"$error":"#VALUE!"},{"$error":"#VALUE!"},{"$error":"#VALUE!"},{"$error":"#VALUE!"},{"$error":"#VALUE!"}]
[null,null,null,null,null,null,null,null,{"$f":"IF(Results!C127=\"\",\"\",Results!B127)","v":""},null,"",null,{"$error":"#VALUE!"},{"$error":"#VALUE!"},{"$error":"#VALUE!"},{"$error":"#VALUE!"},{"$error":"#VALUE!"},{"$error":"#VALUE!"},{"$error":"#VALUE!"},{"$error":"#VALUE!"},{"$error":"#VALUE!"},{"$error":"#VALUE!"}]
[null,null,null,null,null,null,null,null,{"$f":"IF(Results!C128=\"\",\"\",Results!B128)","v":""},null,"",null,{"$error":"#VALUE!"},{"$error":"#VALUE!"},{"$error":"#VALUE!"},{"$error":"#VALUE!"},{"$error":"#VALUE!"},{"$error":"#VALUE!"},{"$error":"#VALUE!"},{"$error":"#VALUE!"},{"$error":"#VALUE!"},{"$error":"#VALUE!"}]
[null,null,null,null,null,null,null,null,{"$f":"IF(Results!C129=\"\",\"\",Results!B129)","v":""},null,"",null,{"$error":"#VALUE!"},{"$error":"#VALUE!"},{"$error":"#VALUE!"},{"$error":"#VALUE!"},{"$error":"#VALUE!"},{"$error":"#VALUE!"},{"$error":"#VALUE!"},{"$error":"#VALUE!"},{"$error":"#VALUE!"},{"$error":"#VALUE!"}]
[null,null,null,null,null,null,null,null,{"$f":"IF(Results!C130=\"\",\"\",Results!B130)","v":""},null,"",null,{"$error":"#VALUE!"},{"$error":"#VALUE!"},{"$error":"#VALUE!"},{"$error":"#VALUE!"},{"$error":"#VALUE!"},{"$error":"#VALUE!"},{"$error":"#VALUE!"},{"$error":"#VALUE!"},{"$error":"#VALUE!"},{"$error":"#VALUE!"}]
[null,null,null,null,null,null,null,null,{"$f":"IF(Results!C131=\"\",\"\",Results!B131)","v":""},null,"",null,{"$error":"#VALUE!"},{"$error":"#VALUE!"},{"$error":"#VALUE!"},{"$error":"#VALUE!"},{"$error":"#VALUE!"},{"$error":"#VALUE!"},{"$error":"#VALUE!"},{"$error":"#VALUE!"},{"$error":"#VALUE!"},{"$error":"#VALUE!"}]
[null,null,null,null,null,null,null,null,{"$f":"IF(Results!C132=\"\",\"\",Results!B132)","v":""},null,"",null,{"$error":"#VALUE!"},{"$error":"#VALUE!"},{"$error":"#VALUE!"},{"$error":"#VALUE!"},{"$error":"#VALUE!"},{"$error":"#VALUE!"},{"$error":"#VALUE!"},{"$error":"#VALUE!"},{"$error":"#VALUE!"},{"$error":"#VALUE!"}]
[null,null,null,null,null,null,null,null,{"$f":"IF(Results!C133=\"\",\"\",Results!B133)","v":""},null,"",null,{"$error":"#VALUE!"},{"$error":"#VALUE!"},{"$error":"#VALUE!"},{"$error":"#VALUE!"},{"$error":"#VALUE!"},{"$error":"#VALUE!"},{"$error":"#VALUE!"},{"$error":"#VALUE!"},{"$error":"#VALUE!"},{"$error":"#VALUE!"}]
[null,null,null,null,null,null,null,null,{"$f":"IF(Results!C134=\"\",\"\",Results!B134)","v":""},null,"",null,{"$error":"#VALUE!"},{"$error":"#VALUE!"},{"$error":"#VALUE!"},{"$error":"#VALUE!"},{"$error":"#VALUE!"},{"$error":"#VALUE!"},{"$error":"#VALUE!"},{"$error":"#VALUE!"},{"$error":"#VALUE!"},{"$error":"#VALUE!"}]
[null,null,null,null,null,null,null,null,{"$f":"IF(Results!C135=\"\",\"\",Results!B135)","v":""},null,"",null,{"$error":"#VALUE!"},{"$error":"#VALUE!"},{"$error":"#VALUE!"},{"$error":"#VALUE!"},{"$error":"#VALUE!"},{"$error":"#VALUE!"},{"$error":"#VALUE!"},{"$error":"#VALUE!"},{"$error":"#VALUE!"},{"$error":"#VALUE!"}]
[null,null,null,null,null,null,null,null,{"$f":"IF(Results!C136=\"\",\"\",Results!B136)","v":""},null,"",null,{"$error":"#VALUE!"},{"$error":"#VALUE!"},{"$error":"#VALUE!"},{"$error":"#VALUE!"},{"$error":"#VALUE!"},{"$error":"#VALUE!"},{"$error":"#VALUE!"},{"$error":"#VALUE!"},{"$error":"#VALUE!"},{"$error":"#VALUE!"}]
[null,null,null,null,null,null,null,null,{"$f":"IF(Results!C137=\"\",\"\",Results!B137)","v":""},null,"",null,{"$error":"#VALUE!"},{"$error":"#VALUE!"},{"$error":"#VALUE!"},{"$error":"#VALUE!"},{"$error":"#VALUE!"},{"$error":"#VALUE!"},{"$error":"#VALUE!"},{"$error":"#VALUE!"},{"$error":"#VALUE!"},{"$error":"#VALUE!"}]
[null,null,null,null,null,null,null,null,{"$f":"IF(Results!C138=\"\",\"\",Results!B138)","v":""},null,"",null,{"$error":"#VALUE!"},{"$error":"#VALUE!"},{"$error":"#VALUE!"},{"$error":"#VALUE!"},{"$error":"#VALUE!"},{"$error":"#VALUE!"},{"$error":"#VALUE!"},{"$error":"#VALUE!"},{"$error":"#VALUE!"},{"$error":"#VALUE!"}]
[null,null,null,null,null,null,null,null,{"$f":"IF(Results!C139=\"\",\"\",Results!B139)","v":""},null,"",null,{"$error":"#VALUE!"},{"$error":"#VALUE!"},{"$error":"#VALUE!"},{"$error":"#VALUE!"},{"$error":"#VALUE!"},{"$error":"#VALUE!"},{"$error":"#VALUE!"},{"$error":"#VALUE!"},{"$error":"#VALUE!"},{"$error":"#VALUE!"}]
[null,null,null,null,null,null,null,null,{"$f":"IF(Results!C140=\"\",\"\",Results!B140)","v":""},null,"",null,{"$error":"#VALUE!"},{"$error":"#VALUE!"},{"$error":"#VALUE!"},{"$error":"#VALUE!"},{"$error":"#VALUE!"},{"$error":"#VALUE!"},{"$error":"#VALUE!"},{"$error":"#VALUE!"},{"$error":"#VALUE!"},{"$error":"#VALUE!"}]
[null,null,null,null,null,null,null,null,{"$f":"IF(Results!C141=\"\",\"\",Results!B141)","v":""},null,"",null,{"$error":"#VALUE!"},{"$error":"#VALUE!"},{"$error":"#VALUE!"},{"$error":"#VALUE!"},{"$error":"#VALUE!"},{"$error":"#VALUE!"},{"$error":"#VALUE!"},{"$error":"#VALUE!"},{"$error":"#VALUE!"},{"$error":"#VALUE!"}]
[null,null,null,null,null,null,null,null,{"$f":"IF(Results!C142=\"\",\"\",Results!B142)","v":""},null,"",null,{"$error":"#VALUE!"},{"$error":"#VALUE!"},{"$error":"#VALUE!"},{"$error":"#VALUE!"},{"$error":"#VALUE!"},{"$error":"#VALUE!"},{"$error":"#VALUE!"},{"$error":"#VALUE!"},{"$error":"#VALUE!"},{"$error":"#VALUE!"}]
[null,null,null,null,null,null,null,null,{"$f":"IF(Results!C143=\"\",\"\",Results!B143)","v":""},null,"",null,{"$error":"#VALUE!"},{"$error":"#VALUE!"},{"$error":"#VALUE!"},{"$error":"#VALUE!"},{"$error":"#VALUE!"},{"$error":"#VALUE!"},{"$error":"#VALUE!"},{"$error":"#VALUE!"},{"$error":"#VALUE!"},{"$error":"#VALUE!"}]
[null,null,null,null,null,null,null,null,{"$f":"IF(Results!C144=\"\",\"\",Results!B144)","v":""},null,"",null,{"$error":"#VALUE!"},{"$error":"#VALUE!"},{"$error":"#VALUE!"},{"$error":"#VALUE!"},{"$error":"#VALUE!"},{"$error":"#VALUE!"},{"$error":"#VALUE!"},{"$error":"#VALUE!"},{"$error":"#VALUE!"},{"$error":"#VALUE!"}]
[null,null,null,null,null,null,null,null,{"$f":"IF(Results!C145=\"\",\"\",Results!B145)","v":""},null,"",null,{"$error":"#VALUE!"},{"$error":"#VALUE!"},{"$error":"#VALUE!"},{"$error":"#VALUE!"},{"$error":"#VALUE!"},{"$error":"#VALUE!"},{"$error":"#VALUE!"},{"$error":"#VALUE!"},{"$error":"#VALUE!"},{"$error":"#VALUE!"}]
[null,null,null,null,null,null,null,null,{"$f":"IF(Results!C146=\"\",\"\",Results!B146)","v":""},null,"",null,{"$error":"#VALUE!"},{"$error":"#VALUE!"},{"$error":"#VALUE!"},{"$error":"#VALUE!"},{"$error":"#VALUE!"},{"$error":"#VALUE!"},{"$error":"#VALUE!"},{"$error":"#VALUE!"},{"$error":"#VALUE!"},{"$error":"#VALUE!"}]
[null,null,null,null,null,null,null,null,{"$f":"IF(Results!C147=\"\",\"\",Results!B147)","v":""},null,"",null,{"$error":"#VALUE!"},{"$error":"#VALUE!"},{"$error":"#VALUE!"},{"$error":"#VALUE!"},{"$error":"#VALUE!"},{"$error":"#VALUE!"},{"$error":"#VALUE!"},{"$error":"#VALUE!"},{"$error":"#VALUE!"},{"$error":"#VALUE!"}]
[null,null,null,null,null,null,null,null,{"$f":"IF(Results!C148=\"\",\"\",Results!B148)","v":""},null,"",null,{"$error":"#VALUE!"},{"$error":"#VALUE!"},{"$error":"#VALUE!"},{"$error":"#VALUE!"},{"$error":"#VALUE!"},{"$error":"#VALUE!"},{"$error":"#VALUE!"},{"$error":"#VALUE!"},{"$error":"#VALUE!"},{"$error":"#VALUE!"}]
[null,null,null,null,null,null,null,null,{"$f":"IF(Results!C149=\"\",\"\",Results!B149)","v":""},null,"",null,{"$error":"#VALUE!"},{"$error":"#VALUE!"},{"$error":"#VALUE!"},{"$error":"#VALUE!"},{"$error":"#VALUE!"},{"$error":"#VALUE!"},{"$error":"#VALUE!"},{"$error":"#VALUE!"},{"$error":"#VALUE!"},{"$error":"#VALUE!"}]
[null,null,null,null,null,null,null,null,{"$f":"IF(Results!C150=\"\",\"\",Results!B150)","v":""},null,"",null,{"$error":"#VALUE!"},{"$error":"#VALUE!"},{"$error":"#VALUE!"},{"$error":"#VALUE!"},{"$error":"#VALUE!"},{"$error":"#VALUE!"},{"$error":"#VALUE!"},{"$error":"#VALUE!"},{"$error":"#VALUE!"},{"$error":"#VALUE!"}]
[null,null,null,null,null,null,null,null,{"$f":"IF(Results!C151=\"\",\"\",Results!B151)","v":""},null,"",null,{"$error":"#VALUE!"},{"$error":"#VALUE!"},{"$error":"#VALUE!"},{"$error":"#VALUE!"},{"$error":"#VALUE!"},{"$error":"#VALUE!"},{"$error":"#VALUE!"},{"$error":"#VALUE!"},{"$error":"#VALUE!"},{"$error":"#VALUE!"}]
[null,null,null,null,null,null,null,null,{"$f":"IF(Results!C152=\"\",\"\",Results!B152)","v":""},null,"",null,{"$error":"#VALUE!"},{"$error":"#VALUE!"},{"$error":"#VALUE!"},{"$error":"#VALUE!"},{"$error":"#VALUE!"},{"$error":"#VALUE!"},{"$error":"#VALUE!"},{"$error":"#VALUE!"},{"$error":"#VALUE!"},{"$error":"#VALUE!"}]
[null,null,null,null,null,null,null,null,{"$f":"IF(Results!C153=\"\",\"\",Results!B153)","v":""},null,"",null,{"$error":"#VALUE!"},{"$error":"#VALUE!"},{"$error":"#VALUE!"},{"$error":"#VALUE!"},{"$error":"#VALUE!"},{"$error":"#VALUE!"},{"$error":"#VALUE!"},{"$error":"#VALUE!"},{"$error":"#VALUE!"},{"$error":"#VALUE!"}]
[null,null,null,null,null,null,null,null,{"$f":"IF(Results!C154=\"\",\"\",Results!B154)","v":""},null,"",null,{"$error":"#VALUE!"},{"$error":"#VALUE!"},{"$error":"#VALUE!"},{"$error":"#VALUE!"},{"$error":"#VALUE!"},{"$error":"#VALUE!"},{"$error":"#VALUE!"},{"$error":"#VALUE!"},{"$error":"#VALUE!"},{"$error":"#VALUE!"}]
[null,null,null,null,null,null,null,null,{"$f":"IF(Results!C155=\"\",\"\",Results!B155)","v":""},null,"",null,{"$error":"#VALUE!"},{"$error":"#VALUE!"},{"$error":"#VALUE!"},{"$error":"#VALUE!"},{"$error":"#VALUE!"},{"$error":"#VALUE!"},{"$error":"#VALUE!"},{"$error":"#VALUE!"},{"$error":"#VALUE!"},{"$error":"#VALUE!"}]
[null,null,null,null,null,null,null,null,{"$f":"IF(Results!C156=\"\",\"\",Results!B156)","v":""},null,"",null,{"$error":"#VALUE!"},{"$error":"#VALUE!"},{"$error":"#VALUE!"},{"$error":"#VALUE!"},{"$error":"#VALUE!"},{"$error":"#VALUE!"},{"$error":"#VALUE!"},{"$error":"#VALUE!"},{"$error":"#VALUE!"},{"$error":"#VALUE!"}]
[null,null,null,null,null,null,null,null,{"$f":"IF(Results!C157=\"\",\"\",Results!B157)","v":""},null,"",null,{"$error":"#VALUE!"},{"$error":"#VALUE!"},{"$error":"#VALUE!"},{"$error":"#VALUE!"},{"$error":"#VALUE!"},{"$error":"#VALUE!"},{"$error":"#VALUE!"},{"$error":"#VALUE!"},{"$error":"#VALUE!"},{"$error":"#VALUE!"}]
[null,null,null,null,null,null,null,null,{"$f":"IF(Results!C158=\"\",\"\",Results!B158)","v":""},null,"",null,{"$error":"#VALUE!"},{"$error":"#VALUE!"},{"$error":"#VALUE!"},{"$error":"#VALUE!"},{"$error":"#VALUE!"},{"$error":"#VALUE!"},{"$error":"#VALUE!"},{"$error":"#VALUE!"},{"$error":"#VALUE!"},{"$error":"#VALUE!"}]
[null,null,null,null,null,null,null,null,{"$f":"IF(Results!C159=\"\",\"\",Results!B159)","v":""},null,"",null,{"$error":"#VALUE!"},{"$error":"#VALUE!"},{"$error":"#VALUE!"},{"$error":"#VALUE!"},{"$error":"#VALUE!"},{"$error":"#VALUE!"},{"$error":"#VALUE!"},{"$error":"#VALUE!"},{"$error":"#VALUE!"},{"$error":"#VALUE!"}]
[null,null,null,null,null,null,null,null,{"$f":"IF(Results!C160=\"\",\"\",Results!B160)","v":""},null,"",null,{"$error":"#VALUE!"},{"$error":"#VALUE!"},{"$error":"#VALUE!"},{"$error":"#VALUE!"},{"$error":"#VALUE!"},{"$error":"#VALUE!"},{"$error":"#VALUE!"},{"$error":"#VALUE!"},{"$error":"#VALUE!"},{"$error":"#VALUE!"}]
[null,null,null,null,null,null,null,null,{"$f":"IF(Results!C161=\"\",\"\",Results!B161)","v":""},null,"",null,{"$error":"#VALUE!"},{"$error":"#VALUE!"},{"$error":"#VALUE!"},{"$error":"#VALUE!"},{"$error":"#VALUE!"},{"$error":"#VALUE!"},{"$error":"#VALUE!"},{"$error":"#VALUE!"},{"$error":"#VALUE!"},{"$error":"#VALUE!"}]
[null,null,null,null,null,null,null,null,{"$f":"IF(Results!C162=\"\",\"\",Results!B162)","v":""},null,"",null,{"$error":"#VALUE!"},{"$error":"#VALUE!"},{"$error":"#VALUE!"},{"$error":"#VALUE!"},{"$error":"#VALUE!"},{"$error":"#VALUE!"},{"$error":"#VALUE!"},{"$error":"#VALUE!"},{"$error":"#VALUE!"},{"$error":"#VALUE!"}]
[null,null,null,null,null,null,null,null,{"$f":"IF(Results!C163=\"\",\"\",Results!B163)","v":""},null,"",null,{"$error":"#VALUE!"},{"$error":"#VALUE!"},{"$error":"#VALUE!"},{"$error":"#VALUE!"},{"$error":"#VALUE!"},{"$error":"#VALUE!"},{"$error":"#VALUE!"},{"$error":"#VALUE!"},{"$error":"#VALUE!"},{"$error":"#VALUE!"}]
[null,null,null,null,null,null,null,null,{"$f":"IF(Results!C164=\"\",\"\",Results!B164)","v":""},null,"",null,{"$error":"#VALUE!"},{"$error":"#VALUE!"},{"$error":"#VALUE!"},{"$error":"#VALUE!"},{"$error":"#VALUE!"},{"$error":"#VALUE!"},{"$error":"#VALUE!"},{"$error":"#VALUE!"},{"$error":"#VALUE!"},{"$error":"#VALUE!"}]
[null,null,null,null,null,null,null,null,{"$f":"IF(Results!C165=\"\",\"\",Results!B165)","v":""},null,"",null,{"$error":"#VALUE!"},{"$error":"#VALUE!"},{"$error":"#VALUE!"},{"$error":"#VALUE!"},{"$error":"#VALUE!"},{"$error":"#VALUE!"},{"$error":"#VALUE!"},{"$error":"#VALUE!"},{"$error":"#VALUE!"},{"$error":"#VALUE!"}]
[null,null,null,null,null,null,null,null,{"$f":"IF(Results!C166=\"\",\"\",Results!B166)","v":""},null,"",null,{"$error":"#VALUE!"},{"$error":"#VALUE!"},{"$error":"#VALUE!"},{"$error":"#VALUE!"},{"$error":"#VALUE!"},{"$error":"#VALUE!"},{"$error":"#VALUE!"},{"$error":"#VALUE!"},{"$error":"#VALUE!"},{"$error":"#VALUE!"}]
[null,null,null,null,null,null,null,null,{"$f":"IF(Results!C167=\"\",\"\",Results!B167)","v":""},null,"",null,{"$error":"#VALUE!"},{"$error":"#VALUE!"},{"$error":"#VALUE!"},{"$error":"#VALUE!"},{"$error":"#VALUE!"},{"$error":"#VALUE!"},{"$error":"#VALUE!"},{"$error":"#VALUE!"},{"$error":"#VALUE!"},{"$error":"#VALUE!"}]
[null,null,null,null,null,null,null,null,{"$f":"IF(Results!C168=\"\",\"\",Results!B168)","v":""},null,{"$f":"IF($C$6=\"\",\"\",IF(I168=\"\",\"\",50-SUM(Q168:V168)))","v":""},null,{"$f":"SEARCH($C$6,J168)","v":{"$error":"#VALUE!"}},{"$f":"SEARCH($D$6,J168)","v":{"$error":"#VALUE!"}},{"$f":"SEARCH($E$6,J168)","v":{"$error":"#VALUE!"}},{"$f":"SEARCH($F$6,J168)","v":{"$error":"#VALUE!"}},{"$f":"IF((N168-M168)<0,$C$8,0)","v":{"$error":"#VALUE!"}},{"$f":"IF((O168-M168)<0,$C$8+$D$8,0)","v":{"$error":"#VALUE!"}},{"$f":"IF((P168-M168)<0,$C$8+$D$8+$E$8,0)","v":{"$error":"#VALUE!"}},{"$f":"IF((O168-N168)<0,$D$8,0)","v":{"$error":"#VALUE!"}},{"$f":"IF((P168-N168)<0,$D$8+$E$8,0)","v":{"$error":"#VALUE!"}},{"$f":"IF((P168-O168)<0,$E$8,0)","v":{"$error":"#VALUE!"}}]
[null,null,null,null,null,null,null,null,{"$f":"IF(Results!C169=\"\",\"\",Results!B169)","v":""},null,"",null,{"$error":"#VALUE!"},{"$error":"#VALUE!"},{"$error":"#VALUE!"},{"$error":"#VALUE!"},{"$error":"#VALUE!"},{"$error":"#VALUE!"},{"$error":"#VALUE!"},{"$error":"#VALUE!"},{"$error":"#VALUE!"},{"$error":"#VALUE!"}]
[null,null,null,null,null,null,null,null,{"$f":"IF(Results!C170=\"\",\"\",Results!B170)","v":""},null,"",null,{"$error":"#VALUE!"},{"$error":"#VALUE!"},{"$error":"#VALUE!"},{"$error":"#VALUE!"},{"$error":"#VALUE!"},{"$error":"#VALUE!"},{"$error":"#VALUE!"},{"$error":"#VALUE!"},{"$error":"#VALUE!"},{"$error":"#VALUE!"}]
[null,null,null,null,null,null,null,null,{"$f":"IF(Results!C171=\"\",\"\",Results!B171)","v":""},null,"",null,{"$error":"#VALUE!"},{"$error":"#VALUE!"},{"$error":"#VALUE!"},{"$error":"#VALUE!"},{"$error":"#VALUE!"},{"$error":"#VALUE!"},{"$error":"#VALUE!"},{"$error":"#VALUE!"},{"$error":"#VALUE!"},{"$error":"#VALUE!"}]
[null,null,null,null,null,null,null,null,{"$f":"IF(Results!C172=\"\",\"\",Results!B172)","v":""},null,"",null,{"$error":"#VALUE!"},{"$error":"#VALUE!"},{"$error":"#VALUE!"},{"$error":"#VALUE!"},{"$error":"#VALUE!"},{"$error":"#VALUE!"},{"$error":"#VALUE!"},{"$error":"#VALUE!"},{"$error":"#VALUE!"},{"$error":"#VALUE!"}]
[null,null,null,null,null,null,null,null,{"$f":"IF(Results!C173=\"\",\"\",Results!B173)","v":""},null,"",null,{"$error":"#VALUE!"},{"$error":"#VALUE!"},{"$error":"#VALUE!"},{"$error":"#VALUE!"},{"$error":"#VALUE!"},{"$error":"#VALUE!"},{"$error":"#VALUE!"},{"$error":"#VALUE!"},{"$error":"#VALUE!"},{"$error":"#VALUE!"}]
[null,null,null,null,null,null,null,null,{"$f":"IF(Results!C174=\"\",\"\",Results!B174)","v":""},null,"",null,{"$error":"#VALUE!"},{"$error":"#VALUE!"},{"$error":"#VALUE!"},{"$error":"#VALUE!"},{"$error":"#VALUE!"},{"$error":"#VALUE!"},{"$error":"#VALUE!"},{"$error":"#VALUE!"},{"$error":"#VALUE!"},{"$error":"#VALUE!"}]
[null,null,null,null,null,null,null,null,{"$f":"IF(Results!C175=\"\",\"\",Results!B175)","v":""},null,"",null,{"$error":"#VALUE!"},{"$error":"#VALUE!"},{"$error":"#VALUE!"},{"$error":"#VALUE!"},{"$error":"#VALUE!"},{"$error":"#VALUE!"},{"$error":"#VALUE!"},{"$error":"#VALUE!"},{"$error":"#VALUE!"},{"$error":"#VALUE!"}]
[null,null,null,null,null,null,null,null,{"$f":"IF(Results!C176=\"\",\"\",Results!B176)","v":""},null,"",null,{"$error":"#VALUE!"},{"$error":"#VALUE!"},{"$error":"#VALUE!"},{"$error":"#VALUE!"},{"$error":"#VALUE!"},{"$error":"#VALUE!"},{"$error":"#VALUE!"},{"$error":"#VALUE!"},{"$error":"#VALUE!"},{"$error":"#VALUE!"}]
[null,null,null,null,null,null,null,null,{"$f":"IF(Results!C177=\"\",\"\",Results!B177)","v":""},null,"",null,{"$error":"#VALUE!"},{"$error":"#VALUE!"},{"$error":"#VALUE!"},{"$error":"#VALUE!"},{"$error":"#VALUE!"},{"$error":"#VALUE!"},{"$error":"#VALUE!"},{"$error":"#VALUE!"},{"$error":"#VALUE!"},{"$error":"#VALUE!"}]
[null,null,null,null,null,null,null,null,{"$f":"IF(Results!C178=\"\",\"\",Results!B178)","v":""},null,"",null,{"$error":"#VALUE!"},{"$error":"#VALUE!"},{"$error":"#VALUE!"},{"$error":"#VALUE!"},{"$error":"#VALUE!"},{"$error":"#VALUE!"},{"$error":"#VALUE!"},{"$error":"#VALUE!"},{"$error":"#VALUE!"},{"$error":"#VALUE!"}]
[null,null,null,null,null,null,null,null,{"$f":"IF(Results!C179=\"\",\"\",Results!B179)","v":""},null,"",null,{"$error":"#VALUE!"},{"$error":"#VALUE!"},{"$error":"#VALUE!"},{"$error":"#VALUE!"},{"$error":"#VALUE!"},{"$error":"#VALUE!"},{"$error":"#VALUE!"},{"$error":"#VALUE!"},{"$error":"#VALUE!"},{"$error":"#VALUE!"}]
[null,null,null,null,null,null,null,null,{"$f":"IF(Results!C180=\"\",\"\",Results!B180)","v":""},null,"",null,{"$error":"#VALUE!"},{"$error":"#VALUE!"},{"$error":"#VALUE!"},{"$error":"#VALUE!"},{"$error":"#VALUE!"},{"$error":"#VALUE!"},{"$error":"#VALUE!"},{"$error":"#VALUE!"},{"$error":"#VALUE!"},{"$error":"#VALUE!"}]
[null,null,null,null,null,null,null,null,{"$f":"IF(Results!C181=\"\",\"\",Results!B181)","v":""},null,"",null,{"$error":"#VALUE!"},{"$error":"#VALUE!"},{"$error":"#VALUE!"},{"$error":"#VALUE!"},{"$error":"#VALUE!"},{"$error":"#VALUE!"},{"$error":"#VALUE!"},{"$error":"#VALUE!"},{"$error":"#VALUE!"},{"$error":"#VALUE!"}]
[null,null,null,null,null,null,null,null,{"$f":"IF(Results!C182=\"\",\"\",Results!B182)","v":""},null,"",null,{"$error":"#VALUE!"},{"$error":"#VALUE!"},{"$error":"#VALUE!"},{"$error":"#VALUE!"},{"$error":"#VALUE!"},{"$error":"#VALUE!"},{"$error":"#VALUE!"},{"$error":"#VALUE!"},{"$error":"#VALUE!"},{"$error":"#VALUE!"}]
[null,null,null,null,null,null,null,null,{"$f":"IF(Results!C183=\"\",\"\",Results!B183)","v":""},null,"",null,{"$error":"#VALUE!"},{"$error":"#VALUE!"},{"$error":"#VALUE!"},{"$error":"#VALUE!"},{"$error":"#VALUE!"},{"$error":"#VALUE!"},{"$error":"#VALUE!"},{"$error":"#VALUE!"},{"$error":"#VALUE!"},{"$error":"#VALUE!"}]
[null,null,null,null,null,null,null,null,{"$f":"IF(Results!C184=\"\",\"\",Results!B184)","v":""},null,"",null,{"$error":"#VALUE!"},{"$error":"#VALUE!"},{"$error":"#VALUE!"},{"$error":"#VALUE!"},{"$error":"#VALUE!"},{"$error":"#VALUE!"},{"$error":"#VALUE!"},{"$error":"#VALUE!"},{"$error":"#VALUE!"},{"$error":"#VALUE!"}]
[null,null,null,null,null,null,null,null,{"$f":"IF(Results!C185=\"\",\"\",Results!B185)","v":""},null,"",null,{"$error":"#VALUE!"},{"$error":"#VALUE!"},{"$error":"#VALUE!"},{"$error":"#VALUE!"},{"$error":"#VALUE!"},{"$error":"#VALUE!"},{"$error":"#VALUE!"},{"$error":"#VALUE!"},{"$error":"#VALUE!"},{"$error":"#VALUE!"}]
[null,null,null,null,null,null,null,null,{"$f":"IF(Results!C186=\"\",\"\",Results!B186)","v":""},null,"",null,{"$error":"#VALUE!"},{"$error":"#VALUE!"},{"$error":"#VALUE!"},{"$error":"#VALUE!"},{"$error":"#VALUE!"},{"$error":"#VALUE!"},{"$error":"#VALUE!"},{"$error":"#VALUE!"},{"$error":"#VALUE!"},{"$error":"#VALUE!"}]
[null,null,null,null,null,null,null,null,{"$f":"IF(Results!C187=\"\",\"\",Results!B187)","v":""},null,"",null,{"$error":"#VALUE!"},{"$error":"#VALUE!"},{"$error":"#VALUE!"},{"$error":"#VALUE!"},{"$error":"#VALUE!"},{"$error":"#VALUE!"},{"$error":"#VALUE!"},{"$error":"#VALUE!"},{"$error":"#VALUE!"},{"$error":"#VALUE!"}]
[null,null,null,null,null,null,null,null,{"$f":"IF(Results!C188=\"\",\"\",Results!B188)","v":""},null,"",null,{"$error":"#VALUE!"},{"$error":"#VALUE!"},{"$error":"#VALUE!"},{"$error":"#VALUE!"},{"$error":"#VALUE!"},{"$error":"#VALUE!"},{"$error":"#VALUE!"},{"$error":"#VALUE!"},{"$error":"#VALUE!"},{"$error":"#VALUE!"}]
[null,null,null,null,null,null,null,null,{"$f":"IF(Results!C189=\"\",\"\",Results!B189)","v":""},null,"",null,{"$error":"#VALUE!"},{"$error":"#VALUE!"},{"$error":"#VALUE!"},{"$error":"#VALUE!"},{"$error":"#VALUE!"},{"$error":"#VALUE!"},{"$error":"#VALUE!"},{"$error":"#VALUE!"},{"$error":"#VALUE!"},{"$error":"#VALUE!"}]
[null,null,null,null,null,null,null,null,{"$f":"IF(Results!C190=\"\",\"\",Results!B190)","v":""},null,"",null,{"$error":"#VALUE!"},{"$error":"#VALUE!"},{"$error":"#VALUE!"},{"$error":"#VALUE!"},{"$error":"#VALUE!"},{"$error":"#VALUE!"},{"$error":"#VALUE!"},{"$error":"#VALUE!"},{"$error":"#VALUE!"},{"$error":"#VALUE!"}]
[null,null,null,null,null,null,null,null,{"$f":"IF(Results!C191=\"\",\"\",Results!B191)","v":""},null,"",null,{"$error":"#VALUE!"},{"$error":"#VALUE!"},{"$error":"#VALUE!"},{"$error":"#VALUE!"},{"$error":"#VALUE!"},{"$error":"#VALUE!"},{"$error":"#VALUE!"},{"$error":"#VALUE!"},{"$error":"#VALUE!"},{"$error":"#VALUE!"}]
[null,null,null,null,null,null,null,null,{"$f":"IF(Results!C192=\"\",\"\",Results!B192)","v":""},null,"",null,{"$error":"#VALUE!"},{"$error":"#VALUE!"},{"$error":"#VALUE!"},{"$error":"#VALUE!"},{"$error":"#VALUE!"},{"$error":"#VALUE!"},{"$error":"#VALUE!"},{"$error":"#VALUE!"},{"$error":"#VALUE!"},{"$error":"#VALUE!"}]
[null,null,null,null,null,null,null,null,{"$f":"IF(Results!C193=\"\",\"\",Results!B193)","v":""},null,"",null,{"$error":"#VALUE!"},{"$error":"#VALUE!"},{"$error":"#VALUE!"},{"$error":"#VALUE!"},{"$error":"#VALUE!"},{"$error":"#VALUE!"},{"$error":"#VALUE!"},{"$error":"#VALUE!"},{"$error":"#VALUE!"},{"$error":"#VALUE!"}]
[null,null,null,null,null,null,null,null,{"$f":"IF(Results!C194=\"\",\"\",Results!B194)","v":""},null,"",null,{"$error":"#VALUE!"},{"$error":"#VALUE!"},{"$error":"#VALUE!"},{"$error":"#VALUE!"},{"$error":"#VALUE!"},{"$error":"#VALUE!"},{"$error":"#VALUE!"},{"$error":"#VALUE!"},{"$error":"#VALUE!"},{"$error":"#VALUE!"}]
[null,null,null,null,null,null,null,null,{"$f":"IF(Results!C195=\"\",\"\",Results!B195)","v":""},null,"",null,{"$error":"#VALUE!"},{"$error":"#VALUE!"},{"$error":"#VALUE!"},{"$error":"#VALUE!"},{"$error":"#VALUE!"},{"$error":"#VALUE!"},{"$error":"#VALUE!"},{"$error":"#VALUE!"},{"$error":"#VALUE!"},{"$error":"#VALUE!"}]
[null,null,null,null,null,null,null,null,{"$f":"IF(Results!C196=\"\",\"\",Results!B196)","v":""},null,"",null,{"$error":"#VALUE!"},{"$error":"#VALUE!"},{"$error":"#VALUE!"},{"$error":"#VALUE!"},{"$error":"#VALUE!"},{"$error":"#VALUE!"},{"$error":"#VALUE!"},{"$error":"#VALUE!"},{"$error":"#VALUE!"},{"$error":"#VALUE!"}]
[null,null,null,null,null,null,null,null,{"$f":"IF(Results!C197=\"\",\"\",Results!B197)","v":""},null,"",null,{"$error":"#VALUE!"},{"$error":"#VALUE!"},{"$error":"#VALUE!"},{"$error":"#VALUE!"},{"$error":"#VALUE!"},{"$error":"#VALUE!"},{"$error":"#VALUE!"},{"$error":"#VALUE!"},{"$error":"#VALUE!"},{"$error":"#VALUE!"}]
[null,null,null,null,null,null,null,null,{"$f":"IF(Results!C198=\"\",\"\",Results!B198)","v":""},null,"",null,{"$error":"#VALUE!"},{"$error":"#VALUE!"},{"$error":"#VALUE!"},{"$error":"#VALUE!"},{"$error":"#VALUE!"},{"$error":"#VALUE!"},{"$error":"#VALUE!"},{"$error":"#VALUE!"},{"$error":"#VALUE!"},{"$error":"#VALUE!"}]
[null,null,null,null,null,null,null,null,{"$f":"IF(Results!C199=\"\",\"\",Results!B199)","v":""},null,"",null,{"$error":"#VALUE!"},{"$error":"#VALUE!"},{"$error":"#VALUE!"},{"$error":"#VALUE!"},{"$error":"#VALUE!"},{"$error":"#VALUE!"},{"$error":"#VALUE!"},{"$error":"#VALUE!"},{"$error":"#VALUE!"},{"$error":"#VALUE!"}]
[null,null,null,null,null,null,null,null,{"$f":"IF(Results!C200=\"\",\"\",Results!B200)","v":""},null,"",null,{"$error":"#VALUE!"},{"$error":"#VALUE!"},{"$error":"#VALUE!"},{"$error":"#VALUE!"},{"$error":"#VALUE!"},{"$error":"#VALUE!"},{"$error":"#VALUE!"},{"$error":"#VALUE!"},{"$error":"#VALUE!"},{"$error":"#VALUE!"}]
[null,null,null,null,null,null,null,null,{"$f":"IF(Results!C201=\"\",\"\",Results!B201)","v":""},null,"",null,{"$error":"#VALUE!"},{"$error":"#VALUE!"},{"$error":"#VALUE!"},{"$error":"#VALUE!"},{"$error":"#VALUE!"},{"$error":"#VALUE!"},{"$error":"#VALUE!"},{"$error":"#VALUE!"},{"$error":"#VALUE!"},{"$error":"#VALUE!"}]
[null,null,null,null,null,null,null,null,{"$f":"IF(Results!C202=\"\",\"\",Results!B202)","v":""},null,"",null,{"$error":"#VALUE!"},{"$error":"#VALUE!"},{"$error":"#VALUE!"},{"$error":"#VALUE!"},{"$error":"#VALUE!"},{"$error":"#VALUE!"},{"$error":"#VALUE!"},{"$error":"#VALUE!"},{"$error":"#VALUE!"},{"$error":"#VALUE!"}]
[null,null,null,null,null,null,null,null,{"$f":"IF(Results!C203=\"\",\"\",Results!B203)","v":""},null,"",null,{"$error":"#VALUE!"},{"$error":"#VALUE!"},{"$error":"#VALUE!"},{"$error":"#VALUE!"},{"$error":"#VALUE!"},{"$error":"#VALUE!"},{"$error":"#VALUE!"},{"$error":"#VALUE!"},{"$error":"#VALUE!"},{"$error":"#VALUE!"}]

{"sheet":"Group4","index":5,"n_rows":203,"n_cols":22,"rows_kept":203,"cut":false,"hidden":false,"merged":[[1,3,1,8]]}
[]
[null,null,"Group 4 :"]
[null,null,null,null,null,null,null,null,"Entrant No","Placings","Score",null,"J1","J2","J3","J4","PO","QO","RO","QP","RP","RQ"]
[null,null,null,null,null,null,null,null,{"$f":"IF(Results!C4=\"\",\"\",Results!B4)","v":""},null,{"$f":"IF($C$6=\"\",\"\",IF(I4=\"\",\"\",50-SUM(Q4:V4)))","v":""},null,{"$f":"SEARCH($C$6,J4)","v":{"$error":"#VALUE!"}},{"$f":"SEARCH($D$6,J4)","v":{"$error":"#VALUE!"}},{"$f":"SEARCH($E$6,J4)","v":{"$error":"#VALUE!"}},{"$f":"SEARCH($F$6,J4)","v":{"$error":"#VALUE!"}},{"$f":"IF((N4-M4)<0,$C$8,0)","v":{"$error":"#VALUE!"}},{"$f":"IF((O4-M4)<0,$C$8+$D$8,0)","v":{"$error":"#VALUE!"}},{"$f":"IF((P4-M4)<0,$C$8+$D$8+$E$8,0)","v":{"$error":"#VALUE!"}},{"$f":"IF((O4-N4)<0,$D$8,0)","v":{"$error":"#VALUE!"}},{"$f":"IF((P4-N4)<0,$D$8+$E$8,0)","v":{"$error":"#VALUE!"}},{"$f":"IF((P4-O4)<0,$E$8,0)","v":{"$error":"#VALUE!"}}]
[null,null,"Judge's Placings",null,null,null,null,null,{"$f":"IF(Results!C5=\"\",\"\",Results!B5)","v":""},null,{"$f":"IF($C$6=\"\",\"\",IF(I5=\"\",\"\",50-SUM(Q5:V5)))","v":""},null,{"$error":"#VALUE!"},{"$error":"#VALUE!"},{"$error":"#VALUE!"},{"$error":"#VALUE!"},{"$error":"#VALUE!"},{"$error":"#VALUE!"},{"$error":"#VALUE!"},{"$error":"#VALUE!"},{"$error":"#VALUE!"},{"$error":"#VALUE!"}]
[null,null,null,null,null,null,null,null,{"$f":"IF(Results!C6=\"\",\"\",Results!B6)","v":""},null,"",null,{"$error":"#VALUE!"},{"$error":"#VALUE!"},{"$error":"#VALUE!"},{"$error":"#VALUE!"},{"$error":"#VALUE!"},{"$error":"#VALUE!"},{"$error":"#VALUE!"},{"$error":"#VALUE!"},{"$error":"#VALUE!"},{"$error":"#VALUE!"}]
[null,null,"Judge's Cuts",null,null,null,null,null,{"$f":"IF(Results!C7=\"\",\"\",Results!B7)","v":""},null,"",null,{"$error":"#VALUE!"},{"$error":"#VALUE!"},{"$error":"#VALUE!"},{"$error":"#VALUE!"},{"$error":"#VALUE!"},{"$error":"#VALUE!"},{"$error":"#VALUE!"},{"$error":"#VALUE!"},{"$error":"#VALUE!"},{"$error":"#VALUE!"}]
[null,null,null,null,null,null,null,null,{"$f":"IF(Results!C8=\"\",\"\",Results!B8)","v":""},null,"",null,{"$error":"#VALUE!"},{"$error":"#VALUE!"},{"$error":"#VALUE!"},{"$error":"#VALUE!"},{"$error":"#VALUE!"},{"$error":"#VALUE!"},{"$error":"#VALUE!"},{"$error":"#VALUE!"},{"$error":"#VALUE!"},{"$error":"#VALUE!"}]
[null,null,null,null,null,null,null,null,{"$f":"IF(Results!C9=\"\",\"\",Results!B9)","v":""},null,"",null,{"$error":"#VALUE!"},{"$error":"#VALUE!"},{"$error":"#VALUE!"},{"$error":"#VALUE!"},{"$error":"#VALUE!"},{"$error":"#VALUE!"},{"$error":"#VALUE!"},{"$error":"#VALUE!"},{"$error":"#VALUE!"},{"$error":"#VALUE!"}]
[null,null,{"$f":"IF($C$8=\"\",\"\",IF(($C$8+$D$8+$E$8)<3,\"WARNING : Cuts total less than 3\",\"\"))","v":""},null,null,null,null,null,{"$f":"IF(Results!C10=\"\",\"\",Results!B10)","v":""},null,"",null,{"$error":"#VALUE!"},{"$error":"#VALUE!"},{"$error":"#VALUE!"},{"$error":"#VALUE!"},{"$error":"#VALUE!"},{"$error":"#VALUE!"},{"$error":"#VALUE!"},{"$error":"#VALUE!"},{"$error":"#VALUE!"},{"$error":"#VALUE!"}]
[null,null,{"$f":"IF(($C$8+$D$8+$E$8)>15,\"WARNING : Cuts total more than 15\",\"\")","v":""},null,null,null,null,null,{"$f":"IF(Results!C11=\"\",\"\",Results!B11)","v":""},null,"",null,{"$error":"#VALUE!"},{"$error":"#VALUE!"},{"$error":"#VALUE!"},{"$error":"#VALUE!"},{"$error":"#VALUE!"},{"$error":"#VALUE!"},{"$error":"#VALUE!"},{"$error":"#VALUE!"},{"$error":"#VALUE!"},{"$error":"#VALUE!"}]
[null,null,{"$f":"IF(AND(($C$8+$D$8+$E$8)>=15,$D$8>5),\"WARNING : Middle cut more than 5\",\"\")","v":""},null,null,null,null,null,{"$f":"IF(Results!C12=\"\",\"\",Results!B12)","v":""},null,"",null,{"$error":"#VALUE!"},{"$error":"#VALUE!"},{"$error":"#VALUE!"},{"$error":"#VALUE!"},{"$error":"#VALUE!"},{"$error":"#VALUE!"},{"$error":"#VALUE!"},{"$error":"#VALUE!"},{"$error":"#VALUE!"},{"$error":"#VALUE!"}]
[null,null,{"$f":"IF(AND(($C$8+$D$8+$E$8)=14,$D$8>8),\"WARNING : Middle cut more than 8\",\"\")","v":""},null,null,null,null,null,{"$f":"IF(Results!C13=\"\",\"\",Results!B13)","v":""},null,"",null,{"$error":"#VALUE!"},{"$error":"#VALUE!"},{"$error":"#VALUE!"},{"$error":"#VALUE!"},{"$error":"#VALUE!"},{"$error":"#VALUE!"},{"$error":"#VALUE!"},{"$error":"#VALUE!"},{"$error":"#VALUE!"},{"$error":"#VALUE!"}]
[null,null,{"$f":"IF(AND(C10=\"\",C11=\"\",C12=\"\",C13=\"\"),\"\",\"Please discuss with Judge\")","v":""},null,null,null,null,null,{"$f":"IF(Results!C14=\"\",\"\",Results!B14)","v":""},null,"",null,{"$error":"#VALUE!"},{"$error":"#VALUE!"},{"$error":"#VALUE!"},{"$error":"#VALUE!"},{"$error":"#VALUE!"},{"$error":"#VALUE!"},{"$error":"#VALUE!"},{"$error":"#VALUE!"},{"$error":"#VALUE!"},{"$error":"#VALUE!"}]
[null,null,null,null,null,null,null,null,{"$f":"IF(Results!C15=\"\",\"\",Results!B15)","v":""},null,"",null,{"$error":"#VALUE!"},{"$error":"#VALUE!"},{"$error":"#VALUE!"},{"$error":"#VALUE!"},{"$error":"#VALUE!"},{"$error":"#VALUE!"},{"$error":"#VALUE!"},{"$error":"#VALUE!"},{"$error":"#VALUE!"},{"$error":"#VALUE!"}]
[null,null,null,null,null,null,null,null,{"$f":"IF(Results!C16=\"\",\"\",Results!B16)","v":""},null,"",null,{"$error":"#VALUE!"},{"$error":"#VALUE!"},{"$error":"#VALUE!"},{"$error":"#VALUE!"},{"$error":"#VALUE!"},{"$error":"#VALUE!"},{"$error":"#VALUE!"},{"$error":"#VALUE!"},{"$error":"#VALUE!"},{"$error":"#VALUE!"}]
[null,null,null,null,null,null,null,null,{"$f":"IF(Results!C17=\"\",\"\",Results!B17)","v":""},null,"",null,{"$error":"#VALUE!"},{"$error":"#VALUE!"},{"$error":"#VALUE!"},{"$error":"#VALUE!"},{"$error":"#VALUE!"},{"$error":"#VALUE!"},{"$error":"#VALUE!"},{"$error":"#VALUE!"},{"$error":"#VALUE!"},{"$error":"#VALUE!"}]
[null,null,null,null,null,null,null,null,{"$f":"IF(Results!C18=\"\",\"\",Results!B18)","v":""},null,"",null,{"$error":"#VALUE!"},{"$error":"#VALUE!"},{"$error":"#VALUE!"},{"$error":"#VALUE!"},{"$error":"#VALUE!"},{"$error":"#VALUE!"},{"$error":"#VALUE!"},{"$error":"#VALUE!"},{"$error":"#VALUE!"},{"$error":"#VALUE!"}]
[null,null,null,null,null,null,null,null,{"$f":"IF(Results!C19=\"\",\"\",Results!B19)","v":""},null,"",null,{"$error":"#VALUE!"},{"$error":"#VALUE!"},{"$error":"#VALUE!"},{"$error":"#VALUE!"},{"$error":"#VALUE!"},{"$error":"#VALUE!"},{"$error":"#VALUE!"},{"$error":"#VALUE!"},{"$error":"#VALUE!"},{"$error":"#VALUE!"}]
[null,null,null,null,null,null,null,null,{"$f":"IF(Results!C20=\"\",\"\",Results!B20)","v":""},null,"",null,{"$error":"#VALUE!"},{"$error":"#VALUE!"},{"$error":"#VALUE!"},{"$error":"#VALUE!"},{"$error":"#VALUE!"},{"$error":"#VALUE!"},{"$error":"#VALUE!"},{"$error":"#VALUE!"},{"$error":"#VALUE!"},{"$error":"#VALUE!"}]
[null,null,null,null,null,null,null,null,{"$f":"IF(Results!C21=\"\",\"\",Results!B21)","v":""},null,"",null,{"$error":"#VALUE!"},{"$error":"#VALUE!"},{"$error":"#VALUE!"},{"$error":"#VALUE!"},{"$error":"#VALUE!"},{"$error":"#VALUE!"},{"$error":"#VALUE!"},{"$error":"#VALUE!"},{"$error":"#VALUE!"},{"$error":"#VALUE!"}]
[null,null,null,null,null,null,null,null,{"$f":"IF(Results!C22=\"\",\"\",Results!B22)","v":""},null,"",null,{"$error":"#VALUE!"},{"$error":"#VALUE!"},{"$error":"#VALUE!"},{"$error":"#VALUE!"},{"$error":"#VALUE!"},{"$error":"#VALUE!"},{"$error":"#VALUE!"},{"$error":"#VALUE!"},{"$error":"#VALUE!"},{"$error":"#VALUE!"}]
[null,null,null,null,null,null,null,null,{"$f":"IF(Results!C23=\"\",\"\",Results!B23)","v":""},null,"",null,{"$error":"#VALUE!"},{"$error":"#VALUE!"},{"$error":"#VALUE!"},{"$error":"#VALUE!"},{"$error":"#VALUE!"},{"$error":"#VALUE!"},{"$error":"#VALUE!"},{"$error":"#VALUE!"},{"$error":"#VALUE!"},{"$error":"#VALUE!"}]
[null,null,null,null,null,null,null,null,{"$f":"IF(Results!C24=\"\",\"\",Results!B24)","v":""},null,"",null,{"$error":"#VALUE!"},{"$error":"#VALUE!"},{"$error":"#VALUE!"},{"$error":"#VALUE!"},{"$error":"#VALUE!"},{"$error":"#VALUE!"},{"$error":"#VALUE!"},{"$error":"#VALUE!"},{"$error":"#VALUE!"},{"$error":"#VALUE!"}]
[null,null,null,null,null,null,null,null,{"$f":"IF(Results!C25=\"\",\"\",Results!B25)","v":""},null,"",null,{"$error":"#VALUE!"},{"$error":"#VALUE!"},{"$error":"#VALUE!"},{"$error":"#VALUE!"},{"$error":"#VALUE!"},{"$error":"#VALUE!"},{"$error":"#VALUE!"},{"$error":"#VALUE!"},{"$error":"#VALUE!"},{"$error":"#VALUE!"}]
[null,null,null,null,null,null,null,null,{"$f":"IF(Results!C26=\"\",\"\",Results!B26)","v":""},null,"",null,{"$error":"#VALUE!"},{"$error":"#VALUE!"},{"$error":"#VALUE!"},{"$error":"#VALUE!"},{"$error":"#VALUE!"},{"$error":"#VALUE!"},{"$error":"#VALUE!"},{"$error":"#VALUE!"},{"$error":"#VALUE!"},{"$error":"#VALUE!"}]
[null,null,null,null,null,null,null,null,{"$f":"IF(Results!C27=\"\",\"\",Results!B27)","v":""},null,"",null,{"$error":"#VALUE!"},{"$error":"#VALUE!"},{"$error":"#VALUE!"},{"$error":"#VALUE!"},{"$error":"#VALUE!"},{"$error":"#VALUE!"},{"$error":"#VALUE!"},{"$error":"#VALUE!"},{"$error":"#VALUE!"},{"$error":"#VALUE!"}]
[null,null,null,null,null,null,null,null,{"$f":"IF(Results!C28=\"\",\"\",Results!B28)","v":""},null,"",null,{"$error":"#VALUE!"},{"$error":"#VALUE!"},{"$error":"#VALUE!"},{"$error":"#VALUE!"},{"$error":"#VALUE!"},{"$error":"#VALUE!"},{"$error":"#VALUE!"},{"$error":"#VALUE!"},{"$error":"#VALUE!"},{"$error":"#VALUE!"}]
[null,null,null,null,null,null,null,null,{"$f":"IF(Results!C29=\"\",\"\",Results!B29)","v":""},null,"",null,{"$error":"#VALUE!"},{"$error":"#VALUE!"},{"$error":"#VALUE!"},{"$error":"#VALUE!"},{"$error":"#VALUE!"},{"$error":"#VALUE!"},{"$error":"#VALUE!"},{"$error":"#VALUE!"},{"$error":"#VALUE!"},{"$error":"#VALUE!"}]
[null,null,null,null,null,null,null,null,{"$f":"IF(Results!C30=\"\",\"\",Results!B30)","v":""},null,"",null,{"$error":"#VALUE!"},{"$error":"#VALUE!"},{"$error":"#VALUE!"},{"$error":"#VALUE!"},{"$error":"#VALUE!"},{"$error":"#VALUE!"},{"$error":"#VALUE!"},{"$error":"#VALUE!"},{"$error":"#VALUE!"},{"$error":"#VALUE!"}]
[null,null,null,null,null,null,null,null,{"$f":"IF(Results!C31=\"\",\"\",Results!B31)","v":""},null,"",null,{"$error":"#VALUE!"},{"$error":"#VALUE!"},{"$error":"#VALUE!"},{"$error":"#VALUE!"},{"$error":"#VALUE!"},{"$error":"#VALUE!"},{"$error":"#VALUE!"},{"$error":"#VALUE!"},{"$error":"#VALUE!"},{"$error":"#VALUE!"}]
[null,null,null,null,null,null,null,null,{"$f":"IF(Results!C32=\"\",\"\",Results!B32)","v":""},null,"",null,{"$error":"#VALUE!"},{"$error":"#VALUE!"},{"$error":"#VALUE!"},{"$error":"#VALUE!"},{"$error":"#VALUE!"},{"$error":"#VALUE!"},{"$error":"#VALUE!"},{"$error":"#VALUE!"},{"$error":"#VALUE!"},{"$error":"#VALUE!"}]
[null,null,null,null,null,null,null,null,{"$f":"IF(Results!C33=\"\",\"\",Results!B33)","v":""},null,"",null,{"$error":"#VALUE!"},{"$error":"#VALUE!"},{"$error":"#VALUE!"},{"$error":"#VALUE!"},{"$error":"#VALUE!"},{"$error":"#VALUE!"},{"$error":"#VALUE!"},{"$error":"#VALUE!"},{"$error":"#VALUE!"},{"$error":"#VALUE!"}]
[null,null,null,null,null,null,null,null,{"$f":"IF(Results!C34=\"\",\"\",Results!B34)","v":""},null,{"$f":"IF($C$6=\"\",\"\",IF(I34=\"\",\"\",50-SUM(Q34:V34)))","v":""},null,{"$f":"SEARCH($C$6,J34)","v":{"$error":"#VALUE!"}},{"$f":"SEARCH($D$6,J34)","v":{"$error":"#VALUE!"}},{"$f":"SEARCH($E$6,J34)","v":{"$error":"#VALUE!"}},{"$f":"SEARCH($F$6,J34)","v":{"$error":"#VALUE!"}},{"$f":"IF((N34-M34)<0,$C$8,0)","v":{"$error":"#VALUE!"}},{"$f":"IF((O34-M34)<0,$C$8+$D$8,0)","v":{"$error":"#VALUE!"}},{"$f":"IF((P34-M34)<0,$C$8+$D$8+$E$8,0)","v":{"$error":"#VALUE!"}},{"$f":"IF((O34-N34)<0,$D$8,0)","v":{"$error":"#VALUE!"}},{"$f":"IF((P34-N34)<0,$D$8+$E$8,0)","v":{"$error":"#VALUE!"}},{"$f":"IF((P34-O34)<0,$E$8,0)","v":{"$error":"#VALUE!"}}]
[null,null,null,null,null,null,null,null,{"$f":"IF(Results!C35=\"\",\"\",Results!B35)","v":""},null,"",null,{"$error":"#VALUE!"},{"$error":"#VALUE!"},{"$error":"#VALUE!"},{"$error":"#VALUE!"},{"$error":"#VALUE!"},{"$error":"#VALUE!"},{"$error":"#VALUE!"},{"$error":"#VALUE!"},{"$error":"#VALUE!"},{"$error":"#VALUE!"}]
[null,null,null,null,null,null,null,null,{"$f":"IF(Results!C36=\"\",\"\",Results!B36)","v":""},null,"",null,{"$error":"#VALUE!"},{"$error":"#VALUE!"},{"$error":"#VALUE!"},{"$error":"#VALUE!"},{"$error":"#VALUE!"},{"$error":"#VALUE!"},{"$error":"#VALUE!"},{"$error":"#VALUE!"},{"$error":"#VALUE!"},{"$error":"#VALUE!"}]
[null,null,null,null,null,null,null,null,{"$f":"IF(Results!C37=\"\",\"\",Results!B37)","v":""},null,"",null,{"$error":"#VALUE!"},{"$error":"#VALUE!"},{"$error":"#VALUE!"},{"$error":"#VALUE!"},{"$error":"#VALUE!"},{"$error":"#VALUE!"},{"$error":"#VALUE!"},{"$error":"#VALUE!"},{"$error":"#VALUE!"},{"$error":"#VALUE!"}]
[null,null,null,null,null,null,null,null,{"$f":"IF(Results!C38=\"\",\"\",Results!B38)","v":""},null,"",null,{"$error":"#VALUE!"},{"$error":"#VALUE!"},{"$error":"#VALUE!"},{"$error":"#VALUE!"},{"$error":"#VALUE!"},{"$error":"#VALUE!"},{"$error":"#VALUE!"},{"$error":"#VALUE!"},{"$error":"#VALUE!"},{"$error":"#VALUE!"}]
[null,null,null,null,null,null,null,null,{"$f":"IF(Results!C39=\"\",\"\",Results!B39)","v":""},null,"",null,{"$error":"#VALUE!"},{"$error":"#VALUE!"},{"$error":"#VALUE!"},{"$error":"#VALUE!"},{"$error":"#VALUE!"},{"$error":"#VALUE!"},{"$error":"#VALUE!"},{"$error":"#VALUE!"},{"$error":"#VALUE!"},{"$error":"#VALUE!"}]
[null,null,null,null,null,null,null,null,{"$f":"IF(Results!C40=\"\",\"\",Results!B40)","v":""},null,"",null,{"$error":"#VALUE!"},{"$error":"#VALUE!"},{"$error":"#VALUE!"},{"$error":"#VALUE!"},{"$error":"#VALUE!"},{"$error":"#VALUE!"},{"$error":"#VALUE!"},{"$error":"#VALUE!"},{"$error":"#VALUE!"},{"$error":"#VALUE!"}]
[null,null,null,null,null,null,null,null,{"$f":"IF(Results!C41=\"\",\"\",Results!B41)","v":""},null,"",null,{"$error":"#VALUE!"},{"$error":"#VALUE!"},{"$error":"#VALUE!"},{"$error":"#VALUE!"},{"$error":"#VALUE!"},{"$error":"#VALUE!"},{"$error":"#VALUE!"},{"$error":"#VALUE!"},{"$error":"#VALUE!"},{"$error":"#VALUE!"}]
[null,null,null,null,null,null,null,null,{"$f":"IF(Results!C42=\"\",\"\",Results!B42)","v":""},null,"",null,{"$error":"#VALUE!"},{"$error":"#VALUE!"},{"$error":"#VALUE!"},{"$error":"#VALUE!"},{"$error":"#VALUE!"},{"$error":"#VALUE!"},{"$error":"#VALUE!"},{"$error":"#VALUE!"},{"$error":"#VALUE!"},{"$error":"#VALUE!"}]
[null,null,null,null,null,null,null,null,{"$f":"IF(Results!C43=\"\",\"\",Results!B43)","v":""},null,"",null,{"$error":"#VALUE!"},{"$error":"#VALUE!"},{"$error":"#VALUE!"},{"$error":"#VALUE!"},{"$error":"#VALUE!"},{"$error":"#VALUE!"},{"$error":"#VALUE!"},{"$error":"#VALUE!"},{"$error":"#VALUE!"},{"$error":"#VALUE!"}]
[null,null,null,null,null,null,null,null,{"$f":"IF(Results!C44=\"\",\"\",Results!B44)","v":""},null,"",null,{"$error":"#VALUE!"},{"$error":"#VALUE!"},{"$error":"#VALUE!"},{"$error":"#VALUE!"},{"$error":"#VALUE!"},{"$error":"#VALUE!"},{"$error":"#VALUE!"},{"$error":"#VALUE!"},{"$error":"#VALUE!"},{"$error":"#VALUE!"}]
[null,null,null,null,null,null,null,null,{"$f":"IF(Results!C45=\"\",\"\",Results!B45)","v":""},null,"",null,{"$error":"#VALUE!"},{"$error":"#VALUE!"},{"$error":"#VALUE!"},{"$error":"#VALUE!"},{"$error":"#VALUE!"},{"$error":"#VALUE!"},{"$error":"#VALUE!"},{"$error":"#VALUE!"},{"$error":"#VALUE!"},{"$error":"#VALUE!"}]
[null,null,null,null,null,null,null,null,{"$f":"IF(Results!C46=\"\",\"\",Results!B46)","v":""},null,"",null,{"$error":"#VALUE!"},{"$error":"#VALUE!"},{"$error":"#VALUE!"},{"$error":"#VALUE!"},{"$error":"#VALUE!"},{"$error":"#VALUE!"},{"$error":"#VALUE!"},{"$error":"#VALUE!"},{"$error":"#VALUE!"},{"$error":"#VALUE!"}]
[null,null,null,null,null,null,null,null,{"$f":"IF(Results!C47=\"\",\"\",Results!B47)","v":""},null,"",null,{"$error":"#VALUE!"},{"$error":"#VALUE!"},{"$error":"#VALUE!"},{"$error":"#VALUE!"},{"$error":"#VALUE!"},{"$error":"#VALUE!"},{"$error":"#VALUE!"},{"$error":"#VALUE!"},{"$error":"#VALUE!"},{"$error":"#VALUE!"}]
[null,null,null,null,null,null,null,null,{"$f":"IF(Results!C48=\"\",\"\",Results!B48)","v":""},null,"",null,{"$error":"#VALUE!"},{"$error":"#VALUE!"},{"$error":"#VALUE!"},{"$error":"#VALUE!"},{"$error":"#VALUE!"},{"$error":"#VALUE!"},{"$error":"#VALUE!"},{"$error":"#VALUE!"},{"$error":"#VALUE!"},{"$error":"#VALUE!"}]
[null,null,null,null,null,null,null,null,{"$f":"IF(Results!C49=\"\",\"\",Results!B49)","v":""},null,"",null,{"$error":"#VALUE!"},{"$error":"#VALUE!"},{"$error":"#VALUE!"},{"$error":"#VALUE!"},{"$error":"#VALUE!"},{"$error":"#VALUE!"},{"$error":"#VALUE!"},{"$error":"#VALUE!"},{"$error":"#VALUE!"},{"$error":"#VALUE!"}]
[null,null,null,null,null,null,null,null,{"$f":"IF(Results!C50=\"\",\"\",Results!B50)","v":""},null,"",null,{"$error":"#VALUE!"},{"$error":"#VALUE!"},{"$error":"#VALUE!"},{"$error":"#VALUE!"},{"$error":"#VALUE!"},{"$error":"#VALUE!"},{"$error":"#VALUE!"},{"$error":"#VALUE!"},{"$error":"#VALUE!"},{"$error":"#VALUE!"}]
[null,null,null,null,null,null,null,null,{"$f":"IF(Results!C51=\"\",\"\",Results!B51)","v":""},null,"",null,{"$error":"#VALUE!"},{"$error":"#VALUE!"},{"$error":"#VALUE!"},{"$error":"#VALUE!"},{"$error":"#VALUE!"},{"$error":"#VALUE!"},{"$error":"#VALUE!"},{"$error":"#VALUE!"},{"$error":"#VALUE!"},{"$error":"#VALUE!"}]
[null,null,null,null,null,null,null,null,{"$f":"IF(Results!C52=\"\",\"\",Results!B52)","v":""},null,"",null,{"$error":"#VALUE!"},{"$error":"#VALUE!"},{"$error":"#VALUE!"},{"$error":"#VALUE!"},{"$error":"#VALUE!"},{"$error":"#VALUE!"},{"$error":"#VALUE!"},{"$error":"#VALUE!"},{"$error":"#VALUE!"},{"$error":"#VALUE!"}]
[null,null,null,null,null,null,null,null,{"$f":"IF(Results!C53=\"\",\"\",Results!B53)","v":""},null,"",null,{"$error":"#VALUE!"},{"$error":"#VALUE!"},{"$error":"#VALUE!"},{"$error":"#VALUE!"},{"$error":"#VALUE!"},{"$error":"#VALUE!"},{"$error":"#VALUE!"},{"$error":"#VALUE!"},{"$error":"#VALUE!"},{"$error":"#VALUE!"}]
[null,null,null,null,null,null,null,null,{"$f":"IF(Results!C54=\"\",\"\",Results!B54)","v":""},null,"",null,{"$error":"#VALUE!"},{"$error":"#VALUE!"},{"$error":"#VALUE!"},{"$error":"#VALUE!"},{"$error":"#VALUE!"},{"$error":"#VALUE!"},{"$error":"#VALUE!"},{"$error":"#VALUE!"},{"$error":"#VALUE!"},{"$error":"#VALUE!"}]
[null,null,null,null,null,null,null,null,{"$f":"IF(Results!C55=\"\",\"\",Results!B55)","v":""},null,"",null,{"$error":"#VALUE!"},{"$error":"#VALUE!"},{"$error":"#VALUE!"},{"$error":"#VALUE!"},{"$error":"#VALUE!"},{"$error":"#VALUE!"},{"$error":"#VALUE!"},{"$error":"#VALUE!"},{"$error":"#VALUE!"},{"$error":"#VALUE!"}]
[null,null,null,null,null,null,null,null,{"$f":"IF(Results!C56=\"\",\"\",Results!B56)","v":""},null,"",null,{"$error":"#VALUE!"},{"$error":"#VALUE!"},{"$error":"#VALUE!"},{"$error":"#VALUE!"},{"$error":"#VALUE!"},{"$error":"#VALUE!"},{"$error":"#VALUE!"},{"$error":"#VALUE!"},{"$error":"#VALUE!"},{"$error":"#VALUE!"}]
[null,null,null,null,null,null,null,null,{"$f":"IF(Results!C57=\"\",\"\",Results!B57)","v":""},null,"",null,{"$error":"#VALUE!"},{"$error":"#VALUE!"},{"$error":"#VALUE!"},{"$error":"#VALUE!"},{"$error":"#VALUE!"},{"$error":"#VALUE!"},{"$error":"#VALUE!"},{"$error":"#VALUE!"},{"$error":"#VALUE!"},{"$error":"#VALUE!"}]
[null,null,null,null,null,null,null,null,{"$f":"IF(Results!C58=\"\",\"\",Results!B58)","v":""},null,"",null,{"$error":"#VALUE!"},{"$error":"#VALUE!"},{"$error":"#VALUE!"},{"$error":"#VALUE!"},{"$error":"#VALUE!"},{"$error":"#VALUE!"},{"$error":"#VALUE!"},{"$error":"#VALUE!"},{"$error":"#VALUE!"},{"$error":"#VALUE!"}]
[null,null,null,null,null,null,null,null,{"$f":"IF(Results!C59=\"\",\"\",Results!B59)","v":""},null,"",null,{"$error":"#VALUE!"},{"$error":"#VALUE!"},{"$error":"#VALUE!"},{"$error":"#VALUE!"},{"$error":"#VALUE!"},{"$error":"#VALUE!"},{"$error":"#VALUE!"},{"$error":"#VALUE!"},{"$error":"#VALUE!"},{"$error":"#VALUE!"}]
[null,null,null,null,null,null,null,null,{"$f":"IF(Results!C60=\"\",\"\",Results!B60)","v":""},null,"",null,{"$error":"#VALUE!"},{"$error":"#VALUE!"},{"$error":"#VALUE!"},{"$error":"#VALUE!"},{"$error":"#VALUE!"},{"$error":"#VALUE!"},{"$error":"#VALUE!"},{"$error":"#VALUE!"},{"$error":"#VALUE!"},{"$error":"#VALUE!"}]
[null,null,null,null,null,null,null,null,{"$f":"IF(Results!C61=\"\",\"\",Results!B61)","v":""},null,"",null,{"$error":"#VALUE!"},{"$error":"#VALUE!"},{"$error":"#VALUE!"},{"$error":"#VALUE!"},{"$error":"#VALUE!"},{"$error":"#VALUE!"},{"$error":"#VALUE!"},{"$error":"#VALUE!"},{"$error":"#VALUE!"},{"$error":"#VALUE!"}]
[null,null,null,null,null,null,null,null,{"$f":"IF(Results!C62=\"\",\"\",Results!B62)","v":""},null,"",null,{"$error":"#VALUE!"},{"$error":"#VALUE!"},{"$error":"#VALUE!"},{"$error":"#VALUE!"},{"$error":"#VALUE!"},{"$error":"#VALUE!"},{"$error":"#VALUE!"},{"$error":"#VALUE!"},{"$error":"#VALUE!"},{"$error":"#VALUE!"}]
[null,null,null,null,null,null,null,null,{"$f":"IF(Results!C63=\"\",\"\",Results!B63)","v":""},null,"",null,{"$error":"#VALUE!"},{"$error":"#VALUE!"},{"$error":"#VALUE!"},{"$error":"#VALUE!"},{"$error":"#VALUE!"},{"$error":"#VALUE!"},{"$error":"#VALUE!"},{"$error":"#VALUE!"},{"$error":"#VALUE!"},{"$error":"#VALUE!"}]
[null,null,null,null,null,null,null,null,{"$f":"IF(Results!C64=\"\",\"\",Results!B64)","v":""},null,"",null,{"$error":"#VALUE!"},{"$error":"#VALUE!"},{"$error":"#VALUE!"},{"$error":"#VALUE!"},{"$error":"#VALUE!"},{"$error":"#VALUE!"},{"$error":"#VALUE!"},{"$error":"#VALUE!"},{"$error":"#VALUE!"},{"$error":"#VALUE!"}]
[null,null,null,null,null,null,null,null,{"$f":"IF(Results!C65=\"\",\"\",Results!B65)","v":""},null,"",null,{"$error":"#VALUE!"},{"$error":"#VALUE!"},{"$error":"#VALUE!"},{"$error":"#VALUE!"},{"$error":"#VALUE!"},{"$error":"#VALUE!"},{"$error":"#VALUE!"},{"$error":"#VALUE!"},{"$error":"#VALUE!"},{"$error":"#VALUE!"}]
[null,null,null,null,null,null,null,null,{"$f":"IF(Results!C66=\"\",\"\",Results!B66)","v":""},null,"",null,{"$error":"#VALUE!"},{"$error":"#VALUE!"},{"$error":"#VALUE!"},{"$error":"#VALUE!"},{"$error":"#VALUE!"},{"$error":"#VALUE!"},{"$error":"#VALUE!"},{"$error":"#VALUE!"},{"$error":"#VALUE!"},{"$error":"#VALUE!"}]
[null,null,null,null,null,null,null,null,{"$f":"IF(Results!C67=\"\",\"\",Results!B67)","v":""},null,"",null,{"$error":"#VALUE!"},{"$error":"#VALUE!"},{"$error":"#VALUE!"},{"$error":"#VALUE!"},{"$error":"#VALUE!"},{"$error":"#VALUE!"},{"$error":"#VALUE!"},{"$error":"#VALUE!"},{"$error":"#VALUE!"},{"$error":"#VALUE!"}]
[null,null,null,null,null,null,null,null,{"$f":"IF(Results!C68=\"\",\"\",Results!B68)","v":""},null,"",null,{"$error":"#VALUE!"},{"$error":"#VALUE!"},{"$error":"#VALUE!"},{"$error":"#VALUE!"},{"$error":"#VALUE!"},{"$error":"#VALUE!"},{"$error":"#VALUE!"},{"$error":"#VALUE!"},{"$error":"#VALUE!"},{"$error":"#VALUE!"}]
[null,null,null,null,null,null,null,null,{"$f":"IF(Results!C69=\"\",\"\",Results!B69)","v":""},null,"",null,{"$error":"#VALUE!"},{"$error":"#VALUE!"},{"$error":"#VALUE!"},{"$error":"#VALUE!"},{"$error":"#VALUE!"},{"$error":"#VALUE!"},{"$error":"#VALUE!"},{"$error":"#VALUE!"},{"$error":"#VALUE!"},{"$error":"#VALUE!"}]
[null,null,null,null,null,null,null,null,{"$f":"IF(Results!C70=\"\",\"\",Results!B70)","v":""},null,"",null,{"$error":"#VALUE!"},{"$error":"#VALUE!"},{"$error":"#VALUE!"},{"$error":"#VALUE!"},{"$error":"#VALUE!"},{"$error":"#VALUE!"},{"$error":"#VALUE!"},{"$error":"#VALUE!"},{"$error":"#VALUE!"},{"$error":"#VALUE!"}]
[null,null,null,null,null,null,null,null,{"$f":"IF(Results!C71=\"\",\"\",Results!B71)","v":""},null,"",null,{"$error":"#VALUE!"},{"$error":"#VALUE!"},{"$error":"#VALUE!"},{"$error":"#VALUE!"},{"$error":"#VALUE!"},{"$error":"#VALUE!"},{"$error":"#VALUE!"},{"$error":"#VALUE!"},{"$error":"#VALUE!"},{"$error":"#VALUE!"}]
[null,null,null,null,null,null,null,null,{"$f":"IF(Results!C72=\"\",\"\",Results!B72)","v":""},null,"",null,{"$error":"#VALUE!"},{"$error":"#VALUE!"},{"$error":"#VALUE!"},{"$error":"#VALUE!"},{"$error":"#VALUE!"},{"$error":"#VALUE!"},{"$error":"#VALUE!"},{"$error":"#VALUE!"},{"$error":"#VALUE!"},{"$error":"#VALUE!"}]
[null,null,null,null,null,null,null,null,{"$f":"IF(Results!C73=\"\",\"\",Results!B73)","v":""},null,"",null,{"$error":"#VALUE!"},{"$error":"#VALUE!"},{"$error":"#VALUE!"},{"$error":"#VALUE!"},{"$error":"#VALUE!"},{"$error":"#VALUE!"},{"$error":"#VALUE!"},{"$error":"#VALUE!"},{"$error":"#VALUE!"},{"$error":"#VALUE!"}]
[null,null,null,null,null,null,null,null,{"$f":"IF(Results!C74=\"\",\"\",Results!B74)","v":""},null,"",null,{"$error":"#VALUE!"},{"$error":"#VALUE!"},{"$error":"#VALUE!"},{"$error":"#VALUE!"},{"$error":"#VALUE!"},{"$error":"#VALUE!"},{"$error":"#VALUE!"},{"$error":"#VALUE!"},{"$error":"#VALUE!"},{"$error":"#VALUE!"}]
[null,null,null,null,null,null,null,null,{"$f":"IF(Results!C75=\"\",\"\",Results!B75)","v":""},null,"",null,{"$error":"#VALUE!"},{"$error":"#VALUE!"},{"$error":"#VALUE!"},{"$error":"#VALUE!"},{"$error":"#VALUE!"},{"$error":"#VALUE!"},{"$error":"#VALUE!"},{"$error":"#VALUE!"},{"$error":"#VALUE!"},{"$error":"#VALUE!"}]
[null,null,null,null,null,null,null,null,{"$f":"IF(Results!C76=\"\",\"\",Results!B76)","v":""},null,"",null,{"$error":"#VALUE!"},{"$error":"#VALUE!"},{"$error":"#VALUE!"},{"$error":"#VALUE!"},{"$error":"#VALUE!"},{"$error":"#VALUE!"},{"$error":"#VALUE!"},{"$error":"#VALUE!"},{"$error":"#VALUE!"},{"$error":"#VALUE!"}]
[null,null,null,null,null,null,null,null,{"$f":"IF(Results!C77=\"\",\"\",Results!B77)","v":""},null,"",null,{"$error":"#VALUE!"},{"$error":"#VALUE!"},{"$error":"#VALUE!"},{"$error":"#VALUE!"},{"$error":"#VALUE!"},{"$error":"#VALUE!"},{"$error":"#VALUE!"},{"$error":"#VALUE!"},{"$error":"#VALUE!"},{"$error":"#VALUE!"}]
[null,null,null,null,null,null,null,null,{"$f":"IF(Results!C78=\"\",\"\",Results!B78)","v":""},null,"",null,{"$error":"#VALUE!"},{"$error":"#VALUE!"},{"$error":"#VALUE!"},{"$error":"#VALUE!"},{"$error":"#VALUE!"},{"$error":"#VALUE!"},{"$error":"#VALUE!"},{"$error":"#VALUE!"},{"$error":"#VALUE!"},{"$error":"#VALUE!"}]
[null,null,null,null,null,null,null,null,{"$f":"IF(Results!C79=\"\",\"\",Results!B79)","v":""},null,"",null,{"$error":"#VALUE!"},{"$error":"#VALUE!"},{"$error":"#VALUE!"},{"$error":"#VALUE!"},{"$error":"#VALUE!"},{"$error":"#VALUE!"},{"$error":"#VALUE!"},{"$error":"#VALUE!"},{"$error":"#VALUE!"},{"$error":"#VALUE!"}]
[null,null,null,null,null,null,null,null,{"$f":"IF(Results!C80=\"\",\"\",Results!B80)","v":""},null,"",null,{"$error":"#VALUE!"},{"$error":"#VALUE!"},{"$error":"#VALUE!"},{"$error":"#VALUE!"},{"$error":"#VALUE!"},{"$error":"#VALUE!"},{"$error":"#VALUE!"},{"$error":"#VALUE!"},{"$error":"#VALUE!"},{"$error":"#VALUE!"}]
[null,null,null,null,null,null,null,null,{"$f":"IF(Results!C81=\"\",\"\",Results!B81)","v":""},null,"",null,{"$error":"#VALUE!"},{"$error":"#VALUE!"},{"$error":"#VALUE!"},{"$error":"#VALUE!"},{"$error":"#VALUE!"},{"$error":"#VALUE!"},{"$error":"#VALUE!"},{"$error":"#VALUE!"},{"$error":"#VALUE!"},{"$error":"#VALUE!"}]
[null,null,null,null,null,null,null,null,{"$f":"IF(Results!C82=\"\",\"\",Results!B82)","v":""},null,"",null,{"$error":"#VALUE!"},{"$error":"#VALUE!"},{"$error":"#VALUE!"},{"$error":"#VALUE!"},{"$error":"#VALUE!"},{"$error":"#VALUE!"},{"$error":"#VALUE!"},{"$error":"#VALUE!"},{"$error":"#VALUE!"},{"$error":"#VALUE!"}]
[null,null,null,null,null,null,null,null,{"$f":"IF(Results!C83=\"\",\"\",Results!B83)","v":""},null,"",null,{"$error":"#VALUE!"},{"$error":"#VALUE!"},{"$error":"#VALUE!"},{"$error":"#VALUE!"},{"$error":"#VALUE!"},{"$error":"#VALUE!"},{"$error":"#VALUE!"},{"$error":"#VALUE!"},{"$error":"#VALUE!"},{"$error":"#VALUE!"}]
[null,null,null,null,null,null,null,null,{"$f":"IF(Results!C84=\"\",\"\",Results!B84)","v":""},null,"",null,{"$error":"#VALUE!"},{"$error":"#VALUE!"},{"$error":"#VALUE!"},{"$error":"#VALUE!"},{"$error":"#VALUE!"},{"$error":"#VALUE!"},{"$error":"#VALUE!"},{"$error":"#VALUE!"},{"$error":"#VALUE!"},{"$error":"#VALUE!"}]
[null,null,null,null,null,null,null,null,{"$f":"IF(Results!C85=\"\",\"\",Results!B85)","v":""},null,"",null,{"$error":"#VALUE!"},{"$error":"#VALUE!"},{"$error":"#VALUE!"},{"$error":"#VALUE!"},{"$error":"#VALUE!"},{"$error":"#VALUE!"},{"$error":"#VALUE!"},{"$error":"#VALUE!"},{"$error":"#VALUE!"},{"$error":"#VALUE!"}]
[null,null,null,null,null,null,null,null,{"$f":"IF(Results!C86=\"\",\"\",Results!B86)","v":""},null,"",null,{"$error":"#VALUE!"},{"$error":"#VALUE!"},{"$error":"#VALUE!"},{"$error":"#VALUE!"},{"$error":"#VALUE!"},{"$error":"#VALUE!"},{"$error":"#VALUE!"},{"$error":"#VALUE!"},{"$error":"#VALUE!"},{"$error":"#VALUE!"}]
[null,null,null,null,null,null,null,null,{"$f":"IF(Results!C87=\"\",\"\",Results!B87)","v":""},null,"",null,{"$error":"#VALUE!"},{"$error":"#VALUE!"},{"$error":"#VALUE!"},{"$error":"#VALUE!"},{"$error":"#VALUE!"},{"$error":"#VALUE!"},{"$error":"#VALUE!"},{"$error":"#VALUE!"},{"$error":"#VALUE!"},{"$error":"#VALUE!"}]
[null,null,null,null,null,null,null,null,{"$f":"IF(Results!C88=\"\",\"\",Results!B88)","v":""},null,"",null,{"$error":"#VALUE!"},{"$error":"#VALUE!"},{"$error":"#VALUE!"},{"$error":"#VALUE!"},{"$error":"#VALUE!"},{"$error":"#VALUE!"},{"$error":"#VALUE!"},{"$error":"#VALUE!"},{"$error":"#VALUE!"},{"$error":"#VALUE!"}]
[null,null,null,null,null,null,null,null,{"$f":"IF(Results!C89=\"\",\"\",Results!B89)","v":""},null,"",null,{"$error":"#VALUE!"},{"$error":"#VALUE!"},{"$error":"#VALUE!"},{"$error":"#VALUE!"},{"$error":"#VALUE!"},{"$error":"#VALUE!"},{"$error":"#VALUE!"},{"$error":"#VALUE!"},{"$error":"#VALUE!"},{"$error":"#VALUE!"}]
[null,null,null,null,null,null,null,null,{"$f":"IF(Results!C90=\"\",\"\",Results!B90)","v":""},null,"",null,{"$error":"#VALUE!"},{"$error":"#VALUE!"},{"$error":"#VALUE!"},{"$error":"#VALUE!"},{"$error":"#VALUE!"},{"$error":"#VALUE!"},{"$error":"#VALUE!"},{"$error":"#VALUE!"},{"$error":"#VALUE!"},{"$error":"#VALUE!"}]
[null,null,null,null,null,null,null,null,{"$f":"IF(Results!C91=\"\",\"\",Results!B91)","v":""},null,"",null,{"$error":"#VALUE!"},{"$error":"#VALUE!"},{"$error":"#VALUE!"},{"$error":"#VALUE!"},{"$error":"#VALUE!"},{"$error":"#VALUE!"},{"$error":"#VALUE!"},{"$error":"#VALUE!"},{"$error":"#VALUE!"},{"$error":"#VALUE!"}]
[null,null,null,null,null,null,null,null,{"$f":"IF(Results!C92=\"\",\"\",Results!B92)","v":""},null,"",null,{"$error":"#VALUE!"},{"$error":"#VALUE!"},{"$error":"#VALUE!"},{"$error":"#VALUE!"},{"$error":"#VALUE!"},{"$error":"#VALUE!"},{"$error":"#VALUE!"},{"$error":"#VALUE!"},{"$error":"#VALUE!"},{"$error":"#VALUE!"}]
[null,null,null,null,null,null,null,null,{"$f":"IF(Results!C93=\"\",\"\",Results!B93)","v":""},null,"",null,{"$error":"#VALUE!"},{"$error":"#VALUE!"},{"$error":"#VALUE!"},{"$error":"#VALUE!"},{"$error":"#VALUE!"},{"$error":"#VALUE!"},{"$error":"#VALUE!"},{"$error":"#VALUE!"},{"$error":"#VALUE!"},{"$error":"#VALUE!"}]
[null,null,null,null,null,null,null,null,{"$f":"IF(Results!C94=\"\",\"\",Results!B94)","v":""},null,"",null,{"$error":"#VALUE!"},{"$error":"#VALUE!"},{"$error":"#VALUE!"},{"$error":"#VALUE!"},{"$error":"#VALUE!"},{"$error":"#VALUE!"},{"$error":"#VALUE!"},{"$error":"#VALUE!"},{"$error":"#VALUE!"},{"$error":"#VALUE!"}]
[null,null,null,null,null,null,null,null,{"$f":"IF(Results!C95=\"\",\"\",Results!B95)","v":""},null,"",null,{"$error":"#VALUE!"},{"$error":"#VALUE!"},{"$error":"#VALUE!"},{"$error":"#VALUE!"},{"$error":"#VALUE!"},{"$error":"#VALUE!"},{"$error":"#VALUE!"},{"$error":"#VALUE!"},{"$error":"#VALUE!"},{"$error":"#VALUE!"}]
[null,null,null,null,null,null,null,null,{"$f":"IF(Results!C96=\"\",\"\",Results!B96)","v":""},null,"",null,{"$error":"#VALUE!"},{"$error":"#VALUE!"},{"$error":"#VALUE!"},{"$error":"#VALUE!"},{"$error":"#VALUE!"},{"$error":"#VALUE!"},{"$error":"#VALUE!"},{"$error":"#VALUE!"},{"$error":"#VALUE!"},{"$error":"#VALUE!"}]
[null,null,null,null,null,null,null,null,{"$f":"IF(Results!C97=\"\",\"\",Results!B97)","v":""},null,"",null,{"$error":"#VALUE!"},{"$error":"#VALUE!"},{"$error":"#VALUE!"},{"$error":"#VALUE!"},{"$error":"#VALUE!"},{"$error":"#VALUE!"},{"$error":"#VALUE!"},{"$error":"#VALUE!"},{"$error":"#VALUE!"},{"$error":"#VALUE!"}]
[null,null,null,null,null,null,null,null,{"$f":"IF(Results!C98=\"\",\"\",Results!B98)","v":""},null,{"$f":"IF($C$6=\"\",\"\",IF(I98=\"\",\"\",50-SUM(Q98:V98)))","v":""},null,{"$f":"SEARCH($C$6,J98)","v":{"$error":"#VALUE!"}},{"$f":"SEARCH($D$6,J98)","v":{"$error":"#VALUE!"}},{"$f":"SEARCH($E$6,J98)","v":{"$error":"#VALUE!"}},{"$f":"SEARCH($F$6,J98)","v":{"$error":"#VALUE!"}},{"$f":"IF((N98-M98)<0,$C$8,0)","v":{"$error":"#VALUE!"}},{"$f":"IF((O98-M98)<0,$C$8+$D$8,0)","v":{"$error":"#VALUE!"}},{"$f":"IF((P98-M98)<0,$C$8+$D$8+$E$8,0)","v":{"$error":"#VALUE!"}},{"$f":"IF((O98-N98)<0,$D$8,0)","v":{"$error":"#VALUE!"}},{"$f":"IF((P98-N98)<0,$D$8+$E$8,0)","v":{"$error":"#VALUE!"}},{"$f":"IF((P98-O98)<0,$E$8,0)","v":{"$error":"#VALUE!"}}]
[null,null,null,null,null,null,null,null,{"$f":"IF(Results!C99=\"\",\"\",Results!B99)","v":""},null,"",null,{"$error":"#VALUE!"},{"$error":"#VALUE!"},{"$error":"#VALUE!"},{"$error":"#VALUE!"},{"$error":"#VALUE!"},{"$error":"#VALUE!"},{"$error":"#VALUE!"},{"$error":"#VALUE!"},{"$error":"#VALUE!"},{"$error":"#VALUE!"}]
[null,null,null,null,null,null,null,null,{"$f":"IF(Results!C100=\"\",\"\",Results!B100)","v":""},null,"",null,{"$error":"#VALUE!"},{"$error":"#VALUE!"},{"$error":"#VALUE!"},{"$error":"#VALUE!"},{"$error":"#VALUE!"},{"$error":"#VALUE!"},{"$error":"#VALUE!"},{"$error":"#VALUE!"},{"$error":"#VALUE!"},{"$error":"#VALUE!"}]
[null,null,null,null,null,null,null,null,{"$f":"IF(Results!C101=\"\",\"\",Results!B101)","v":""},null,"",null,{"$error":"#VALUE!"},{"$error":"#VALUE!"},{"$error":"#VALUE!"},{"$error":"#VALUE!"},{"$error":"#VALUE!"},{"$error":"#VALUE!"},{"$error":"#VALUE!"},{"$error":"#VALUE!"},{"$error":"#VALUE!"},{"$error":"#VALUE!"}]
[null,null,null,null,null,null,null,null,{"$f":"IF(Results!C102=\"\",\"\",Results!B102)","v":""},null,"",null,{"$error":"#VALUE!"},{"$error":"#VALUE!"},{"$error":"#VALUE!"},{"$error":"#VALUE!"},{"$error":"#VALUE!"},{"$error":"#VALUE!"},{"$error":"#VALUE!"},{"$error":"#VALUE!"},{"$error":"#VALUE!"},{"$error":"#VALUE!"}]
[null,null,null,null,null,null,null,null,{"$f":"IF(Results!C103=\"\",\"\",Results!B103)","v":""},null,"",null,{"$error":"#VALUE!"},{"$error":"#VALUE!"},{"$error":"#VALUE!"},{"$error":"#VALUE!"},{"$error":"#VALUE!"},{"$error":"#VALUE!"},{"$error":"#VALUE!"},{"$error":"#VALUE!"},{"$error":"#VALUE!"},{"$error":"#VALUE!"}]
[null,null,null,null,null,null,null,null,{"$f":"IF(Results!C104=\"\",\"\",Results!B104)","v":""},null,{"$f":"IF($C$6=\"\",\"\",IF(I104=\"\",\"\",50-SUM(Q104:V104)))","v":""},null,{"$f":"SEARCH($C$6,J104)","v":{"$error":"#VALUE!"}},{"$f":"SEARCH($D$6,J104)","v":{"$error":"#VALUE!"}},{"$f":"SEARCH($E$6,J104)","v":{"$error":"#VALUE!"}},{"$f":"SEARCH($F$6,J104)","v":{"$error":"#VALUE!"}},{"$f":"IF((N104-M104)<0,$C$8,0)","v":{"$error":"#VALUE!"}},{"$f":"IF((O104-M104)<0,$C$8+$D$8,0)","v":{"$error":"#VALUE!"}},{"$f":"IF((P104-M104)<0,$C$8+$D$8+$E$8,0)","v":{"$error":"#VALUE!"}},{"$f":"IF((O104-N104)<0,$D$8,0)","v":{"$error":"#VALUE!"}},{"$f":"IF((P104-N104)<0,$D$8+$E$8,0)","v":{"$error":"#VALUE!"}},{"$f":"IF((P104-O104)<0,$E$8,0)","v":{"$error":"#VALUE!"}}]
[null,null,null,null,null,null,null,null,{"$f":"IF(Results!C105=\"\",\"\",Results!B105)","v":""},null,"",null,{"$error":"#VALUE!"},{"$error":"#VALUE!"},{"$error":"#VALUE!"},{"$error":"#VALUE!"},{"$error":"#VALUE!"},{"$error":"#VALUE!"},{"$error":"#VALUE!"},{"$error":"#VALUE!"},{"$error":"#VALUE!"},{"$error":"#VALUE!"}]
[null,null,null,null,null,null,null,null,{"$f":"IF(Results!C106=\"\",\"\",Results!B106)","v":""},null,"",null,{"$error":"#VALUE!"},{"$error":"#VALUE!"},{"$error":"#VALUE!"},{"$error":"#VALUE!"},{"$error":"#VALUE!"},{"$error":"#VALUE!"},{"$error":"#VALUE!"},{"$error":"#VALUE!"},{"$error":"#VALUE!"},{"$error":"#VALUE!"}]
[null,null,null,null,null,null,null,null,{"$f":"IF(Results!C107=\"\",\"\",Results!B107)","v":""},null,"",null,{"$error":"#VALUE!"},{"$error":"#VALUE!"},{"$error":"#VALUE!"},{"$error":"#VALUE!"},{"$error":"#VALUE!"},{"$error":"#VALUE!"},{"$error":"#VALUE!"},{"$error":"#VALUE!"},{"$error":"#VALUE!"},{"$error":"#VALUE!"}]
[null,null,null,null,null,null,null,null,{"$f":"IF(Results!C108=\"\",\"\",Results!B108)","v":""},null,"",null,{"$error":"#VALUE!"},{"$error":"#VALUE!"},{"$error":"#VALUE!"},{"$error":"#VALUE!"},{"$error":"#VALUE!"},{"$error":"#VALUE!"},{"$error":"#VALUE!"},{"$error":"#VALUE!"},{"$error":"#VALUE!"},{"$error":"#VALUE!"}]
[null,null,null,null,null,null,null,null,{"$f":"IF(Results!C109=\"\",\"\",Results!B109)","v":""},null,"",null,{"$error":"#VALUE!"},{"$error":"#VALUE!"},{"$error":"#VALUE!"},{"$error":"#VALUE!"},{"$error":"#VALUE!"},{"$error":"#VALUE!"},{"$error":"#VALUE!"},{"$error":"#VALUE!"},{"$error":"#VALUE!"},{"$error":"#VALUE!"}]
[null,null,null,null,null,null,null,null,{"$f":"IF(Results!C110=\"\",\"\",Results!B110)","v":""},null,"",null,{"$error":"#VALUE!"},{"$error":"#VALUE!"},{"$error":"#VALUE!"},{"$error":"#VALUE!"},{"$error":"#VALUE!"},{"$error":"#VALUE!"},{"$error":"#VALUE!"},{"$error":"#VALUE!"},{"$error":"#VALUE!"},{"$error":"#VALUE!"}]
[null,null,null,null,null,null,null,null,{"$f":"IF(Results!C111=\"\",\"\",Results!B111)","v":""},null,"",null,{"$error":"#VALUE!"},{"$error":"#VALUE!"},{"$error":"#VALUE!"},{"$error":"#VALUE!"},{"$error":"#VALUE!"},{"$error":"#VALUE!"},{"$error":"#VALUE!"},{"$error":"#VALUE!"},{"$error":"#VALUE!"},{"$error":"#VALUE!"}]
[null,null,null,null,null,null,null,null,{"$f":"IF(Results!C112=\"\",\"\",Results!B112)","v":""},null,"",null,{"$error":"#VALUE!"},{"$error":"#VALUE!"},{"$error":"#VALUE!"},{"$error":"#VALUE!"},{"$error":"#VALUE!"},{"$error":"#VALUE!"},{"$error":"#VALUE!"},{"$error":"#VALUE!"},{"$error":"#VALUE!"},{"$error":"#VALUE!"}]
[null,null,null,null,null,null,null,null,{"$f":"IF(Results!C113=\"\",\"\",Results!B113)","v":""},null,"",null,{"$error":"#VALUE!"},{"$error":"#VALUE!"},{"$error":"#VALUE!"},{"$error":"#VALUE!"},{"$error":"#VALUE!"},{"$error":"#VALUE!"},{"$error":"#VALUE!"},{"$error":"#VALUE!"},{"$error":"#VALUE!"},{"$error":"#VALUE!"}]
[null,null,null,null,null,null,null,null,{"$f":"IF(Results!C114=\"\",\"\",Results!B114)","v":""},null,"",null,{"$error":"#VALUE!"},{"$error":"#VALUE!"},{"$error":"#VALUE!"},{"$error":"#VALUE!"},{"$error":"#VALUE!"},{"$error":"#VALUE!"},{"$error":"#VALUE!"},{"$error":"#VALUE!"},{"$error":"#VALUE!"},{"$error":"#VALUE!"}]
[null,null,null,null,null,null,null,null,{"$f":"IF(Results!C115=\"\",\"\",Results!B115)","v":""},null,"",null,{"$error":"#VALUE!"},{"$error":"#VALUE!"},{"$error":"#VALUE!"},{"$error":"#VALUE!"},{"$error":"#VALUE!"},{"$error":"#VALUE!"},{"$error":"#VALUE!"},{"$error":"#VALUE!"},{"$error":"#VALUE!"},{"$error":"#VALUE!"}]
[null,null,null,null,null,null,null,null,{"$f":"IF(Results!C116=\"\",\"\",Results!B116)","v":""},null,"",null,{"$error":"#VALUE!"},{"$error":"#VALUE!"},{"$error":"#VALUE!"},{"$error":"#VALUE!"},{"$error":"#VALUE!"},{"$error":"#VALUE!"},{"$error":"#VALUE!"},{"$error":"#VALUE!"},{"$error":"#VALUE!"},{"$error":"#VALUE!"}]
[null,null,null,null,null,null,null,null,{"$f":"IF(Results!C117=\"\",\"\",Results!B117)","v":""},null,"",null,{"$error":"#VALUE!"},{"$error":"#VALUE!"},{"$error":"#VALUE!"},{"$error":"#VALUE!"},{"$error":"#VALUE!"},{"$error":"#VALUE!"},{"$error":"#VALUE!"},{"$error":"#VALUE!"},{"$error":"#VALUE!"},{"$error":"#VALUE!"}]
[null,null,null,null,null,null,null,null,{"$f":"IF(Results!C118=\"\",\"\",Results!B118)","v":""},null,"",null,{"$error":"#VALUE!"},{"$error":"#VALUE!"},{"$error":"#VALUE!"},{"$error":"#VALUE!"},{"$error":"#VALUE!"},{"$error":"#VALUE!"},{"$error":"#VALUE!"},{"$error":"#VALUE!"},{"$error":"#VALUE!"},{"$error":"#VALUE!"}]
[null,null,null,null,null,null,null,null,{"$f":"IF(Results!C119=\"\",\"\",Results!B119)","v":""},null,"",null,{"$error":"#VALUE!"},{"$error":"#VALUE!"},{"$error":"#VALUE!"},{"$error":"#VALUE!"},{"$error":"#VALUE!"},{"$error":"#VALUE!"},{"$error":"#VALUE!"},{"$error":"#VALUE!"},{"$error":"#VALUE!"},{"$error":"#VALUE!"}]
[null,null,null,null,null,null,null,null,{"$f":"IF(Results!C120=\"\",\"\",Results!B120)","v":""},null,"",null,{"$error":"#VALUE!"},{"$error":"#VALUE!"},{"$error":"#VALUE!"},{"$error":"#VALUE!"},{"$error":"#VALUE!"},{"$error":"#VALUE!"},{"$error":"#VALUE!"},{"$error":"#VALUE!"},{"$error":"#VALUE!"},{"$error":"#VALUE!"}]
[null,null,null,null,null,null,null,null,{"$f":"IF(Results!C121=\"\",\"\",Results!B121)","v":""},null,"",null,{"$error":"#VALUE!"},{"$error":"#VALUE!"},{"$error":"#VALUE!"},{"$error":"#VALUE!"},{"$error":"#VALUE!"},{"$error":"#VALUE!"},{"$error":"#VALUE!"},{"$error":"#VALUE!"},{"$error":"#VALUE!"},{"$error":"#VALUE!"}]
[null,null,null,null,null,null,null,null,{"$f":"IF(Results!C122=\"\",\"\",Results!B122)","v":""},null,"",null,{"$error":"#VALUE!"},{"$error":"#VALUE!"},{"$error":"#VALUE!"},{"$error":"#VALUE!"},{"$error":"#VALUE!"},{"$error":"#VALUE!"},{"$error":"#VALUE!"},{"$error":"#VALUE!"},{"$error":"#VALUE!"},{"$error":"#VALUE!"}]
[null,null,null,null,null,null,null,null,{"$f":"IF(Results!C123=\"\",\"\",Results!B123)","v":""},null,"",null,{"$error":"#VALUE!"},{"$error":"#VALUE!"},{"$error":"#VALUE!"},{"$error":"#VALUE!"},{"$error":"#VALUE!"},{"$error":"#VALUE!"},{"$error":"#VALUE!"},{"$error":"#VALUE!"},{"$error":"#VALUE!"},{"$error":"#VALUE!"}]
[null,null,null,null,null,null,null,null,{"$f":"IF(Results!C124=\"\",\"\",Results!B124)","v":""},null,"",null,{"$error":"#VALUE!"},{"$error":"#VALUE!"},{"$error":"#VALUE!"},{"$error":"#VALUE!"},{"$error":"#VALUE!"},{"$error":"#VALUE!"},{"$error":"#VALUE!"},{"$error":"#VALUE!"},{"$error":"#VALUE!"},{"$error":"#VALUE!"}]
[null,null,null,null,null,null,null,null,{"$f":"IF(Results!C125=\"\",\"\",Results!B125)","v":""},null,"",null,{"$error":"#VALUE!"},{"$error":"#VALUE!"},{"$error":"#VALUE!"},{"$error":"#VALUE!"},{"$error":"#VALUE!"},{"$error":"#VALUE!"},{"$error":"#VALUE!"},{"$error":"#VALUE!"},{"$error":"#VALUE!"},{"$error":"#VALUE!"}]
[null,null,null,null,null,null,null,null,{"$f":"IF(Results!C126=\"\",\"\",Results!B126)","v":""},null,"",null,{"$error":"#VALUE!"},{"$error":"#VALUE!"},{"$error":"#VALUE!"},{"$error":"#VALUE!"},{"$error":"#VALUE!"},{"$error":"#VALUE!"},{"$error":"#VALUE!"},{"$error":"#VALUE!"},{"$error":"#VALUE!"},{"$error":"#VALUE!"}]
[null,null,null,null,null,null,null,null,{"$f":"IF(Results!C127=\"\",\"\",Results!B127)","v":""},null,"",null,{"$error":"#VALUE!"},{"$error":"#VALUE!"},{"$error":"#VALUE!"},{"$error":"#VALUE!"},{"$error":"#VALUE!"},{"$error":"#VALUE!"},{"$error":"#VALUE!"},{"$error":"#VALUE!"},{"$error":"#VALUE!"},{"$error":"#VALUE!"}]
[null,null,null,null,null,null,null,null,{"$f":"IF(Results!C128=\"\",\"\",Results!B128)","v":""},null,"",null,{"$error":"#VALUE!"},{"$error":"#VALUE!"},{"$error":"#VALUE!"},{"$error":"#VALUE!"},{"$error":"#VALUE!"},{"$error":"#VALUE!"},{"$error":"#VALUE!"},{"$error":"#VALUE!"},{"$error":"#VALUE!"},{"$error":"#VALUE!"}]
[null,null,null,null,null,null,null,null,{"$f":"IF(Results!C129=\"\",\"\",Results!B129)","v":""},null,"",null,{"$error":"#VALUE!"},{"$error":"#VALUE!"},{"$error":"#VALUE!"},{"$error":"#VALUE!"},{"$error":"#VALUE!"},{"$error":"#VALUE!"},{"$error":"#VALUE!"},{"$error":"#VALUE!"},{"$error":"#VALUE!"},{"$error":"#VALUE!"}]
[null,null,null,null,null,null,null,null,{"$f":"IF(Results!C130=\"\",\"\",Results!B130)","v":""},null,"",null,{"$error":"#VALUE!"},{"$error":"#VALUE!"},{"$error":"#VALUE!"},{"$error":"#VALUE!"},{"$error":"#VALUE!"},{"$error":"#VALUE!"},{"$error":"#VALUE!"},{"$error":"#VALUE!"},{"$error":"#VALUE!"},{"$error":"#VALUE!"}]
[null,null,null,null,null,null,null,null,{"$f":"IF(Results!C131=\"\",\"\",Results!B131)","v":""},null,"",null,{"$error":"#VALUE!"},{"$error":"#VALUE!"},{"$error":"#VALUE!"},{"$error":"#VALUE!"},{"$error":"#VALUE!"},{"$error":"#VALUE!"},{"$error":"#VALUE!"},{"$error":"#VALUE!"},{"$error":"#VALUE!"},{"$error":"#VALUE!"}]
[null,null,null,null,null,null,null,null,{"$f":"IF(Results!C132=\"\",\"\",Results!B132)","v":""},null,"",null,{"$error":"#VALUE!"},{"$error":"#VALUE!"},{"$error":"#VALUE!"},{"$error":"#VALUE!"},{"$error":"#VALUE!"},{"$error":"#VALUE!"},{"$error":"#VALUE!"},{"$error":"#VALUE!"},{"$error":"#VALUE!"},{"$error":"#VALUE!"}]
[null,null,null,null,null,null,null,null,{"$f":"IF(Results!C133=\"\",\"\",Results!B133)","v":""},null,"",null,{"$error":"#VALUE!"},{"$error":"#VALUE!"},{"$error":"#VALUE!"},{"$error":"#VALUE!"},{"$error":"#VALUE!"},{"$error":"#VALUE!"},{"$error":"#VALUE!"},{"$error":"#VALUE!"},{"$error":"#VALUE!"},{"$error":"#VALUE!"}]
[null,null,null,null,null,null,null,null,{"$f":"IF(Results!C134=\"\",\"\",Results!B134)","v":""},null,"",null,{"$error":"#VALUE!"},{"$error":"#VALUE!"},{"$error":"#VALUE!"},{"$error":"#VALUE!"},{"$error":"#VALUE!"},{"$error":"#VALUE!"},{"$error":"#VALUE!"},{"$error":"#VALUE!"},{"$error":"#VALUE!"},{"$error":"#VALUE!"}]
[null,null,null,null,null,null,null,null,{"$f":"IF(Results!C135=\"\",\"\",Results!B135)","v":""},null,"",null,{"$error":"#VALUE!"},{"$error":"#VALUE!"},{"$error":"#VALUE!"},{"$error":"#VALUE!"},{"$error":"#VALUE!"},{"$error":"#VALUE!"},{"$error":"#VALUE!"},{"$error":"#VALUE!"},{"$error":"#VALUE!"},{"$error":"#VALUE!"}]
[null,null,null,null,null,null,null,null,{"$f":"IF(Results!C136=\"\",\"\",Results!B136)","v":""},null,"",null,{"$error":"#VALUE!"},{"$error":"#VALUE!"},{"$error":"#VALUE!"},{"$error":"#VALUE!"},{"$error":"#VALUE!"},{"$error":"#VALUE!"},{"$error":"#VALUE!"},{"$error":"#VALUE!"},{"$error":"#VALUE!"},{"$error":"#VALUE!"}]
[null,null,null,null,null,null,null,null,{"$f":"IF(Results!C137=\"\",\"\",Results!B137)","v":""},null,"",null,{"$error":"#VALUE!"},{"$error":"#VALUE!"},{"$error":"#VALUE!"},{"$error":"#VALUE!"},{"$error":"#VALUE!"},{"$error":"#VALUE!"},{"$error":"#VALUE!"},{"$error":"#VALUE!"},{"$error":"#VALUE!"},{"$error":"#VALUE!"}]
[null,null,null,null,null,null,null,null,{"$f":"IF(Results!C138=\"\",\"\",Results!B138)","v":""},null,"",null,{"$error":"#VALUE!"},{"$error":"#VALUE!"},{"$error":"#VALUE!"},{"$error":"#VALUE!"},{"$error":"#VALUE!"},{"$error":"#VALUE!"},{"$error":"#VALUE!"},{"$error":"#VALUE!"},{"$error":"#VALUE!"},{"$error":"#VALUE!"}]
[null,null,null,null,null,null,null,null,{"$f":"IF(Results!C139=\"\",\"\",Results!B139)","v":""},null,"",null,{"$error":"#VALUE!"},{"$error":"#VALUE!"},{"$error":"#VALUE!"},{"$error":"#VALUE!"},{"$error":"#VALUE!"},{"$error":"#VALUE!"},{"$error":"#VALUE!"},{"$error":"#VALUE!"},{"$error":"#VALUE!"},{"$error":"#VALUE!"}]
[null,null,null,null,null,null,null,null,{"$f":"IF(Results!C140=\"\",\"\",Results!B140)","v":""},null,"",null,{"$error":"#VALUE!"},{"$error":"#VALUE!"},{"$error":"#VALUE!"},{"$error":"#VALUE!"},{"$error":"#VALUE!"},{"$error":"#VALUE!"},{"$error":"#VALUE!"},{"$error":"#VALUE!"},{"$error":"#VALUE!"},{"$error":"#VALUE!"}]
[null,null,null,null,null,null,null,null,{"$f":"IF(Results!C141=\"\",\"\",Results!B141)","v":""},null,"",null,{"$error":"#VALUE!"},{"$error":"#VALUE!"},{"$error":"#VALUE!"},{"$error":"#VALUE!"},{"$error":"#VALUE!"},{"$error":"#VALUE!"},{"$error":"#VALUE!"},{"$error":"#VALUE!"},{"$error":"#VALUE!"},{"$error":"#VALUE!"}]
[null,null,null,null,null,null,null,null,{"$f":"IF(Results!C142=\"\",\"\",Results!B142)","v":""},null,"",null,{"$error":"#VALUE!"},{"$error":"#VALUE!"},{"$error":"#VALUE!"},{"$error":"#VALUE!"},{"$error":"#VALUE!"},{"$error":"#VALUE!"},{"$error":"#VALUE!"},{"$error":"#VALUE!"},{"$error":"#VALUE!"},{"$error":"#VALUE!"}]
[null,null,null,null,null,null,null,null,{"$f":"IF(Results!C143=\"\",\"\",Results!B143)","v":""},null,"",null,{"$error":"#VALUE!"},{"$error":"#VALUE!"},{"$error":"#VALUE!"},{"$error":"#VALUE!"},{"$error":"#VALUE!"},{"$error":"#VALUE!"},{"$error":"#VALUE!"},{"$error":"#VALUE!"},{"$error":"#VALUE!"},{"$error":"#VALUE!"}]
[null,null,null,null,null,null,null,null,{"$f":"IF(Results!C144=\"\",\"\",Results!B144)","v":""},null,"",null,{"$error":"#VALUE!"},{"$error":"#VALUE!"},{"$error":"#VALUE!"},{"$error":"#VALUE!"},{"$error":"#VALUE!"},{"$error":"#VALUE!"},{"$error":"#VALUE!"},{"$error":"#VALUE!"},{"$error":"#VALUE!"},{"$error":"#VALUE!"}]
[null,null,null,null,null,null,null,null,{"$f":"IF(Results!C145=\"\",\"\",Results!B145)","v":""},null,"",null,{"$error":"#VALUE!"},{"$error":"#VALUE!"},{"$error":"#VALUE!"},{"$error":"#VALUE!"},{"$error":"#VALUE!"},{"$error":"#VALUE!"},{"$error":"#VALUE!"},{"$error":"#VALUE!"},{"$error":"#VALUE!"},{"$error":"#VALUE!"}]
[null,null,null,null,null,null,null,null,{"$f":"IF(Results!C146=\"\",\"\",Results!B146)","v":""},null,"",null,{"$error":"#VALUE!"},{"$error":"#VALUE!"},{"$error":"#VALUE!"},{"$error":"#VALUE!"},{"$error":"#VALUE!"},{"$error":"#VALUE!"},{"$error":"#VALUE!"},{"$error":"#VALUE!"},{"$error":"#VALUE!"},{"$error":"#VALUE!"}]
[null,null,null,null,null,null,null,null,{"$f":"IF(Results!C147=\"\",\"\",Results!B147)","v":""},null,"",null,{"$error":"#VALUE!"},{"$error":"#VALUE!"},{"$error":"#VALUE!"},{"$error":"#VALUE!"},{"$error":"#VALUE!"},{"$error":"#VALUE!"},{"$error":"#VALUE!"},{"$error":"#VALUE!"},{"$error":"#VALUE!"},{"$error":"#VALUE!"}]
[null,null,null,null,null,null,null,null,{"$f":"IF(Results!C148=\"\",\"\",Results!B148)","v":""},null,"",null,{"$error":"#VALUE!"},{"$error":"#VALUE!"},{"$error":"#VALUE!"},{"$error":"#VALUE!"},{"$error":"#VALUE!"},{"$error":"#VALUE!"},{"$error":"#VALUE!"},{"$error":"#VALUE!"},{"$error":"#VALUE!"},{"$error":"#VALUE!"}]
[null,null,null,null,null,null,null,null,{"$f":"IF(Results!C149=\"\",\"\",Results!B149)","v":""},null,"",null,{"$error":"#VALUE!"},{"$error":"#VALUE!"},{"$error":"#VALUE!"},{"$error":"#VALUE!"},{"$error":"#VALUE!"},{"$error":"#VALUE!"},{"$error":"#VALUE!"},{"$error":"#VALUE!"},{"$error":"#VALUE!"},{"$error":"#VALUE!"}]
[null,null,null,null,null,null,null,null,{"$f":"IF(Results!C150=\"\",\"\",Results!B150)","v":""},null,"",null,{"$error":"#VALUE!"},{"$error":"#VALUE!"},{"$error":"#VALUE!"},{"$error":"#VALUE!"},{"$error":"#VALUE!"},{"$error":"#VALUE!"},{"$error":"#VALUE!"},{"$error":"#VALUE!"},{"$error":"#VALUE!"},{"$error":"#VALUE!"}]
[null,null,null,null,null,null,null,null,{"$f":"IF(Results!C151=\"\",\"\",Results!B151)","v":""},null,"",null,{"$error":"#VALUE!"},{"$error":"#VALUE!"},{"$error":"#VALUE!"},{"$error":"#VALUE!"},{"$error":"#VALUE!"},{"$error":"#VALUE!"},{"$error":"#VALUE!"},{"$error":"#VALUE!"},{"$error":"#VALUE!"},{"$error":"#VALUE!"}]
[null,null,null,null,null,null,null,null,{"$f":"IF(Results!C152=\"\",\"\",Results!B152)","v":""},null,"",null,{"$error":"#VALUE!"},{"$error":"#VALUE!"},{"$error":"#VALUE!"},{"$error":"#VALUE!"},{"$error":"#VALUE!"},{"$error":"#VALUE!"},{"$error":"#VALUE!"},{"$error":"#VALUE!"},{"$error":"#VALUE!"},{"$error":"#VALUE!"}]
[null,null,null,null,null,null,null,null,{"$f":"IF(Results!C153=\"\",\"\",Results!B153)","v":""},null,"",null,{"$error":"#VALUE!"},{"$error":"#VALUE!"},{"$error":"#VALUE!"},{"$error":"#VALUE!"},{"$error":"#VALUE!"},{"$error":"#VALUE!"},{"$error":"#VALUE!"},{"$error":"#VALUE!"},{"$error":"#VALUE!"},{"$error":"#VALUE!"}]
[null,null,null,null,null,null,null,null,{"$f":"IF(Results!C154=\"\",\"\",Results!B154)","v":""},null,"",null,{"$error":"#VALUE!"},{"$error":"#VALUE!"},{"$error":"#VALUE!"},{"$error":"#VALUE!"},{"$error":"#VALUE!"},{"$error":"#VALUE!"},{"$error":"#VALUE!"},{"$error":"#VALUE!"},{"$error":"#VALUE!"},{"$error":"#VALUE!"}]
[null,null,null,null,null,null,null,null,{"$f":"IF(Results!C155=\"\",\"\",Results!B155)","v":""},null,"",null,{"$error":"#VALUE!"},{"$error":"#VALUE!"},{"$error":"#VALUE!"},{"$error":"#VALUE!"},{"$error":"#VALUE!"},{"$error":"#VALUE!"},{"$error":"#VALUE!"},{"$error":"#VALUE!"},{"$error":"#VALUE!"},{"$error":"#VALUE!"}]
[null,null,null,null,null,null,null,null,{"$f":"IF(Results!C156=\"\",\"\",Results!B156)","v":""},null,"",null,{"$error":"#VALUE!"},{"$error":"#VALUE!"},{"$error":"#VALUE!"},{"$error":"#VALUE!"},{"$error":"#VALUE!"},{"$error":"#VALUE!"},{"$error":"#VALUE!"},{"$error":"#VALUE!"},{"$error":"#VALUE!"},{"$error":"#VALUE!"}]
[null,null,null,null,null,null,null,null,{"$f":"IF(Results!C157=\"\",\"\",Results!B157)","v":""},null,"",null,{"$error":"#VALUE!"},{"$error":"#VALUE!"},{"$error":"#VALUE!"},{"$error":"#VALUE!"},{"$error":"#VALUE!"},{"$error":"#VALUE!"},{"$error":"#VALUE!"},{"$error":"#VALUE!"},{"$error":"#VALUE!"},{"$error":"#VALUE!"}]
[null,null,null,null,null,null,null,null,{"$f":"IF(Results!C158=\"\",\"\",Results!B158)","v":""},null,"",null,{"$error":"#VALUE!"},{"$error":"#VALUE!"},{"$error":"#VALUE!"},{"$error":"#VALUE!"},{"$error":"#VALUE!"},{"$error":"#VALUE!"},{"$error":"#VALUE!"},{"$error":"#VALUE!"},{"$error":"#VALUE!"},{"$error":"#VALUE!"}]
[null,null,null,null,null,null,null,null,{"$f":"IF(Results!C159=\"\",\"\",Results!B159)","v":""},null,"",null,{"$error":"#VALUE!"},{"$error":"#VALUE!"},{"$error":"#VALUE!"},{"$error":"#VALUE!"},{"$error":"#VALUE!"},{"$error":"#VALUE!"},{"$error":"#VALUE!"},{"$error":"#VALUE!"},{"$error":"#VALUE!"},{"$error":"#VALUE!"}]
[null,null,null,null,null,null,null,null,{"$f":"IF(Results!C160=\"\",\"\",Results!B160)","v":""},null,"",null,{"$error":"#VALUE!"},{"$error":"#VALUE!"},{"$error":"#VALUE!"},{"$error":"#VALUE!"},{"$error":"#VALUE!"},{"$error":"#VALUE!"},{"$error":"#VALUE!"},{"$error":"#VALUE!"},{"$error":"#VALUE!"},{"$error":"#VALUE!"}]
[null,null,null,null,null,null,null,null,{"$f":"IF(Results!C161=\"\",\"\",Results!B161)","v":""},null,"",null,{"$error":"#VALUE!"},{"$error":"#VALUE!"},{"$error":"#VALUE!"},{"$error":"#VALUE!"},{"$error":"#VALUE!"},{"$error":"#VALUE!"},{"$error":"#VALUE!"},{"$error":"#VALUE!"},{"$error":"#VALUE!"},{"$error":"#VALUE!"}]
[null,null,null,null,null,null,null,null,{"$f":"IF(Results!C162=\"\",\"\",Results!B162)","v":""},null,"",null,{"$error":"#VALUE!"},{"$error":"#VALUE!"},{"$error":"#VALUE!"},{"$error":"#VALUE!"},{"$error":"#VALUE!"},{"$error":"#VALUE!"},{"$error":"#VALUE!"},{"$error":"#VALUE!"},{"$error":"#VALUE!"},{"$error":"#VALUE!"}]
[null,null,null,null,null,null,null,null,{"$f":"IF(Results!C163=\"\",\"\",Results!B163)","v":""},null,"",null,{"$error":"#VALUE!"},{"$error":"#VALUE!"},{"$error":"#VALUE!"},{"$error":"#VALUE!"},{"$error":"#VALUE!"},{"$error":"#VALUE!"},{"$error":"#VALUE!"},{"$error":"#VALUE!"},{"$error":"#VALUE!"},{"$error":"#VALUE!"}]
[null,null,null,null,null,null,null,null,{"$f":"IF(Results!C164=\"\",\"\",Results!B164)","v":""},null,"",null,{"$error":"#VALUE!"},{"$error":"#VALUE!"},{"$error":"#VALUE!"},{"$error":"#VALUE!"},{"$error":"#VALUE!"},{"$error":"#VALUE!"},{"$error":"#VALUE!"},{"$error":"#VALUE!"},{"$error":"#VALUE!"},{"$error":"#VALUE!"}]
[null,null,null,null,null,null,null,null,{"$f":"IF(Results!C165=\"\",\"\",Results!B165)","v":""},null,"",null,{"$error":"#VALUE!"},{"$error":"#VALUE!"},{"$error":"#VALUE!"},{"$error":"#VALUE!"},{"$error":"#VALUE!"},{"$error":"#VALUE!"},{"$error":"#VALUE!"},{"$error":"#VALUE!"},{"$error":"#VALUE!"},{"$error":"#VALUE!"}]
[null,null,null,null,null,null,null,null,{"$f":"IF(Results!C166=\"\",\"\",Results!B166)","v":""},null,"",null,{"$error":"#VALUE!"},{"$error":"#VALUE!"},{"$error":"#VALUE!"},{"$error":"#VALUE!"},{"$error":"#VALUE!"},{"$error":"#VALUE!"},{"$error":"#VALUE!"},{"$error":"#VALUE!"},{"$error":"#VALUE!"},{"$error":"#VALUE!"}]
[null,null,null,null,null,null,null,null,{"$f":"IF(Results!C167=\"\",\"\",Results!B167)","v":""},null,"",null,{"$error":"#VALUE!"},{"$error":"#VALUE!"},{"$error":"#VALUE!"},{"$error":"#VALUE!"},{"$error":"#VALUE!"},{"$error":"#VALUE!"},{"$error":"#VALUE!"},{"$error":"#VALUE!"},{"$error":"#VALUE!"},{"$error":"#VALUE!"}]
[null,null,null,null,null,null,null,null,{"$f":"IF(Results!C168=\"\",\"\",Results!B168)","v":""},null,{"$f":"IF($C$6=\"\",\"\",IF(I168=\"\",\"\",50-SUM(Q168:V168)))","v":""},null,{"$f":"SEARCH($C$6,J168)","v":{"$error":"#VALUE!"}},{"$f":"SEARCH($D$6,J168)","v":{"$error":"#VALUE!"}},{"$f":"SEARCH($E$6,J168)","v":{"$error":"#VALUE!"}},{"$f":"SEARCH($F$6,J168)","v":{"$error":"#VALUE!"}},{"$f":"IF((N168-M168)<0,$C$8,0)","v":{"$error":"#VALUE!"}},{"$f":"IF((O168-M168)<0,$C$8+$D$8,0)","v":{"$error":"#VALUE!"}},{"$f":"IF((P168-M168)<0,$C$8+$D$8+$E$8,0)","v":{"$error":"#VALUE!"}},{"$f":"IF((O168-N168)<0,$D$8,0)","v":{"$error":"#VALUE!"}},{"$f":"IF((P168-N168)<0,$D$8+$E$8,0)","v":{"$error":"#VALUE!"}},{"$f":"IF((P168-O168)<0,$E$8,0)","v":{"$error":"#VALUE!"}}]
[null,null,null,null,null,null,null,null,{"$f":"IF(Results!C169=\"\",\"\",Results!B169)","v":""},null,"",null,{"$error":"#VALUE!"},{"$error":"#VALUE!"},{"$error":"#VALUE!"},{"$error":"#VALUE!"},{"$error":"#VALUE!"},{"$error":"#VALUE!"},{"$error":"#VALUE!"},{"$error":"#VALUE!"},{"$error":"#VALUE!"},{"$error":"#VALUE!"}]
[null,null,null,null,null,null,null,null,{"$f":"IF(Results!C170=\"\",\"\",Results!B170)","v":""},null,"",null,{"$error":"#VALUE!"},{"$error":"#VALUE!"},{"$error":"#VALUE!"},{"$error":"#VALUE!"},{"$error":"#VALUE!"},{"$error":"#VALUE!"},{"$error":"#VALUE!"},{"$error":"#VALUE!"},{"$error":"#VALUE!"},{"$error":"#VALUE!"}]
[null,null,null,null,null,null,null,null,{"$f":"IF(Results!C171=\"\",\"\",Results!B171)","v":""},null,"",null,{"$error":"#VALUE!"},{"$error":"#VALUE!"},{"$error":"#VALUE!"},{"$error":"#VALUE!"},{"$error":"#VALUE!"},{"$error":"#VALUE!"},{"$error":"#VALUE!"},{"$error":"#VALUE!"},{"$error":"#VALUE!"},{"$error":"#VALUE!"}]
[null,null,null,null,null,null,null,null,{"$f":"IF(Results!C172=\"\",\"\",Results!B172)","v":""},null,"",null,{"$error":"#VALUE!"},{"$error":"#VALUE!"},{"$error":"#VALUE!"},{"$error":"#VALUE!"},{"$error":"#VALUE!"},{"$error":"#VALUE!"},{"$error":"#VALUE!"},{"$error":"#VALUE!"},{"$error":"#VALUE!"},{"$error":"#VALUE!"}]
[null,null,null,null,null,null,null,null,{"$f":"IF(Results!C173=\"\",\"\",Results!B173)","v":""},null,"",null,{"$error":"#VALUE!"},{"$error":"#VALUE!"},{"$error":"#VALUE!"},{"$error":"#VALUE!"},{"$error":"#VALUE!"},{"$error":"#VALUE!"},{"$error":"#VALUE!"},{"$error":"#VALUE!"},{"$error":"#VALUE!"},{"$error":"#VALUE!"}]
[null,null,null,null,null,null,null,null,{"$f":"IF(Results!C174=\"\",\"\",Results!B174)","v":""},null,"",null,{"$error":"#VALUE!"},{"$error":"#VALUE!"},{"$error":"#VALUE!"},{"$error":"#VALUE!"},{"$error":"#VALUE!"},{"$error":"#VALUE!"},{"$error":"#VALUE!"},{"$error":"#VALUE!"},{"$error":"#VALUE!"},{"$error":"#VALUE!"}]
[null,null,null,null,null,null,null,null,{"$f":"IF(Results!C175=\"\",\"\",Results!B175)","v":""},null,"",null,{"$error":"#VALUE!"},{"$error":"#VALUE!"},{"$error":"#VALUE!"},{"$error":"#VALUE!"},{"$error":"#VALUE!"},{"$error":"#VALUE!"},{"$error":"#VALUE!"},{"$error":"#VALUE!"},{"$error":"#VALUE!"},{"$error":"#VALUE!"}]
[null,null,null,null,null,null,null,null,{"$f":"IF(Results!C176=\"\",\"\",Results!B176)","v":""},null,"",null,{"$error":"#VALUE!"},{"$error":"#VALUE!"},{"$error":"#VALUE!"},{"$error":"#VALUE!"},{"$error":"#VALUE!"},{"$error":"#VALUE!"},{"$error":"#VALUE!"},{"$error":"#VALUE!"},{"$error":"#VALUE!"},{"$error":"#VALUE!"}]
[null,null,null,null,null,null,null,null,{"$f":"IF(Results!C177=\"\",\"\",Results!B177)","v":""},null,"",null,{"$error":"#VALUE!"},{"$error":"#VALUE!"},{"$error":"#VALUE!"},{"$error":"#VALUE!"},{"$error":"#VALUE!"},{"$error":"#VALUE!"},{"$error":"#VALUE!"},{"$error":"#VALUE!"},{"$error":"#VALUE!"},{"$error":"#VALUE!"}]
[null,null,null,null,null,null,null,null,{"$f":"IF(Results!C178=\"\",\"\",Results!B178)","v":""},null,"",null,{"$error":"#VALUE!"},{"$error":"#VALUE!"},{"$error":"#VALUE!"},{"$error":"#VALUE!"},{"$error":"#VALUE!"},{"$error":"#VALUE!"},{"$error":"#VALUE!"},{"$error":"#VALUE!"},{"$error":"#VALUE!"},{"$error":"#VALUE!"}]
[null,null,null,null,null,null,null,null,{"$f":"IF(Results!C179=\"\",\"\",Results!B179)","v":""},null,"",null,{"$error":"#VALUE!"},{"$error":"#VALUE!"},{"$error":"#VALUE!"},{"$error":"#VALUE!"},{"$error":"#VALUE!"},{"$error":"#VALUE!"},{"$error":"#VALUE!"},{"$error":"#VALUE!"},{"$error":"#VALUE!"},{"$error":"#VALUE!"}]
[null,null,null,null,null,null,null,null,{"$f":"IF(Results!C180=\"\",\"\",Results!B180)","v":""},null,"",null,{"$error":"#VALUE!"},{"$error":"#VALUE!"},{"$error":"#VALUE!"},{"$error":"#VALUE!"},{"$error":"#VALUE!"},{"$error":"#VALUE!"},{"$error":"#VALUE!"},{"$error":"#VALUE!"},{"$error":"#VALUE!"},{"$error":"#VALUE!"}]
[null,null,null,null,null,null,null,null,{"$f":"IF(Results!C181=\"\",\"\",Results!B181)","v":""},null,"",null,{"$error":"#VALUE!"},{"$error":"#VALUE!"},{"$error":"#VALUE!"},{"$error":"#VALUE!"},{"$error":"#VALUE!"},{"$error":"#VALUE!"},{"$error":"#VALUE!"},{"$error":"#VALUE!"},{"$error":"#VALUE!"},{"$error":"#VALUE!"}]
[null,null,null,null,null,null,null,null,{"$f":"IF(Results!C182=\"\",\"\",Results!B182)","v":""},null,"",null,{"$error":"#VALUE!"},{"$error":"#VALUE!"},{"$error":"#VALUE!"},{"$error":"#VALUE!"},{"$error":"#VALUE!"},{"$error":"#VALUE!"},{"$error":"#VALUE!"},{"$error":"#VALUE!"},{"$error":"#VALUE!"},{"$error":"#VALUE!"}]
[null,null,null,null,null,null,null,null,{"$f":"IF(Results!C183=\"\",\"\",Results!B183)","v":""},null,"",null,{"$error":"#VALUE!"},{"$error":"#VALUE!"},{"$error":"#VALUE!"},{"$error":"#VALUE!"},{"$error":"#VALUE!"},{"$error":"#VALUE!"},{"$error":"#VALUE!"},{"$error":"#VALUE!"},{"$error":"#VALUE!"},{"$error":"#VALUE!"}]
[null,null,null,null,null,null,null,null,{"$f":"IF(Results!C184=\"\",\"\",Results!B184)","v":""},null,"",null,{"$error":"#VALUE!"},{"$error":"#VALUE!"},{"$error":"#VALUE!"},{"$error":"#VALUE!"},{"$error":"#VALUE!"},{"$error":"#VALUE!"},{"$error":"#VALUE!"},{"$error":"#VALUE!"},{"$error":"#VALUE!"},{"$error":"#VALUE!"}]
[null,null,null,null,null,null,null,null,{"$f":"IF(Results!C185=\"\",\"\",Results!B185)","v":""},null,"",null,{"$error":"#VALUE!"},{"$error":"#VALUE!"},{"$error":"#VALUE!"},{"$error":"#VALUE!"},{"$error":"#VALUE!"},{"$error":"#VALUE!"},{"$error":"#VALUE!"},{"$error":"#VALUE!"},{"$error":"#VALUE!"},{"$error":"#VALUE!"}]
[null,null,null,null,null,null,null,null,{"$f":"IF(Results!C186=\"\",\"\",Results!B186)","v":""},null,"",null,{"$error":"#VALUE!"},{"$error":"#VALUE!"},{"$error":"#VALUE!"},{"$error":"#VALUE!"},{"$error":"#VALUE!"},{"$error":"#VALUE!"},{"$error":"#VALUE!"},{"$error":"#VALUE!"},{"$error":"#VALUE!"},{"$error":"#VALUE!"}]
[null,null,null,null,null,null,null,null,{"$f":"IF(Results!C187=\"\",\"\",Results!B187)","v":""},null,"",null,{"$error":"#VALUE!"},{"$error":"#VALUE!"},{"$error":"#VALUE!"},{"$error":"#VALUE!"},{"$error":"#VALUE!"},{"$error":"#VALUE!"},{"$error":"#VALUE!"},{"$error":"#VALUE!"},{"$error":"#VALUE!"},{"$error":"#VALUE!"}]
[null,null,null,null,null,null,null,null,{"$f":"IF(Results!C188=\"\",\"\",Results!B188)","v":""},null,"",null,{"$error":"#VALUE!"},{"$error":"#VALUE!"},{"$error":"#VALUE!"},{"$error":"#VALUE!"},{"$error":"#VALUE!"},{"$error":"#VALUE!"},{"$error":"#VALUE!"},{"$error":"#VALUE!"},{"$error":"#VALUE!"},{"$error":"#VALUE!"}]
[null,null,null,null,null,null,null,null,{"$f":"IF(Results!C189=\"\",\"\",Results!B189)","v":""},null,"",null,{"$error":"#VALUE!"},{"$error":"#VALUE!"},{"$error":"#VALUE!"},{"$error":"#VALUE!"},{"$error":"#VALUE!"},{"$error":"#VALUE!"},{"$error":"#VALUE!"},{"$error":"#VALUE!"},{"$error":"#VALUE!"},{"$error":"#VALUE!"}]
[null,null,null,null,null,null,null,null,{"$f":"IF(Results!C190=\"\",\"\",Results!B190)","v":""},null,"",null,{"$error":"#VALUE!"},{"$error":"#VALUE!"},{"$error":"#VALUE!"},{"$error":"#VALUE!"},{"$error":"#VALUE!"},{"$error":"#VALUE!"},{"$error":"#VALUE!"},{"$error":"#VALUE!"},{"$error":"#VALUE!"},{"$error":"#VALUE!"}]
[null,null,null,null,null,null,null,null,{"$f":"IF(Results!C191=\"\",\"\",Results!B191)","v":""},null,"",null,{"$error":"#VALUE!"},{"$error":"#VALUE!"},{"$error":"#VALUE!"},{"$error":"#VALUE!"},{"$error":"#VALUE!"},{"$error":"#VALUE!"},{"$error":"#VALUE!"},{"$error":"#VALUE!"},{"$error":"#VALUE!"},{"$error":"#VALUE!"}]
[null,null,null,null,null,null,null,null,{"$f":"IF(Results!C192=\"\",\"\",Results!B192)","v":""},null,"",null,{"$error":"#VALUE!"},{"$error":"#VALUE!"},{"$error":"#VALUE!"},{"$error":"#VALUE!"},{"$error":"#VALUE!"},{"$error":"#VALUE!"},{"$error":"#VALUE!"},{"$error":"#VALUE!"},{"$error":"#VALUE!"},{"$error":"#VALUE!"}]
[null,null,null,null,null,null,null,null,{"$f":"IF(Results!C193=\"\",\"\",Results!B193)","v":""},null,"",null,{"$error":"#VALUE!"},{"$error":"#VALUE!"},{"$error":"#VALUE!"},{"$error":"#VALUE!"},{"$error":"#VALUE!"},{"$error":"#VALUE!"},{"$error":"#VALUE!"},{"$error":"#VALUE!"},{"$error":"#VALUE!"},{"$error":"#VALUE!"}]
[null,null,null,null,null,null,null,null,{"$f":"IF(Results!C194=\"\",\"\",Results!B194)","v":""},null,"",null,{"$error":"#VALUE!"},{"$error":"#VALUE!"},{"$error":"#VALUE!"},{"$error":"#VALUE!"},{"$error":"#VALUE!"},{"$error":"#VALUE!"},{"$error":"#VALUE!"},{"$error":"#VALUE!"},{"$error":"#VALUE!"},{"$error":"#VALUE!"}]
[null,null,null,null,null,null,null,null,{"$f":"IF(Results!C195=\"\",\"\",Results!B195)","v":""},null,"",null,{"$error":"#VALUE!"},{"$error":"#VALUE!"},{"$error":"#VALUE!"},{"$error":"#VALUE!"},{"$error":"#VALUE!"},{"$error":"#VALUE!"},{"$error":"#VALUE!"},{"$error":"#VALUE!"},{"$error":"#VALUE!"},{"$error":"#VALUE!"}]
[null,null,null,null,null,null,null,null,{"$f":"IF(Results!C196=\"\",\"\",Results!B196)","v":""},null,"",null,{"$error":"#VALUE!"},{"$error":"#VALUE!"},{"$error":"#VALUE!"},{"$error":"#VALUE!"},{"$error":"#VALUE!"},{"$error":"#VALUE!"},{"$error":"#VALUE!"},{"$error":"#VALUE!"},{"$error":"#VALUE!"},{"$error":"#VALUE!"}]
[null,null,null,null,null,null,null,null,{"$f":"IF(Results!C197=\"\",\"\",Results!B197)","v":""},null,"",null,{"$error":"#VALUE!"},{"$error":"#VALUE!"},{"$error":"#VALUE!"},{"$error":"#VALUE!"},{"$error":"#VALUE!"},{"$error":"#VALUE!"},{"$error":"#VALUE!"},{"$error":"#VALUE!"},{"$error":"#VALUE!"},{"$error":"#VALUE!"}]
[null,null,null,null,null,null,null,null,{"$f":"IF(Results!C198=\"\",\"\",Results!B198)","v":""},null,"",null,{"$error":"#VALUE!"},{"$error":"#VALUE!"},{"$error":"#VALUE!"},{"$error":"#VALUE!"},{"$error":"#VALUE!"},{"$error":"#VALUE!"},{"$error":"#VALUE!"},{"$error":"#VALUE!"},{"$error":"#VALUE!"},{"$error":"#VALUE!"}]
[null,null,null,null,null,null,null,null,{"$f":"IF(Results!C199=\"\",\"\",Results!B199)","v":""},null,"",null,{"$error":"#VALUE!"},{"$error":"#VALUE!"},{"$error":"#VALUE!"},{"$error":"#VALUE!"},{"$error":"#VALUE!"},{"$error":"#VALUE!"},{"$error":"#VALUE!"},{"$error":"#VALUE!"},{"$error":"#VALUE!"},{"$error":"#VALUE!"}]
[null,null,null,null,null,null,null,null,{"$f":"IF(Results!C200=\"\",\"\",Results!B200)","v":""},null,"",null,{"$error":"#VALUE!"},{"$error":"#VALUE!"},{"$error":"#VALUE!"},{"$error":"#VALUE!"},{"$error":"#VALUE!"},{"$error":"#VALUE!"},{"$error":"#VALUE!"},{"$error":"#VALUE!"},{"$error":"#VALUE!"},{"$error":"#VALUE!"}]
[null,null,null,null,null,null,null,null,{"$f":"IF(Results!C201=\"\",\"\",Results!B201)","v":""},null,"",null,{"$error":"#VALUE!"},{"$error":"#VALUE!"},{"$error":"#VALUE!"},{"$error":"#VALUE!"},{"$error":"#VALUE!"},{"$error":"#VALUE!"},{"$error":"#VALUE!"},{"$error":"#VALUE!"},{"$error":"#VALUE!"},{"$error":"#VALUE!"}]
[null,null,null,null,null,null,null,null,{"$f":"IF(Results!C202=\"\",\"\",Results!B202)","v":""},null,"",null,{"$error":"#VALUE!"},{"$error":"#VALUE!"},{"$error":"#VALUE!"},{"$error":"#VALUE!"},{"$error":"#VALUE!"},{"$error":"#VALUE!"},{"$error":"#VALUE!"},{"$error":"#VALUE!"},{"$error":"#VALUE!"},{"$error":"#VALUE!"}]
[null,null,null,null,null,null,null,null,{"$f":"IF(Results!C203=\"\",\"\",Results!B203)","v":""},null,"",null,{"$error":"#VALUE!"},{"$error":"#VALUE!"},{"$error":"#VALUE!"},{"$error":"#VALUE!"},{"$error":"#VALUE!"},{"$error":"#VALUE!"},{"$error":"#VALUE!"},{"$error":"#VALUE!"},{"$error":"#VALUE!"},{"$error":"#VALUE!"}]

{"sheet":"Oral","index":6,"n_rows":203,"n_cols":7,"rows_kept":203,"cut":false,"hidden":false,"merged":[]}
[null,"SORTING ENTRANTS FOR ORAL PARTICIPATION"]
[]
[null,"NO","NAME","VISUAL TOTAL","HANDLING SCORE","PRE-ORAL SCORE","RANK"]
[null,5,{"$f":"IF(Results!C8=\"\",\"\",Results!C8)","v":""},{"$f":"IF(Results!D8=\"\",\"\",Results!D8)","v":""},{"$f":"IF(Results!E8=\"\",\"\",Results!E8)","v":""},{"$f":"IF(C4=\"\",\"\",SUM(D4:E4))","v":""},{"$f":"IF(F4=\"\",\"\",RANK($F4,$F$4:$F$203))","v":""}]
[null,3,{"$f":"IF(Results!C6=\"\",\"\",Results!C6)","v":""},{"$f":"IF(Results!D6=\"\",\"\",Results!D6)","v":""},{"$f":"IF(Results!E6=\"\",\"\",Results!E6)","v":""},"",""]
[null,4,{"$f":"IF(Results!C7=\"\",\"\",Results!C7)","v":""},{"$f":"IF(Results!D7=\"\",\"\",Results!D7)","v":""},{"$f":"IF(Results!E7=\"\",\"\",Results!E7)","v":""},"",""]
[null,2,{"$f":"IF(Results!C5=\"\",\"\",Results!C5)","v":""},{"$f":"IF(Results!D5=\"\",\"\",Results!D5)","v":""},{"$f":"IF(Results!E5=\"\",\"\",Results!E5)","v":""},"",""]
[null,1,{"$f":"IF(Results!C4=\"\",\"\",Results!C4)","v":""},{"$f":"IF(Results!D4=\"\",\"\",Results!D4)","v":""},{"$f":"IF(Results!E4=\"\",\"\",Results!E4)","v":""},"",""]
[null,6,{"$f":"IF(Results!C9=\"\",\"\",Results!C9)","v":""},{"$f":"IF(Results!D9=\"\",\"\",Results!D9)","v":""},{"$f":"IF(Results!E9=\"\",\"\",Results!E9)","v":""},"",""]
[null,7,{"$f":"IF(Results!C10=\"\",\"\",Results!C10)","v":""},{"$f":"IF(Results!D10=\"\",\"\",Results!D10)","v":""},{"$f":"IF(Results!E10=\"\",\"\",Results!E10)","v":""},"",""]
[null,8,{"$f":"IF(Results!C11=\"\",\"\",Results!C11)","v":""},{"$f":"IF(Results!D11=\"\",\"\",Results!D11)","v":""},{"$f":"IF(Results!E11=\"\",\"\",Results!E11)","v":""},"",""]
[null,9,{"$f":"IF(Results!C12=\"\",\"\",Results!C12)","v":""},{"$f":"IF(Results!D12=\"\",\"\",Results!D12)","v":""},{"$f":"IF(Results!E12=\"\",\"\",Results!E12)","v":""},"",""]
[null,10,{"$f":"IF(Results!C13=\"\",\"\",Results!C13)","v":""},{"$f":"IF(Results!D13=\"\",\"\",Results!D13)","v":""},{"$f":"IF(Results!E13=\"\",\"\",Results!E13)","v":""},"",""]
[null,11,{"$f":"IF(Results!C14=\"\",\"\",Results!C14)","v":""},{"$f":"IF(Results!D14=\"\",\"\",Results!D14)","v":""},{"$f":"IF(Results!E14=\"\",\"\",Results!E14)","v":""},"",""]
[null,12,{"$f":"IF(Results!C15=\"\",\"\",Results!C15)","v":""},{"$f":"IF(Results!D15=\"\",\"\",Results!D15)","v":""},{"$f":"IF(Results!E15=\"\",\"\",Results!E15)","v":""},"",""]
[null,13,{"$f":"IF(Results!C16=\"\",\"\",Results!C16)","v":""},{"$f":"IF(Results!D16=\"\",\"\",Results!D16)","v":""},{"$f":"IF(Results!E16=\"\",\"\",Results!E16)","v":""},"",""]
[null,14,{"$f":"IF(Results!C17=\"\",\"\",Results!C17)","v":""},{"$f":"IF(Results!D17=\"\",\"\",Results!D17)","v":""},{"$f":"IF(Results!E17=\"\",\"\",Results!E17)","v":""},"",""]
[null,15,{"$f":"IF(Results!C18=\"\",\"\",Results!C18)","v":""},{"$f":"IF(Results!D18=\"\",\"\",Results!D18)","v":""},{"$f":"IF(Results!E18=\"\",\"\",Results!E18)","v":""},"",""]
[null,16,{"$f":"IF(Results!C19=\"\",\"\",Results!C19)","v":""},{"$f":"IF(Results!D19=\"\",\"\",Results!D19)","v":""},{"$f":"IF(Results!E19=\"\",\"\",Results!E19)","v":""},"",""]
[null,17,{"$f":"IF(Results!C20=\"\",\"\",Results!C20)","v":""},{"$f":"IF(Results!D20=\"\",\"\",Results!D20)","v":""},{"$f":"IF(Results!E20=\"\",\"\",Results!E20)","v":""},"",""]
[null,18,{"$f":"IF(Results!C21=\"\",\"\",Results!C21)","v":""},{"$f":"IF(Results!D21=\"\",\"\",Results!D21)","v":""},{"$f":"IF(Results!E21=\"\",\"\",Results!E21)","v":""},"",""]
[null,19,{"$f":"IF(Results!C22=\"\",\"\",Results!C22)","v":""},{"$f":"IF(Results!D22=\"\",\"\",Results!D22)","v":""},{"$f":"IF(Results!E22=\"\",\"\",Results!E22)","v":""},"",""]
[null,20,{"$f":"IF(Results!C23=\"\",\"\",Results!C23)","v":""},{"$f":"IF(Results!D23=\"\",\"\",Results!D23)","v":""},{"$f":"IF(Results!E23=\"\",\"\",Results!E23)","v":""},"",""]
[null,21,{"$f":"IF(Results!C24=\"\",\"\",Results!C24)","v":""},{"$f":"IF(Results!D24=\"\",\"\",Results!D24)","v":""},{"$f":"IF(Results!E24=\"\",\"\",Results!E24)","v":""},"",""]
[null,22,{"$f":"IF(Results!C25=\"\",\"\",Results!C25)","v":""},{"$f":"IF(Results!D25=\"\",\"\",Results!D25)","v":""},{"$f":"IF(Results!E25=\"\",\"\",Results!E25)","v":""},"",""]
[null,23,{"$f":"IF(Results!C26=\"\",\"\",Results!C26)","v":""},{"$f":"IF(Results!D26=\"\",\"\",Results!D26)","v":""},{"$f":"IF(Results!E26=\"\",\"\",Results!E26)","v":""},"",""]
[null,24,{"$f":"IF(Results!C27=\"\",\"\",Results!C27)","v":""},{"$f":"IF(Results!D27=\"\",\"\",Results!D27)","v":""},{"$f":"IF(Results!E27=\"\",\"\",Results!E27)","v":""},"",""]
[null,25,{"$f":"IF(Results!C28=\"\",\"\",Results!C28)","v":""},{"$f":"IF(Results!D28=\"\",\"\",Results!D28)","v":""},{"$f":"IF(Results!E28=\"\",\"\",Results!E28)","v":""},"",""]
[null,26,{"$f":"IF(Results!C29=\"\",\"\",Results!C29)","v":""},{"$f":"IF(Results!D29=\"\",\"\",Results!D29)","v":""},{"$f":"IF(Results!E29=\"\",\"\",Results!E29)","v":""},"",""]
[null,27,{"$f":"IF(Results!C30=\"\",\"\",Results!C30)","v":""},{"$f":"IF(Results!D30=\"\",\"\",Results!D30)","v":""},{"$f":"IF(Results!E30=\"\",\"\",Results!E30)","v":""},"",""]
[null,28,{"$f":"IF(Results!C31=\"\",\"\",Results!C31)","v":""},{"$f":"IF(Results!D31=\"\",\"\",Results!D31)","v":""},{"$f":"IF(Results!E31=\"\",\"\",Results!E31)","v":""},"",""]
[null,29,{"$f":"IF(Results!C32=\"\",\"\",Results!C32)","v":""},{"$f":"IF(Results!D32=\"\",\"\",Results!D32)","v":""},{"$f":"IF(Results!E32=\"\",\"\",Results!E32)","v":""},"",""]
[null,30,{"$f":"IF(Results!C33=\"\",\"\",Results!C33)","v":""},{"$f":"IF(Results!D33=\"\",\"\",Results!D33)","v":""},{"$f":"IF(Results!E33=\"\",\"\",Results!E33)","v":""},"",""]
[null,31,{"$f":"IF(Results!C34=\"\",\"\",Results!C34)","v":""},{"$f":"IF(Results!D34=\"\",\"\",Results!D34)","v":""},{"$f":"IF(Results!E34=\"\",\"\",Results!E34)","v":""},"",""]
[null,32,{"$f":"IF(Results!C35=\"\",\"\",Results!C35)","v":""},{"$f":"IF(Results!D35=\"\",\"\",Results!D35)","v":""},{"$f":"IF(Results!E35=\"\",\"\",Results!E35)","v":""},"",""]
[null,33,{"$f":"IF(Results!C36=\"\",\"\",Results!C36)","v":""},{"$f":"IF(Results!D36=\"\",\"\",Results!D36)","v":""},{"$f":"IF(Results!E36=\"\",\"\",Results!E36)","v":""},{"$f":"IF(C36=\"\",\"\",SUM(D36:E36))","v":""},{"$f":"IF(F36=\"\",\"\",RANK($F36,$F$4:$F$203))","v":""}]
[null,34,{"$f":"IF(Results!C37=\"\",\"\",Results!C37)","v":""},{"$f":"IF(Results!D37=\"\",\"\",Results!D37)","v":""},{"$f":"IF(Results!E37=\"\",\"\",Results!E37)","v":""},"",""]
[null,35,{"$f":"IF(Results!C38=\"\",\"\",Results!C38)","v":""},{"$f":"IF(Results!D38=\"\",\"\",Results!D38)","v":""},{"$f":"IF(Results!E38=\"\",\"\",Results!E38)","v":""},"",""]
[null,36,{"$f":"IF(Results!C39=\"\",\"\",Results!C39)","v":""},{"$f":"IF(Results!D39=\"\",\"\",Results!D39)","v":""},{"$f":"IF(Results!E39=\"\",\"\",Results!E39)","v":""},"",""]
[null,37,{"$f":"IF(Results!C40=\"\",\"\",Results!C40)","v":""},{"$f":"IF(Results!D40=\"\",\"\",Results!D40)","v":""},{"$f":"IF(Results!E40=\"\",\"\",Results!E40)","v":""},"",""]
[null,38,{"$f":"IF(Results!C41=\"\",\"\",Results!C41)","v":""},{"$f":"IF(Results!D41=\"\",\"\",Results!D41)","v":""},{"$f":"IF(Results!E41=\"\",\"\",Results!E41)","v":""},"",""]
[null,39,{"$f":"IF(Results!C42=\"\",\"\",Results!C42)","v":""},{"$f":"IF(Results!D42=\"\",\"\",Results!D42)","v":""},{"$f":"IF(Results!E42=\"\",\"\",Results!E42)","v":""},"",""]
[null,40,{"$f":"IF(Results!C43=\"\",\"\",Results!C43)","v":""},{"$f":"IF(Results!D43=\"\",\"\",Results!D43)","v":""},{"$f":"IF(Results!E43=\"\",\"\",Results!E43)","v":""},"",""]
[null,41,{"$f":"IF(Results!C44=\"\",\"\",Results!C44)","v":""},{"$f":"IF(Results!D44=\"\",\"\",Results!D44)","v":""},{"$f":"IF(Results!E44=\"\",\"\",Results!E44)","v":""},"",""]
[null,42,{"$f":"IF(Results!C45=\"\",\"\",Results!C45)","v":""},{"$f":"IF(Results!D45=\"\",\"\",Results!D45)","v":""},{"$f":"IF(Results!E45=\"\",\"\",Results!E45)","v":""},"",""]
[null,43,{"$f":"IF(Results!C46=\"\",\"\",Results!C46)","v":""},{"$f":"IF(Results!D46=\"\",\"\",Results!D46)","v":""},{"$f":"IF(Results!E46=\"\",\"\",Results!E46)","v":""},"",""]
[null,44,{"$f":"IF(Results!C47=\"\",\"\",Results!C47)","v":""},{"$f":"IF(Results!D47=\"\",\"\",Results!D47)","v":""},{"$f":"IF(Results!E47=\"\",\"\",Results!E47)","v":""},"",""]
[null,45,{"$f":"IF(Results!C48=\"\",\"\",Results!C48)","v":""},{"$f":"IF(Results!D48=\"\",\"\",Results!D48)","v":""},{"$f":"IF(Results!E48=\"\",\"\",Results!E48)","v":""},"",""]
[null,46,{"$f":"IF(Results!C49=\"\",\"\",Results!C49)","v":""},{"$f":"IF(Results!D49=\"\",\"\",Results!D49)","v":""},{"$f":"IF(Results!E49=\"\",\"\",Results!E49)","v":""},"",""]
[null,47,{"$f":"IF(Results!C50=\"\",\"\",Results!C50)","v":""},{"$f":"IF(Results!D50=\"\",\"\",Results!D50)","v":""},{"$f":"IF(Results!E50=\"\",\"\",Results!E50)","v":""},"",""]
[null,48,{"$f":"IF(Results!C51=\"\",\"\",Results!C51)","v":""},{"$f":"IF(Results!D51=\"\",\"\",Results!D51)","v":""},{"$f":"IF(Results!E51=\"\",\"\",Results!E51)","v":""},"",""]
[null,49,{"$f":"IF(Results!C52=\"\",\"\",Results!C52)","v":""},{"$f":"IF(Results!D52=\"\",\"\",Results!D52)","v":""},{"$f":"IF(Results!E52=\"\",\"\",Results!E52)","v":""},"",""]
[null,50,{"$f":"IF(Results!C53=\"\",\"\",Results!C53)","v":""},{"$f":"IF(Results!D53=\"\",\"\",Results!D53)","v":""},{"$f":"IF(Results!E53=\"\",\"\",Results!E53)","v":""},"",""]
[null,51,{"$f":"IF(Results!C54=\"\",\"\",Results!C54)","v":""},{"$f":"IF(Results!D54=\"\",\"\",Results!D54)","v":""},{"$f":"IF(Results!E54=\"\",\"\",Results!E54)","v":""},"",""]
[null,52,{"$f":"IF(Results!C55=\"\",\"\",Results!C55)","v":""},{"$f":"IF(Results!D55=\"\",\"\",Results!D55)","v":""},{"$f":"IF(Results!E55=\"\",\"\",Results!E55)","v":""},"",""]
[null,53,{"$f":"IF(Results!C56=\"\",\"\",Results!C56)","v":""},{"$f":"IF(Results!D56=\"\",\"\",Results!D56)","v":""},{"$f":"IF(Results!E56=\"\",\"\",Results!E56)","v":""},"",""]
[null,54,{"$f":"IF(Results!C57=\"\",\"\",Results!C57)","v":""},{"$f":"IF(Results!D57=\"\",\"\",Results!D57)","v":""},{"$f":"IF(Results!E57=\"\",\"\",Results!E57)","v":""},"",""]
[null,55,{"$f":"IF(Results!C58=\"\",\"\",Results!C58)","v":""},{"$f":"IF(Results!D58=\"\",\"\",Results!D58)","v":""},{"$f":"IF(Results!E58=\"\",\"\",Results!E58)","v":""},"",""]
[null,56,{"$f":"IF(Results!C59=\"\",\"\",Results!C59)","v":""},{"$f":"IF(Results!D59=\"\",\"\",Results!D59)","v":""},{"$f":"IF(Results!E59=\"\",\"\",Results!E59)","v":""},"",""]
[null,57,{"$f":"IF(Results!C60=\"\",\"\",Results!C60)","v":""},{"$f":"IF(Results!D60=\"\",\"\",Results!D60)","v":""},{"$f":"IF(Results!E60=\"\",\"\",Results!E60)","v":""},"",""]
[null,58,{"$f":"IF(Results!C61=\"\",\"\",Results!C61)","v":""},{"$f":"IF(Results!D61=\"\",\"\",Results!D61)","v":""},{"$f":"IF(Results!E61=\"\",\"\",Results!E61)","v":""},"",""]
[null,59,{"$f":"IF(Results!C62=\"\",\"\",Results!C62)","v":""},{"$f":"IF(Results!D62=\"\",\"\",Results!D62)","v":""},{"$f":"IF(Results!E62=\"\",\"\",Results!E62)","v":""},"",""]
[null,60,{"$f":"IF(Results!C63=\"\",\"\",Results!C63)","v":""},{"$f":"IF(Results!D63=\"\",\"\",Results!D63)","v":""},{"$f":"IF(Results!E63=\"\",\"\",Results!E63)","v":""},"",""]
[null,61,{"$f":"IF(Results!C64=\"\",\"\",Results!C64)","v":""},{"$f":"IF(Results!D64=\"\",\"\",Results!D64)","v":""},{"$f":"IF(Results!E64=\"\",\"\",Results!E64)","v":""},"",""]
[null,62,{"$f":"IF(Results!C65=\"\",\"\",Results!C65)","v":""},{"$f":"IF(Results!D65=\"\",\"\",Results!D65)","v":""},{"$f":"IF(Results!E65=\"\",\"\",Results!E65)","v":""},"",""]
[null,63,{"$f":"IF(Results!C66=\"\",\"\",Results!C66)","v":""},{"$f":"IF(Results!D66=\"\",\"\",Results!D66)","v":""},{"$f":"IF(Results!E66=\"\",\"\",Results!E66)","v":""},"",""]
[null,64,{"$f":"IF(Results!C67=\"\",\"\",Results!C67)","v":""},{"$f":"IF(Results!D67=\"\",\"\",Results!D67)","v":""},{"$f":"IF(Results!E67=\"\",\"\",Results!E67)","v":""},"",""]
[null,65,{"$f":"IF(Results!C68=\"\",\"\",Results!C68)","v":""},{"$f":"IF(Results!D68=\"\",\"\",Results!D68)","v":""},{"$f":"IF(Results!E68=\"\",\"\",Results!E68)","v":""},{"$f":"IF(C68=\"\",\"\",SUM(D68:E68))","v":""},{"$f":"IF(F68=\"\",\"\",RANK($F68,$F$4:$F$203))","v":""}]
[null,66,{"$f":"IF(Results!C69=\"\",\"\",Results!C69)","v":""},{"$f":"IF(Results!D69=\"\",\"\",Results!D69)","v":""},{"$f":"IF(Results!E69=\"\",\"\",Results!E69)","v":""},"",""]
[null,67,{"$f":"IF(Results!C70=\"\",\"\",Results!C70)","v":""},{"$f":"IF(Results!D70=\"\",\"\",Results!D70)","v":""},{"$f":"IF(Results!E70=\"\",\"\",Results!E70)","v":""},"",""]
[null,68,{"$f":"IF(Results!C71=\"\",\"\",Results!C71)","v":""},{"$f":"IF(Results!D71=\"\",\"\",Results!D71)","v":""},{"$f":"IF(Results!E71=\"\",\"\",Results!E71)","v":""},"",""]
[null,69,{"$f":"IF(Results!C72=\"\",\"\",Results!C72)","v":""},{"$f":"IF(Results!D72=\"\",\"\",Results!D72)","v":""},{"$f":"IF(Results!E72=\"\",\"\",Results!E72)","v":""},"",""]
[null,70,{"$f":"IF(Results!C73=\"\",\"\",Results!C73)","v":""},{"$f":"IF(Results!D73=\"\",\"\",Results!D73)","v":""},{"$f":"IF(Results!E73=\"\",\"\",Results!E73)","v":""},"",""]
[null,71,{"$f":"IF(Results!C74=\"\",\"\",Results!C74)","v":""},{"$f":"IF(Results!D74=\"\",\"\",Results!D74)","v":""},{"$f":"IF(Results!E74=\"\",\"\",Results!E74)","v":""},"",""]
[null,72,{"$f":"IF(Results!C75=\"\",\"\",Results!C75)","v":""},{"$f":"IF(Results!D75=\"\",\"\",Results!D75)","v":""},{"$f":"IF(Results!E75=\"\",\"\",Results!E75)","v":""},"",""]
[null,73,{"$f":"IF(Results!C76=\"\",\"\",Results!C76)","v":""},{"$f":"IF(Results!D76=\"\",\"\",Results!D76)","v":""},{"$f":"IF(Results!E76=\"\",\"\",Results!E76)","v":""},"",""]
[null,74,{"$f":"IF(Results!C77=\"\",\"\",Results!C77)","v":""},{"$f":"IF(Results!D77=\"\",\"\",Results!D77)","v":""},{"$f":"IF(Results!E77=\"\",\"\",Results!E77)","v":""},"",""]
[null,75,{"$f":"IF(Results!C78=\"\",\"\",Results!C78)","v":""},{"$f":"IF(Results!D78=\"\",\"\",Results!D78)","v":""},{"$f":"IF(Results!E78=\"\",\"\",Results!E78)","v":""},"",""]
[null,76,{"$f":"IF(Results!C79=\"\",\"\",Results!C79)","v":""},{"$f":"IF(Results!D79=\"\",\"\",Results!D79)","v":""},{"$f":"IF(Results!E79=\"\",\"\",Results!E79)","v":""},"",""]
[null,77,{"$f":"IF(Results!C80=\"\",\"\",Results!C80)","v":""},{"$f":"IF(Results!D80=\"\",\"\",Results!D80)","v":""},{"$f":"IF(Results!E80=\"\",\"\",Results!E80)","v":""},"",""]
[null,78,{"$f":"IF(Results!C81=\"\",\"\",Results!C81)","v":""},{"$f":"IF(Results!D81=\"\",\"\",Results!D81)","v":""},{"$f":"IF(Results!E81=\"\",\"\",Results!E81)","v":""},"",""]
[null,79,{"$f":"IF(Results!C82=\"\",\"\",Results!C82)","v":""},{"$f":"IF(Results!D82=\"\",\"\",Results!D82)","v":""},{"$f":"IF(Results!E82=\"\",\"\",Results!E82)","v":""},"",""]
[null,80,{"$f":"IF(Results!C83=\"\",\"\",Results!C83)","v":""},{"$f":"IF(Results!D83=\"\",\"\",Results!D83)","v":""},{"$f":"IF(Results!E83=\"\",\"\",Results!E83)","v":""},"",""]
[null,81,{"$f":"IF(Results!C84=\"\",\"\",Results!C84)","v":""},{"$f":"IF(Results!D84=\"\",\"\",Results!D84)","v":""},{"$f":"IF(Results!E84=\"\",\"\",Results!E84)","v":""},"",""]
[null,82,{"$f":"IF(Results!C85=\"\",\"\",Results!C85)","v":""},{"$f":"IF(Results!D85=\"\",\"\",Results!D85)","v":""},{"$f":"IF(Results!E85=\"\",\"\",Results!E85)","v":""},"",""]
[null,83,{"$f":"IF(Results!C86=\"\",\"\",Results!C86)","v":""},{"$f":"IF(Results!D86=\"\",\"\",Results!D86)","v":""},{"$f":"IF(Results!E86=\"\",\"\",Results!E86)","v":""},"",""]
[null,84,{"$f":"IF(Results!C87=\"\",\"\",Results!C87)","v":""},{"$f":"IF(Results!D87=\"\",\"\",Results!D87)","v":""},{"$f":"IF(Results!E87=\"\",\"\",Results!E87)","v":""},"",""]
[null,85,{"$f":"IF(Results!C88=\"\",\"\",Results!C88)","v":""},{"$f":"IF(Results!D88=\"\",\"\",Results!D88)","v":""},{"$f":"IF(Results!E88=\"\",\"\",Results!E88)","v":""},"",""]
[null,86,{"$f":"IF(Results!C89=\"\",\"\",Results!C89)","v":""},{"$f":"IF(Results!D89=\"\",\"\",Results!D89)","v":""},{"$f":"IF(Results!E89=\"\",\"\",Results!E89)","v":""},"",""]
[null,87,{"$f":"IF(Results!C90=\"\",\"\",Results!C90)","v":""},{"$f":"IF(Results!D90=\"\",\"\",Results!D90)","v":""},{"$f":"IF(Results!E90=\"\",\"\",Results!E90)","v":""},"",""]
[null,88,{"$f":"IF(Results!C91=\"\",\"\",Results!C91)","v":""},{"$f":"IF(Results!D91=\"\",\"\",Results!D91)","v":""},{"$f":"IF(Results!E91=\"\",\"\",Results!E91)","v":""},"",""]
[null,89,{"$f":"IF(Results!C92=\"\",\"\",Results!C92)","v":""},{"$f":"IF(Results!D92=\"\",\"\",Results!D92)","v":""},{"$f":"IF(Results!E92=\"\",\"\",Results!E92)","v":""},"",""]
[null,90,{"$f":"IF(Results!C93=\"\",\"\",Results!C93)","v":""},{"$f":"IF(Results!D93=\"\",\"\",Results!D93)","v":""},{"$f":"IF(Results!E93=\"\",\"\",Results!E93)","v":""},"",""]
[null,91,{"$f":"IF(Results!C94=\"\",\"\",Results!C94)","v":""},{"$f":"IF(Results!D94=\"\",\"\",Results!D94)","v":""},{"$f":"IF(Results!E94=\"\",\"\",Results!E94)","v":""},"",""]
[null,92,{"$f":"IF(Results!C95=\"\",\"\",Results!C95)","v":""},{"$f":"IF(Results!D95=\"\",\"\",Results!D95)","v":""},{"$f":"IF(Results!E95=\"\",\"\",Results!E95)","v":""},"",""]
[null,93,{"$f":"IF(Results!C96=\"\",\"\",Results!C96)","v":""},{"$f":"IF(Results!D96=\"\",\"\",Results!D96)","v":""},{"$f":"IF(Results!E96=\"\",\"\",Results!E96)","v":""},"",""]
[null,94,{"$f":"IF(Results!C97=\"\",\"\",Results!C97)","v":""},{"$f":"IF(Results!D97=\"\",\"\",Results!D97)","v":""},{"$f":"IF(Results!E97=\"\",\"\",Results!E97)","v":""},"",""]
[null,95,{"$f":"IF(Results!C98=\"\",\"\",Results!C98)","v":""},{"$f":"IF(Results!D98=\"\",\"\",Results!D98)","v":""},{"$f":"IF(Results!E98=\"\",\"\",Results!E98)","v":""},"",""]
[null,96,{"$f":"IF(Results!C99=\"\",\"\",Results!C99)","v":""},{"$f":"IF(Results!D99=\"\",\"\",Results!D99)","v":""},{"$f":"IF(Results!E99=\"\",\"\",Results!E99)","v":""},"",""]
[null,97,{"$f":"IF(Results!C100=\"\",\"\",Results!C100)","v":""},{"$f":"IF(Results!D100=\"\",\"\",Results!D100)","v":""},{"$f":"IF(Results!E100=\"\",\"\",Results!E100)","v":""},{"$f":"IF(C100=\"\",\"\",SUM(D100:E100))","v":""},{"$f":"IF(F100=\"\",\"\",RANK($F100,$F$4:$F$203))","v":""}]
[null,98,{"$f":"IF(Results!C101=\"\",\"\",Results!C101)","v":""},{"$f":"IF(Results!D101=\"\",\"\",Results!D101)","v":""},{"$f":"IF(Results!E101=\"\",\"\",Results!E101)","v":""},"",""]
[null,99,{"$f":"IF(Results!C102=\"\",\"\",Results!C102)","v":""},{"$f":"IF(Results!D102=\"\",\"\",Results!D102)","v":""},{"$f":"IF(Results!E102=\"\",\"\",Results!E102)","v":""},"",""]
[null,100,{"$f":"IF(Results!C103=\"\",\"\",Results!C103)","v":""},{"$f":"IF(Results!D103=\"\",\"\",Results!D103)","v":""},{"$f":"IF(Results!E103=\"\",\"\",Results!E103)","v":""},"",""]
[null,101,{"$f":"IF(Results!C104=\"\",\"\",Results!C104)","v":""},{"$f":"IF(Results!D104=\"\",\"\",Results!D104)","v":""},{"$f":"IF(Results!E104=\"\",\"\",Results!E104)","v":""},"",""]
[null,102,{"$f":"IF(Results!C105=\"\",\"\",Results!C105)","v":""},{"$f":"IF(Results!D105=\"\",\"\",Results!D105)","v":""},{"$f":"IF(Results!E105=\"\",\"\",Results!E105)","v":""},"",""]
[null,103,{"$f":"IF(Results!C106=\"\",\"\",Results!C106)","v":""},{"$f":"IF(Results!D106=\"\",\"\",Results!D106)","v":""},{"$f":"IF(Results!E106=\"\",\"\",Results!E106)","v":""},"",""]
[null,104,{"$f":"IF(Results!C107=\"\",\"\",Results!C107)","v":""},{"$f":"IF(Results!D107=\"\",\"\",Results!D107)","v":""},{"$f":"IF(Results!E107=\"\",\"\",Results!E107)","v":""},"",""]
[null,105,{"$f":"IF(Results!C108=\"\",\"\",Results!C108)","v":""},{"$f":"IF(Results!D108=\"\",\"\",Results!D108)","v":""},{"$f":"IF(Results!E108=\"\",\"\",Results!E108)","v":""},"",""]
[null,106,{"$f":"IF(Results!C109=\"\",\"\",Results!C109)","v":""},{"$f":"IF(Results!D109=\"\",\"\",Results!D109)","v":""},{"$f":"IF(Results!E109=\"\",\"\",Results!E109)","v":""},"",""]
[null,107,{"$f":"IF(Results!C110=\"\",\"\",Results!C110)","v":""},{"$f":"IF(Results!D110=\"\",\"\",Results!D110)","v":""},{"$f":"IF(Results!E110=\"\",\"\",Results!E110)","v":""},"",""]
[null,108,{"$f":"IF(Results!C111=\"\",\"\",Results!C111)","v":""},{"$f":"IF(Results!D111=\"\",\"\",Results!D111)","v":""},{"$f":"IF(Results!E111=\"\",\"\",Results!E111)","v":""},"",""]
[null,109,{"$f":"IF(Results!C112=\"\",\"\",Results!C112)","v":""},{"$f":"IF(Results!D112=\"\",\"\",Results!D112)","v":""},{"$f":"IF(Results!E112=\"\",\"\",Results!E112)","v":""},"",""]
[null,110,{"$f":"IF(Results!C113=\"\",\"\",Results!C113)","v":""},{"$f":"IF(Results!D113=\"\",\"\",Results!D113)","v":""},{"$f":"IF(Results!E113=\"\",\"\",Results!E113)","v":""},"",""]
[null,111,{"$f":"IF(Results!C114=\"\",\"\",Results!C114)","v":""},{"$f":"IF(Results!D114=\"\",\"\",Results!D114)","v":""},{"$f":"IF(Results!E114=\"\",\"\",Results!E114)","v":""},"",""]
[null,112,{"$f":"IF(Results!C115=\"\",\"\",Results!C115)","v":""},{"$f":"IF(Results!D115=\"\",\"\",Results!D115)","v":""},{"$f":"IF(Results!E115=\"\",\"\",Results!E115)","v":""},"",""]
[null,113,{"$f":"IF(Results!C116=\"\",\"\",Results!C116)","v":""},{"$f":"IF(Results!D116=\"\",\"\",Results!D116)","v":""},{"$f":"IF(Results!E116=\"\",\"\",Results!E116)","v":""},"",""]
[null,114,{"$f":"IF(Results!C117=\"\",\"\",Results!C117)","v":""},{"$f":"IF(Results!D117=\"\",\"\",Results!D117)","v":""},{"$f":"IF(Results!E117=\"\",\"\",Results!E117)","v":""},"",""]
[null,115,{"$f":"IF(Results!C118=\"\",\"\",Results!C118)","v":""},{"$f":"IF(Results!D118=\"\",\"\",Results!D118)","v":""},{"$f":"IF(Results!E118=\"\",\"\",Results!E118)","v":""},"",""]
[null,116,{"$f":"IF(Results!C119=\"\",\"\",Results!C119)","v":""},{"$f":"IF(Results!D119=\"\",\"\",Results!D119)","v":""},{"$f":"IF(Results!E119=\"\",\"\",Results!E119)","v":""},"",""]
[null,117,{"$f":"IF(Results!C120=\"\",\"\",Results!C120)","v":""},{"$f":"IF(Results!D120=\"\",\"\",Results!D120)","v":""},{"$f":"IF(Results!E120=\"\",\"\",Results!E120)","v":""},"",""]
[null,118,{"$f":"IF(Results!C121=\"\",\"\",Results!C121)","v":""},{"$f":"IF(Results!D121=\"\",\"\",Results!D121)","v":""},{"$f":"IF(Results!E121=\"\",\"\",Results!E121)","v":""},"",""]
[null,119,{"$f":"IF(Results!C122=\"\",\"\",Results!C122)","v":""},{"$f":"IF(Results!D122=\"\",\"\",Results!D122)","v":""},{"$f":"IF(Results!E122=\"\",\"\",Results!E122)","v":""},"",""]
[null,120,{"$f":"IF(Results!C123=\"\",\"\",Results!C123)","v":""},{"$f":"IF(Results!D123=\"\",\"\",Results!D123)","v":""},{"$f":"IF(Results!E123=\"\",\"\",Results!E123)","v":""},"",""]
[null,121,{"$f":"IF(Results!C124=\"\",\"\",Results!C124)","v":""},{"$f":"IF(Results!D124=\"\",\"\",Results!D124)","v":""},{"$f":"IF(Results!E124=\"\",\"\",Results!E124)","v":""},"",""]
[null,122,{"$f":"IF(Results!C125=\"\",\"\",Results!C125)","v":""},{"$f":"IF(Results!D125=\"\",\"\",Results!D125)","v":""},{"$f":"IF(Results!E125=\"\",\"\",Results!E125)","v":""},"",""]
[null,123,{"$f":"IF(Results!C126=\"\",\"\",Results!C126)","v":""},{"$f":"IF(Results!D126=\"\",\"\",Results!D126)","v":""},{"$f":"IF(Results!E126=\"\",\"\",Results!E126)","v":""},"",""]
[null,124,{"$f":"IF(Results!C127=\"\",\"\",Results!C127)","v":""},{"$f":"IF(Results!D127=\"\",\"\",Results!D127)","v":""},{"$f":"IF(Results!E127=\"\",\"\",Results!E127)","v":""},"",""]
[null,125,{"$f":"IF(Results!C128=\"\",\"\",Results!C128)","v":""},{"$f":"IF(Results!D128=\"\",\"\",Results!D128)","v":""},{"$f":"IF(Results!E128=\"\",\"\",Results!E128)","v":""},"",""]
[null,126,{"$f":"IF(Results!C129=\"\",\"\",Results!C129)","v":""},{"$f":"IF(Results!D129=\"\",\"\",Results!D129)","v":""},{"$f":"IF(Results!E129=\"\",\"\",Results!E129)","v":""},"",""]
[null,127,{"$f":"IF(Results!C130=\"\",\"\",Results!C130)","v":""},{"$f":"IF(Results!D130=\"\",\"\",Results!D130)","v":""},{"$f":"IF(Results!E130=\"\",\"\",Results!E130)","v":""},"",""]
[null,128,{"$f":"IF(Results!C131=\"\",\"\",Results!C131)","v":""},{"$f":"IF(Results!D131=\"\",\"\",Results!D131)","v":""},{"$f":"IF(Results!E131=\"\",\"\",Results!E131)","v":""},"",""]
[null,129,{"$f":"IF(Results!C132=\"\",\"\",Results!C132)","v":""},{"$f":"IF(Results!D132=\"\",\"\",Results!D132)","v":""},{"$f":"IF(Results!E132=\"\",\"\",Results!E132)","v":""},{"$f":"IF(C132=\"\",\"\",SUM(D132:E132))","v":""},{"$f":"IF(F132=\"\",\"\",RANK($F132,$F$4:$F$203))","v":""}]
[null,130,{"$f":"IF(Results!C133=\"\",\"\",Results!C133)","v":""},{"$f":"IF(Results!D133=\"\",\"\",Results!D133)","v":""},{"$f":"IF(Results!E133=\"\",\"\",Results!E133)","v":""},"",""]
[null,131,{"$f":"IF(Results!C134=\"\",\"\",Results!C134)","v":""},{"$f":"IF(Results!D134=\"\",\"\",Results!D134)","v":""},{"$f":"IF(Results!E134=\"\",\"\",Results!E134)","v":""},"",""]
[null,132,{"$f":"IF(Results!C135=\"\",\"\",Results!C135)","v":""},{"$f":"IF(Results!D135=\"\",\"\",Results!D135)","v":""},{"$f":"IF(Results!E135=\"\",\"\",Results!E135)","v":""},"",""]
[null,133,{"$f":"IF(Results!C136=\"\",\"\",Results!C136)","v":""},{"$f":"IF(Results!D136=\"\",\"\",Results!D136)","v":""},{"$f":"IF(Results!E136=\"\",\"\",Results!E136)","v":""},"",""]
[null,134,{"$f":"IF(Results!C137=\"\",\"\",Results!C137)","v":""},{"$f":"IF(Results!D137=\"\",\"\",Results!D137)","v":""},{"$f":"IF(Results!E137=\"\",\"\",Results!E137)","v":""},"",""]
[null,135,{"$f":"IF(Results!C138=\"\",\"\",Results!C138)","v":""},{"$f":"IF(Results!D138=\"\",\"\",Results!D138)","v":""},{"$f":"IF(Results!E138=\"\",\"\",Results!E138)","v":""},"",""]
[null,136,{"$f":"IF(Results!C139=\"\",\"\",Results!C139)","v":""},{"$f":"IF(Results!D139=\"\",\"\",Results!D139)","v":""},{"$f":"IF(Results!E139=\"\",\"\",Results!E139)","v":""},"",""]
[null,137,{"$f":"IF(Results!C140=\"\",\"\",Results!C140)","v":""},{"$f":"IF(Results!D140=\"\",\"\",Results!D140)","v":""},{"$f":"IF(Results!E140=\"\",\"\",Results!E140)","v":""},"",""]
[null,138,{"$f":"IF(Results!C141=\"\",\"\",Results!C141)","v":""},{"$f":"IF(Results!D141=\"\",\"\",Results!D141)","v":""},{"$f":"IF(Results!E141=\"\",\"\",Results!E141)","v":""},"",""]
[null,139,{"$f":"IF(Results!C142=\"\",\"\",Results!C142)","v":""},{"$f":"IF(Results!D142=\"\",\"\",Results!D142)","v":""},{"$f":"IF(Results!E142=\"\",\"\",Results!E142)","v":""},"",""]
[null,140,{"$f":"IF(Results!C143=\"\",\"\",Results!C143)","v":""},{"$f":"IF(Results!D143=\"\",\"\",Results!D143)","v":""},{"$f":"IF(Results!E143=\"\",\"\",Results!E143)","v":""},"",""]
[null,141,{"$f":"IF(Results!C144=\"\",\"\",Results!C144)","v":""},{"$f":"IF(Results!D144=\"\",\"\",Results!D144)","v":""},{"$f":"IF(Results!E144=\"\",\"\",Results!E144)","v":""},"",""]
[null,142,{"$f":"IF(Results!C145=\"\",\"\",Results!C145)","v":""},{"$f":"IF(Results!D145=\"\",\"\",Results!D145)","v":""},{"$f":"IF(Results!E145=\"\",\"\",Results!E145)","v":""},"",""]
[null,143,{"$f":"IF(Results!C146=\"\",\"\",Results!C146)","v":""},{"$f":"IF(Results!D146=\"\",\"\",Results!D146)","v":""},{"$f":"IF(Results!E146=\"\",\"\",Results!E146)","v":""},"",""]
[null,144,{"$f":"IF(Results!C147=\"\",\"\",Results!C147)","v":""},{"$f":"IF(Results!D147=\"\",\"\",Results!D147)","v":""},{"$f":"IF(Results!E147=\"\",\"\",Results!E147)","v":""},"",""]
[null,145,{"$f":"IF(Results!C148=\"\",\"\",Results!C148)","v":""},{"$f":"IF(Results!D148=\"\",\"\",Results!D148)","v":""},{"$f":"IF(Results!E148=\"\",\"\",Results!E148)","v":""},"",""]
[null,146,{"$f":"IF(Results!C149=\"\",\"\",Results!C149)","v":""},{"$f":"IF(Results!D149=\"\",\"\",Results!D149)","v":""},{"$f":"IF(Results!E149=\"\",\"\",Results!E149)","v":""},"",""]
[null,147,{"$f":"IF(Results!C150=\"\",\"\",Results!C150)","v":""},{"$f":"IF(Results!D150=\"\",\"\",Results!D150)","v":""},{"$f":"IF(Results!E150=\"\",\"\",Results!E150)","v":""},"",""]
[null,148,{"$f":"IF(Results!C151=\"\",\"\",Results!C151)","v":""},{"$f":"IF(Results!D151=\"\",\"\",Results!D151)","v":""},{"$f":"IF(Results!E151=\"\",\"\",Results!E151)","v":""},"",""]
[null,149,{"$f":"IF(Results!C152=\"\",\"\",Results!C152)","v":""},{"$f":"IF(Results!D152=\"\",\"\",Results!D152)","v":""},{"$f":"IF(Results!E152=\"\",\"\",Results!E152)","v":""},"",""]
[null,150,{"$f":"IF(Results!C153=\"\",\"\",Results!C153)","v":""},{"$f":"IF(Results!D153=\"\",\"\",Results!D153)","v":""},{"$f":"IF(Results!E153=\"\",\"\",Results!E153)","v":""},"",""]
[null,151,{"$f":"IF(Results!C154=\"\",\"\",Results!C154)","v":""},{"$f":"IF(Results!D154=\"\",\"\",Results!D154)","v":""},{"$f":"IF(Results!E154=\"\",\"\",Results!E154)","v":""},"",""]
[null,152,{"$f":"IF(Results!C155=\"\",\"\",Results!C155)","v":""},{"$f":"IF(Results!D155=\"\",\"\",Results!D155)","v":""},{"$f":"IF(Results!E155=\"\",\"\",Results!E155)","v":""},"",""]
[null,153,{"$f":"IF(Results!C156=\"\",\"\",Results!C156)","v":""},{"$f":"IF(Results!D156=\"\",\"\",Results!D156)","v":""},{"$f":"IF(Results!E156=\"\",\"\",Results!E156)","v":""},"",""]
[null,154,{"$f":"IF(Results!C157=\"\",\"\",Results!C157)","v":""},{"$f":"IF(Results!D157=\"\",\"\",Results!D157)","v":""},{"$f":"IF(Results!E157=\"\",\"\",Results!E157)","v":""},"",""]
[null,155,{"$f":"IF(Results!C158=\"\",\"\",Results!C158)","v":""},{"$f":"IF(Results!D158=\"\",\"\",Results!D158)","v":""},{"$f":"IF(Results!E158=\"\",\"\",Results!E158)","v":""},"",""]
[null,156,{"$f":"IF(Results!C159=\"\",\"\",Results!C159)","v":""},{"$f":"IF(Results!D159=\"\",\"\",Results!D159)","v":""},{"$f":"IF(Results!E159=\"\",\"\",Results!E159)","v":""},"",""]
[null,157,{"$f":"IF(Results!C160=\"\",\"\",Results!C160)","v":""},{"$f":"IF(Results!D160=\"\",\"\",Results!D160)","v":""},{"$f":"IF(Results!E160=\"\",\"\",Results!E160)","v":""},"",""]
[null,158,{"$f":"IF(Results!C161=\"\",\"\",Results!C161)","v":""},{"$f":"IF(Results!D161=\"\",\"\",Results!D161)","v":""},{"$f":"IF(Results!E161=\"\",\"\",Results!E161)","v":""},"",""]
[null,159,{"$f":"IF(Results!C162=\"\",\"\",Results!C162)","v":""},{"$f":"IF(Results!D162=\"\",\"\",Results!D162)","v":""},{"$f":"IF(Results!E162=\"\",\"\",Results!E162)","v":""},"",""]
[null,160,{"$f":"IF(Results!C163=\"\",\"\",Results!C163)","v":""},{"$f":"IF(Results!D163=\"\",\"\",Results!D163)","v":""},{"$f":"IF(Results!E163=\"\",\"\",Results!E163)","v":""},"",""]
[null,161,{"$f":"IF(Results!C164=\"\",\"\",Results!C164)","v":""},{"$f":"IF(Results!D164=\"\",\"\",Results!D164)","v":""},{"$f":"IF(Results!E164=\"\",\"\",Results!E164)","v":""},{"$f":"IF(C164=\"\",\"\",SUM(D164:E164))","v":""},{"$f":"IF(F164=\"\",\"\",RANK($F164,$F$4:$F$203))","v":""}]
[null,162,{"$f":"IF(Results!C165=\"\",\"\",Results!C165)","v":""},{"$f":"IF(Results!D165=\"\",\"\",Results!D165)","v":""},{"$f":"IF(Results!E165=\"\",\"\",Results!E165)","v":""},"",""]
[null,163,{"$f":"IF(Results!C166=\"\",\"\",Results!C166)","v":""},{"$f":"IF(Results!D166=\"\",\"\",Results!D166)","v":""},{"$f":"IF(Results!E166=\"\",\"\",Results!E166)","v":""},"",""]
[null,164,{"$f":"IF(Results!C167=\"\",\"\",Results!C167)","v":""},{"$f":"IF(Results!D167=\"\",\"\",Results!D167)","v":""},{"$f":"IF(Results!E167=\"\",\"\",Results!E167)","v":""},"",""]
[null,165,{"$f":"IF(Results!C168=\"\",\"\",Results!C168)","v":""},{"$f":"IF(Results!D168=\"\",\"\",Results!D168)","v":""},{"$f":"IF(Results!E168=\"\",\"\",Results!E168)","v":""},"",""]
[null,166,{"$f":"IF(Results!C169=\"\",\"\",Results!C169)","v":""},{"$f":"IF(Results!D169=\"\",\"\",Results!D169)","v":""},{"$f":"IF(Results!E169=\"\",\"\",Results!E169)","v":""},"",""]
[null,167,{"$f":"IF(Results!C170=\"\",\"\",Results!C170)","v":""},{"$f":"IF(Results!D170=\"\",\"\",Results!D170)","v":""},{"$f":"IF(Results!E170=\"\",\"\",Results!E170)","v":""},"",""]
[null,168,{"$f":"IF(Results!C171=\"\",\"\",Results!C171)","v":""},{"$f":"IF(Results!D171=\"\",\"\",Results!D171)","v":""},{"$f":"IF(Results!E171=\"\",\"\",Results!E171)","v":""},"",""]
[null,169,{"$f":"IF(Results!C172=\"\",\"\",Results!C172)","v":""},{"$f":"IF(Results!D172=\"\",\"\",Results!D172)","v":""},{"$f":"IF(Results!E172=\"\",\"\",Results!E172)","v":""},"",""]
[null,170,{"$f":"IF(Results!C173=\"\",\"\",Results!C173)","v":""},{"$f":"IF(Results!D173=\"\",\"\",Results!D173)","v":""},{"$f":"IF(Results!E173=\"\",\"\",Results!E173)","v":""},"",""]
[null,171,{"$f":"IF(Results!C174=\"\",\"\",Results!C174)","v":""},{"$f":"IF(Results!D174=\"\",\"\",Results!D174)","v":""},{"$f":"IF(Results!E174=\"\",\"\",Results!E174)","v":""},"",""]
[null,172,{"$f":"IF(Results!C175=\"\",\"\",Results!C175)","v":""},{"$f":"IF(Results!D175=\"\",\"\",Results!D175)","v":""},{"$f":"IF(Results!E175=\"\",\"\",Results!E175)","v":""},"",""]
[null,173,{"$f":"IF(Results!C176=\"\",\"\",Results!C176)","v":""},{"$f":"IF(Results!D176=\"\",\"\",Results!D176)","v":""},{"$f":"IF(Results!E176=\"\",\"\",Results!E176)","v":""},"",""]
[null,174,{"$f":"IF(Results!C177=\"\",\"\",Results!C177)","v":""},{"$f":"IF(Results!D177=\"\",\"\",Results!D177)","v":""},{"$f":"IF(Results!E177=\"\",\"\",Results!E177)","v":""},"",""]
[null,175,{"$f":"IF(Results!C178=\"\",\"\",Results!C178)","v":""},{"$f":"IF(Results!D178=\"\",\"\",Results!D178)","v":""},{"$f":"IF(Results!E178=\"\",\"\",Results!E178)","v":""},"",""]
[null,176,{"$f":"IF(Results!C179=\"\",\"\",Results!C179)","v":""},{"$f":"IF(Results!D179=\"\",\"\",Results!D179)","v":""},{"$f":"IF(Results!E179=\"\",\"\",Results!E179)","v":""},"",""]
[null,177,{"$f":"IF(Results!C180=\"\",\"\",Results!C180)","v":""},{"$f":"IF(Results!D180=\"\",\"\",Results!D180)","v":""},{"$f":"IF(Results!E180=\"\",\"\",Results!E180)","v":""},"",""]
[null,178,{"$f":"IF(Results!C181=\"\",\"\",Results!C181)","v":""},{"$f":"IF(Results!D181=\"\",\"\",Results!D181)","v":""},{"$f":"IF(Results!E181=\"\",\"\",Results!E181)","v":""},"",""]
[null,179,{"$f":"IF(Results!C182=\"\",\"\",Results!C182)","v":""},{"$f":"IF(Results!D182=\"\",\"\",Results!D182)","v":""},{"$f":"IF(Results!E182=\"\",\"\",Results!E182)","v":""},"",""]
[null,180,{"$f":"IF(Results!C183=\"\",\"\",Results!C183)","v":""},{"$f":"IF(Results!D183=\"\",\"\",Results!D183)","v":""},{"$f":"IF(Results!E183=\"\",\"\",Results!E183)","v":""},"",""]
[null,181,{"$f":"IF(Results!C184=\"\",\"\",Results!C184)","v":""},{"$f":"IF(Results!D184=\"\",\"\",Results!D184)","v":""},{"$f":"IF(Results!E184=\"\",\"\",Results!E184)","v":""},"",""]
[null,182,{"$f":"IF(Results!C185=\"\",\"\",Results!C185)","v":""},{"$f":"IF(Results!D185=\"\",\"\",Results!D185)","v":""},{"$f":"IF(Results!E185=\"\",\"\",Results!E185)","v":""},"",""]
[null,183,{"$f":"IF(Results!C186=\"\",\"\",Results!C186)","v":""},{"$f":"IF(Results!D186=\"\",\"\",Results!D186)","v":""},{"$f":"IF(Results!E186=\"\",\"\",Results!E186)","v":""},"",""]
[null,184,{"$f":"IF(Results!C187=\"\",\"\",Results!C187)","v":""},{"$f":"IF(Results!D187=\"\",\"\",Results!D187)","v":""},{"$f":"IF(Results!E187=\"\",\"\",Results!E187)","v":""},"",""]
[null,185,{"$f":"IF(Results!C188=\"\",\"\",Results!C188)","v":""},{"$f":"IF(Results!D188=\"\",\"\",Results!D188)","v":""},{"$f":"IF(Results!E188=\"\",\"\",Results!E188)","v":""},"",""]
[null,186,{"$f":"IF(Results!C189=\"\",\"\",Results!C189)","v":""},{"$f":"IF(Results!D189=\"\",\"\",Results!D189)","v":""},{"$f":"IF(Results!E189=\"\",\"\",Results!E189)","v":""},"",""]
[null,187,{"$f":"IF(Results!C190=\"\",\"\",Results!C190)","v":""},{"$f":"IF(Results!D190=\"\",\"\",Results!D190)","v":""},{"$f":"IF(Results!E190=\"\",\"\",Results!E190)","v":""},"",""]
[null,188,{"$f":"IF(Results!C191=\"\",\"\",Results!C191)","v":""},{"$f":"IF(Results!D191=\"\",\"\",Results!D191)","v":""},{"$f":"IF(Results!E191=\"\",\"\",Results!E191)","v":""},"",""]
[null,189,{"$f":"IF(Results!C192=\"\",\"\",Results!C192)","v":""},{"$f":"IF(Results!D192=\"\",\"\",Results!D192)","v":""},{"$f":"IF(Results!E192=\"\",\"\",Results!E192)","v":""},"",""]
[null,190,{"$f":"IF(Results!C193=\"\",\"\",Results!C193)","v":""},{"$f":"IF(Results!D193=\"\",\"\",Results!D193)","v":""},{"$f":"IF(Results!E193=\"\",\"\",Results!E193)","v":""},"",""]
[null,191,{"$f":"IF(Results!C194=\"\",\"\",Results!C194)","v":""},{"$f":"IF(Results!D194=\"\",\"\",Results!D194)","v":""},{"$f":"IF(Results!E194=\"\",\"\",Results!E194)","v":""},"",""]
[null,192,{"$f":"IF(Results!C195=\"\",\"\",Results!C195)","v":""},{"$f":"IF(Results!D195=\"\",\"\",Results!D195)","v":""},{"$f":"IF(Results!E195=\"\",\"\",Results!E195)","v":""},"",""]
[null,193,{"$f":"IF(Results!C196=\"\",\"\",Results!C196)","v":""},{"$f":"IF(Results!D196=\"\",\"\",Results!D196)","v":""},{"$f":"IF(Results!E196=\"\",\"\",Results!E196)","v":""},{"$f":"IF(C196=\"\",\"\",SUM(D196:E196))","v":""},{"$f":"IF(F196=\"\",\"\",RANK($F196,$F$4:$F$203))","v":""}]
[null,194,{"$f":"IF(Results!C197=\"\",\"\",Results!C197)","v":""},{"$f":"IF(Results!D197=\"\",\"\",Results!D197)","v":""},{"$f":"IF(Results!E197=\"\",\"\",Results!E197)","v":""},"",""]
[null,195,{"$f":"IF(Results!C198=\"\",\"\",Results!C198)","v":""},{"$f":"IF(Results!D198=\"\",\"\",Results!D198)","v":""},{"$f":"IF(Results!E198=\"\",\"\",Results!E198)","v":""},"",""]
[null,196,{"$f":"IF(Results!C199=\"\",\"\",Results!C199)","v":""},{"$f":"IF(Results!D199=\"\",\"\",Results!D199)","v":""},{"$f":"IF(Results!E199=\"\",\"\",Results!E199)","v":""},"",""]
[null,197,{"$f":"IF(Results!C200=\"\",\"\",Results!C200)","v":""},{"$f":"IF(Results!D200=\"\",\"\",Results!D200)","v":""},{"$f":"IF(Results!E200=\"\",\"\",Results!E200)","v":""},"",""]
[null,198,{"$f":"IF(Results!C201=\"\",\"\",Results!C201)","v":""},{"$f":"IF(Results!D201=\"\",\"\",Results!D201)","v":""},{"$f":"IF(Results!E201=\"\",\"\",Results!E201)","v":""},"",""]
[null,199,{"$f":"IF(Results!C202=\"\",\"\",Results!C202)","v":""},{"$f":"IF(Results!D202=\"\",\"\",Results!D202)","v":""},{"$f":"IF(Results!E202=\"\",\"\",Results!E202)","v":""},"",""]
[null,200,{"$f":"IF(Results!C203=\"\",\"\",Results!C203)","v":""},{"$f":"IF(Results!D203=\"\",\"\",Results!D203)","v":""},{"$f":"IF(Results!E203=\"\",\"\",Results!E203)","v":""},"",""]

{"sheet":"Final","index":7,"n_rows":203,"n_cols":8,"rows_kept":203,"cut":false,"hidden":false,"merged":[]}
[null,"SORTING ENTRANTS FOR FINAL RANKING"]
[]
[null,"NO","NAME","VISUAL TOTAL","HANDLING SCORE","ORAL SCORE","TOTAL SCORE","RANK"]
[null,2,{"$f":"IF(Results!C5=\"\",\"\",Results!C5)","v":""},{"$f":"IF(Results!D5=\"\",\"\",Results!D5)","v":""},{"$f":"IF(Results!E5=\"\",\"\",Results!E5)","v":""},{"$f":"IF(Results!F5=\"\",\"\",Results!F5)","v":47},{"$f":"IF(D4=\"\",\"\",SUM(D4:F4))","v":""},{"$f":"IF(F4=\"\",\"\",RANK($G4,$G$4:$G$103))","v":{"$error":"#VALUE!"}}]
[null,1,{"$f":"IF(Results!C4=\"\",\"\",Results!C4)","v":""},{"$f":"IF(Results!D4=\"\",\"\",Results!D4)","v":""},{"$f":"IF(Results!E4=\"\",\"\",Results!E4)","v":""},{"$f":"IF(Results!F4=\"\",\"\",Results!F4)","v":49},"",{"$error":"#VALUE!"}]
[null,4,{"$f":"IF(Results!C7=\"\",\"\",Results!C7)","v":""},{"$f":"IF(Results!D7=\"\",\"\",Results!D7)","v":""},{"$f":"IF(Results!E7=\"\",\"\",Results!E7)","v":""},{"$f":"IF(Results!F7=\"\",\"\",Results!F7)","v":44},"",{"$error":"#VALUE!"}]
[null,5,{"$f":"IF(Results!C8=\"\",\"\",Results!C8)","v":""},{"$f":"IF(Results!D8=\"\",\"\",Results!D8)","v":""},{"$f":"IF(Results!E8=\"\",\"\",Results!E8)","v":""},{"$f":"IF(Results!F8=\"\",\"\",Results!F8)","v":35},"",{"$error":"#VALUE!"}]
[null,3,{"$f":"IF(Results!C6=\"\",\"\",Results!C6)","v":""},{"$f":"IF(Results!D6=\"\",\"\",Results!D6)","v":""},{"$f":"IF(Results!E6=\"\",\"\",Results!E6)","v":""},{"$f":"IF(Results!F6=\"\",\"\",Results!F6)","v":38},"",{"$error":"#VALUE!"}]
[null,6,{"$f":"IF(Results!C9=\"\",\"\",Results!C9)","v":""},{"$f":"IF(Results!D9=\"\",\"\",Results!D9)","v":""},{"$f":"IF(Results!E9=\"\",\"\",Results!E9)","v":""},{"$f":"IF(Results!F9=\"\",\"\",Results!F9)","v":""},"",""]
[null,7,{"$f":"IF(Results!C10=\"\",\"\",Results!C10)","v":""},{"$f":"IF(Results!D10=\"\",\"\",Results!D10)","v":""},{"$f":"IF(Results!E10=\"\",\"\",Results!E10)","v":""},{"$f":"IF(Results!F10=\"\",\"\",Results!F10)","v":""},"",""]
[null,8,{"$f":"IF(Results!C11=\"\",\"\",Results!C11)","v":""},{"$f":"IF(Results!D11=\"\",\"\",Results!D11)","v":""},{"$f":"IF(Results!E11=\"\",\"\",Results!E11)","v":""},{"$f":"IF(Results!F11=\"\",\"\",Results!F11)","v":""},"",""]
[null,9,{"$f":"IF(Results!C12=\"\",\"\",Results!C12)","v":""},{"$f":"IF(Results!D12=\"\",\"\",Results!D12)","v":""},{"$f":"IF(Results!E12=\"\",\"\",Results!E12)","v":""},{"$f":"IF(Results!F12=\"\",\"\",Results!F12)","v":""},"",""]
[null,10,{"$f":"IF(Results!C13=\"\",\"\",Results!C13)","v":""},{"$f":"IF(Results!D13=\"\",\"\",Results!D13)","v":""},{"$f":"IF(Results!E13=\"\",\"\",Results!E13)","v":""},{"$f":"IF(Results!F13=\"\",\"\",Results!F13)","v":""},"",""]
[null,11,{"$f":"IF(Results!C14=\"\",\"\",Results!C14)","v":""},{"$f":"IF(Results!D14=\"\",\"\",Results!D14)","v":""},{"$f":"IF(Results!E14=\"\",\"\",Results!E14)","v":""},{"$f":"IF(Results!F14=\"\",\"\",Results!F14)","v":""},"",""]
[null,12,{"$f":"IF(Results!C15=\"\",\"\",Results!C15)","v":""},{"$f":"IF(Results!D15=\"\",\"\",Results!D15)","v":""},{"$f":"IF(Results!E15=\"\",\"\",Results!E15)","v":""},{"$f":"IF(Results!F15=\"\",\"\",Results!F15)","v":""},"",""]
[null,13,{"$f":"IF(Results!C16=\"\",\"\",Results!C16)","v":""},{"$f":"IF(Results!D16=\"\",\"\",Results!D16)","v":""},{"$f":"IF(Results!E16=\"\",\"\",Results!E16)","v":""},{"$f":"IF(Results!F16=\"\",\"\",Results!F16)","v":""},"",""]
[null,14,{"$f":"IF(Results!C17=\"\",\"\",Results!C17)","v":""},{"$f":"IF(Results!D17=\"\",\"\",Results!D17)","v":""},{"$f":"IF(Results!E17=\"\",\"\",Results!E17)","v":""},{"$f":"IF(Results!F17=\"\",\"\",Results!F17)","v":""},"",""]
[null,15,{"$f":"IF(Results!C18=\"\",\"\",Results!C18)","v":""},{"$f":"IF(Results!D18=\"\",\"\",Results!D18)","v":""},{"$f":"IF(Results!E18=\"\",\"\",Results!E18)","v":""},{"$f":"IF(Results!F18=\"\",\"\",Results!F18)","v":""},"",""]
[null,16,{"$f":"IF(Results!C19=\"\",\"\",Results!C19)","v":""},{"$f":"IF(Results!D19=\"\",\"\",Results!D19)","v":""},{"$f":"IF(Results!E19=\"\",\"\",Results!E19)","v":""},{"$f":"IF(Results!F19=\"\",\"\",Results!F19)","v":""},"",""]
[null,17,{"$f":"IF(Results!C20=\"\",\"\",Results!C20)","v":""},{"$f":"IF(Results!D20=\"\",\"\",Results!D20)","v":""},{"$f":"IF(Results!E20=\"\",\"\",Results!E20)","v":""},{"$f":"IF(Results!F20=\"\",\"\",Results!F20)","v":""},"",""]
[null,18,{"$f":"IF(Results!C21=\"\",\"\",Results!C21)","v":""},{"$f":"IF(Results!D21=\"\",\"\",Results!D21)","v":""},{"$f":"IF(Results!E21=\"\",\"\",Results!E21)","v":""},{"$f":"IF(Results!F21=\"\",\"\",Results!F21)","v":""},"",""]
[null,19,{"$f":"IF(Results!C22=\"\",\"\",Results!C22)","v":""},{"$f":"IF(Results!D22=\"\",\"\",Results!D22)","v":""},{"$f":"IF(Results!E22=\"\",\"\",Results!E22)","v":""},{"$f":"IF(Results!F22=\"\",\"\",Results!F22)","v":""},"",""]
[null,20,{"$f":"IF(Results!C23=\"\",\"\",Results!C23)","v":""},{"$f":"IF(Results!D23=\"\",\"\",Results!D23)","v":""},{"$f":"IF(Results!E23=\"\",\"\",Results!E23)","v":""},{"$f":"IF(Results!F23=\"\",\"\",Results!F23)","v":""},"",""]
[null,21,{"$f":"IF(Results!C24=\"\",\"\",Results!C24)","v":""},{"$f":"IF(Results!D24=\"\",\"\",Results!D24)","v":""},{"$f":"IF(Results!E24=\"\",\"\",Results!E24)","v":""},{"$f":"IF(Results!F24=\"\",\"\",Results!F24)","v":""},"",""]
[null,22,{"$f":"IF(Results!C25=\"\",\"\",Results!C25)","v":""},{"$f":"IF(Results!D25=\"\",\"\",Results!D25)","v":""},{"$f":"IF(Results!E25=\"\",\"\",Results!E25)","v":""},{"$f":"IF(Results!F25=\"\",\"\",Results!F25)","v":""},"",""]
[null,23,{"$f":"IF(Results!C26=\"\",\"\",Results!C26)","v":""},{"$f":"IF(Results!D26=\"\",\"\",Results!D26)","v":""},{"$f":"IF(Results!E26=\"\",\"\",Results!E26)","v":""},{"$f":"IF(Results!F26=\"\",\"\",Results!F26)","v":""},"",""]
[null,24,{"$f":"IF(Results!C27=\"\",\"\",Results!C27)","v":""},{"$f":"IF(Results!D27=\"\",\"\",Results!D27)","v":""},{"$f":"IF(Results!E27=\"\",\"\",Results!E27)","v":""},{"$f":"IF(Results!F27=\"\",\"\",Results!F27)","v":""},"",""]
[null,25,{"$f":"IF(Results!C28=\"\",\"\",Results!C28)","v":""},{"$f":"IF(Results!D28=\"\",\"\",Results!D28)","v":""},{"$f":"IF(Results!E28=\"\",\"\",Results!E28)","v":""},{"$f":"IF(Results!F28=\"\",\"\",Results!F28)","v":""},"",""]
[null,26,{"$f":"IF(Results!C29=\"\",\"\",Results!C29)","v":""},{"$f":"IF(Results!D29=\"\",\"\",Results!D29)","v":""},{"$f":"IF(Results!E29=\"\",\"\",Results!E29)","v":""},{"$f":"IF(Results!F29=\"\",\"\",Results!F29)","v":""},"",""]
[null,27,{"$f":"IF(Results!C30=\"\",\"\",Results!C30)","v":""},{"$f":"IF(Results!D30=\"\",\"\",Results!D30)","v":""},{"$f":"IF(Results!E30=\"\",\"\",Results!E30)","v":""},{"$f":"IF(Results!F30=\"\",\"\",Results!F30)","v":""},"",""]
[null,28,{"$f":"IF(Results!C31=\"\",\"\",Results!C31)","v":""},{"$f":"IF(Results!D31=\"\",\"\",Results!D31)","v":""},{"$f":"IF(Results!E31=\"\",\"\",Results!E31)","v":""},{"$f":"IF(Results!F31=\"\",\"\",Results!F31)","v":""},"",""]
[null,29,{"$f":"IF(Results!C32=\"\",\"\",Results!C32)","v":""},{"$f":"IF(Results!D32=\"\",\"\",Results!D32)","v":""},{"$f":"IF(Results!E32=\"\",\"\",Results!E32)","v":""},{"$f":"IF(Results!F32=\"\",\"\",Results!F32)","v":""},"",""]
[null,30,{"$f":"IF(Results!C33=\"\",\"\",Results!C33)","v":""},{"$f":"IF(Results!D33=\"\",\"\",Results!D33)","v":""},{"$f":"IF(Results!E33=\"\",\"\",Results!E33)","v":""},{"$f":"IF(Results!F33=\"\",\"\",Results!F33)","v":""},"",""]
[null,31,{"$f":"IF(Results!C34=\"\",\"\",Results!C34)","v":""},{"$f":"IF(Results!D34=\"\",\"\",Results!D34)","v":""},{"$f":"IF(Results!E34=\"\",\"\",Results!E34)","v":""},{"$f":"IF(Results!F34=\"\",\"\",Results!F34)","v":""},"",""]
[null,32,{"$f":"IF(Results!C35=\"\",\"\",Results!C35)","v":""},{"$f":"IF(Results!D35=\"\",\"\",Results!D35)","v":""},{"$f":"IF(Results!E35=\"\",\"\",Results!E35)","v":""},{"$f":"IF(Results!F35=\"\",\"\",Results!F35)","v":""},"",""]
[null,33,{"$f":"IF(Results!C36=\"\",\"\",Results!C36)","v":""},{"$f":"IF(Results!D36=\"\",\"\",Results!D36)","v":""},{"$f":"IF(Results!E36=\"\",\"\",Results!E36)","v":""},{"$f":"IF(Results!F36=\"\",\"\",Results!F36)","v":""},{"$f":"IF(D36=\"\",\"\",SUM(D36:F36))","v":""},{"$f":"IF(F36=\"\",\"\",RANK($G36,$G$4:$G$103))","v":""}]
[null,34,{"$f":"IF(Results!C37=\"\",\"\",Results!C37)","v":""},{"$f":"IF(Results!D37=\"\",\"\",Results!D37)","v":""},{"$f":"IF(Results!E37=\"\",\"\",Results!E37)","v":""},{"$f":"IF(Results!F37=\"\",\"\",Results!F37)","v":""},"",""]
[null,35,{"$f":"IF(Results!C38=\"\",\"\",Results!C38)","v":""},{"$f":"IF(Results!D38=\"\",\"\",Results!D38)","v":""},{"$f":"IF(Results!E38=\"\",\"\",Results!E38)","v":""},{"$f":"IF(Results!F38=\"\",\"\",Results!F38)","v":""},"",""]
[null,36,{"$f":"IF(Results!C39=\"\",\"\",Results!C39)","v":""},{"$f":"IF(Results!D39=\"\",\"\",Results!D39)","v":""},{"$f":"IF(Results!E39=\"\",\"\",Results!E39)","v":""},{"$f":"IF(Results!F39=\"\",\"\",Results!F39)","v":""},"",""]
[null,37,{"$f":"IF(Results!C40=\"\",\"\",Results!C40)","v":""},{"$f":"IF(Results!D40=\"\",\"\",Results!D40)","v":""},{"$f":"IF(Results!E40=\"\",\"\",Results!E40)","v":""},{"$f":"IF(Results!F40=\"\",\"\",Results!F40)","v":""},"",""]
[null,38,{"$f":"IF(Results!C41=\"\",\"\",Results!C41)","v":""},{"$f":"IF(Results!D41=\"\",\"\",Results!D41)","v":""},{"$f":"IF(Results!E41=\"\",\"\",Results!E41)","v":""},{"$f":"IF(Results!F41=\"\",\"\",Results!F41)","v":""},"",""]
[null,39,{"$f":"IF(Results!C42=\"\",\"\",Results!C42)","v":""},{"$f":"IF(Results!D42=\"\",\"\",Results!D42)","v":""},{"$f":"IF(Results!E42=\"\",\"\",Results!E42)","v":""},{"$f":"IF(Results!F42=\"\",\"\",Results!F42)","v":""},"",""]
[null,40,{"$f":"IF(Results!C43=\"\",\"\",Results!C43)","v":""},{"$f":"IF(Results!D43=\"\",\"\",Results!D43)","v":""},{"$f":"IF(Results!E43=\"\",\"\",Results!E43)","v":""},{"$f":"IF(Results!F43=\"\",\"\",Results!F43)","v":""},"",""]
[null,41,{"$f":"IF(Results!C44=\"\",\"\",Results!C44)","v":""},{"$f":"IF(Results!D44=\"\",\"\",Results!D44)","v":""},{"$f":"IF(Results!E44=\"\",\"\",Results!E44)","v":""},{"$f":"IF(Results!F44=\"\",\"\",Results!F44)","v":""},"",""]
[null,42,{"$f":"IF(Results!C45=\"\",\"\",Results!C45)","v":""},{"$f":"IF(Results!D45=\"\",\"\",Results!D45)","v":""},{"$f":"IF(Results!E45=\"\",\"\",Results!E45)","v":""},{"$f":"IF(Results!F45=\"\",\"\",Results!F45)","v":""},"",""]
[null,43,{"$f":"IF(Results!C46=\"\",\"\",Results!C46)","v":""},{"$f":"IF(Results!D46=\"\",\"\",Results!D46)","v":""},{"$f":"IF(Results!E46=\"\",\"\",Results!E46)","v":""},{"$f":"IF(Results!F46=\"\",\"\",Results!F46)","v":""},"",""]
[null,44,{"$f":"IF(Results!C47=\"\",\"\",Results!C47)","v":""},{"$f":"IF(Results!D47=\"\",\"\",Results!D47)","v":""},{"$f":"IF(Results!E47=\"\",\"\",Results!E47)","v":""},{"$f":"IF(Results!F47=\"\",\"\",Results!F47)","v":""},"",""]
[null,45,{"$f":"IF(Results!C48=\"\",\"\",Results!C48)","v":""},{"$f":"IF(Results!D48=\"\",\"\",Results!D48)","v":""},{"$f":"IF(Results!E48=\"\",\"\",Results!E48)","v":""},{"$f":"IF(Results!F48=\"\",\"\",Results!F48)","v":""},"",""]
[null,46,{"$f":"IF(Results!C49=\"\",\"\",Results!C49)","v":""},{"$f":"IF(Results!D49=\"\",\"\",Results!D49)","v":""},{"$f":"IF(Results!E49=\"\",\"\",Results!E49)","v":""},{"$f":"IF(Results!F49=\"\",\"\",Results!F49)","v":""},"",""]
[null,47,{"$f":"IF(Results!C50=\"\",\"\",Results!C50)","v":""},{"$f":"IF(Results!D50=\"\",\"\",Results!D50)","v":""},{"$f":"IF(Results!E50=\"\",\"\",Results!E50)","v":""},{"$f":"IF(Results!F50=\"\",\"\",Results!F50)","v":""},"",""]
[null,48,{"$f":"IF(Results!C51=\"\",\"\",Results!C51)","v":""},{"$f":"IF(Results!D51=\"\",\"\",Results!D51)","v":""},{"$f":"IF(Results!E51=\"\",\"\",Results!E51)","v":""},{"$f":"IF(Results!F51=\"\",\"\",Results!F51)","v":""},"",""]
[null,49,{"$f":"IF(Results!C52=\"\",\"\",Results!C52)","v":""},{"$f":"IF(Results!D52=\"\",\"\",Results!D52)","v":""},{"$f":"IF(Results!E52=\"\",\"\",Results!E52)","v":""},{"$f":"IF(Results!F52=\"\",\"\",Results!F52)","v":""},"",""]
[null,50,{"$f":"IF(Results!C53=\"\",\"\",Results!C53)","v":""},{"$f":"IF(Results!D53=\"\",\"\",Results!D53)","v":""},{"$f":"IF(Results!E53=\"\",\"\",Results!E53)","v":""},{"$f":"IF(Results!F53=\"\",\"\",Results!F53)","v":""},"",""]
[null,51,{"$f":"IF(Results!C54=\"\",\"\",Results!C54)","v":""},{"$f":"IF(Results!D54=\"\",\"\",Results!D54)","v":""},{"$f":"IF(Results!E54=\"\",\"\",Results!E54)","v":""},{"$f":"IF(Results!F54=\"\",\"\",Results!F54)","v":""},"",""]
[null,52,{"$f":"IF(Results!C55=\"\",\"\",Results!C55)","v":""},{"$f":"IF(Results!D55=\"\",\"\",Results!D55)","v":""},{"$f":"IF(Results!E55=\"\",\"\",Results!E55)","v":""},{"$f":"IF(Results!F55=\"\",\"\",Results!F55)","v":""},"",""]
[null,53,{"$f":"IF(Results!C56=\"\",\"\",Results!C56)","v":""},{"$f":"IF(Results!D56=\"\",\"\",Results!D56)","v":""},{"$f":"IF(Results!E56=\"\",\"\",Results!E56)","v":""},{"$f":"IF(Results!F56=\"\",\"\",Results!F56)","v":""},"",""]
[null,54,{"$f":"IF(Results!C57=\"\",\"\",Results!C57)","v":""},{"$f":"IF(Results!D57=\"\",\"\",Results!D57)","v":""},{"$f":"IF(Results!E57=\"\",\"\",Results!E57)","v":""},{"$f":"IF(Results!F57=\"\",\"\",Results!F57)","v":""},"",""]
[null,55,{"$f":"IF(Results!C58=\"\",\"\",Results!C58)","v":""},{"$f":"IF(Results!D58=\"\",\"\",Results!D58)","v":""},{"$f":"IF(Results!E58=\"\",\"\",Results!E58)","v":""},{"$f":"IF(Results!F58=\"\",\"\",Results!F58)","v":""},"",""]
[null,56,{"$f":"IF(Results!C59=\"\",\"\",Results!C59)","v":""},{"$f":"IF(Results!D59=\"\",\"\",Results!D59)","v":""},{"$f":"IF(Results!E59=\"\",\"\",Results!E59)","v":""},{"$f":"IF(Results!F59=\"\",\"\",Results!F59)","v":""},"",""]
[null,57,{"$f":"IF(Results!C60=\"\",\"\",Results!C60)","v":""},{"$f":"IF(Results!D60=\"\",\"\",Results!D60)","v":""},{"$f":"IF(Results!E60=\"\",\"\",Results!E60)","v":""},{"$f":"IF(Results!F60=\"\",\"\",Results!F60)","v":""},"",""]
[null,58,{"$f":"IF(Results!C61=\"\",\"\",Results!C61)","v":""},{"$f":"IF(Results!D61=\"\",\"\",Results!D61)","v":""},{"$f":"IF(Results!E61=\"\",\"\",Results!E61)","v":""},{"$f":"IF(Results!F61=\"\",\"\",Results!F61)","v":""},"",""]
[null,59,{"$f":"IF(Results!C62=\"\",\"\",Results!C62)","v":""},{"$f":"IF(Results!D62=\"\",\"\",Results!D62)","v":""},{"$f":"IF(Results!E62=\"\",\"\",Results!E62)","v":""},{"$f":"IF(Results!F62=\"\",\"\",Results!F62)","v":""},"",""]
[null,60,{"$f":"IF(Results!C63=\"\",\"\",Results!C63)","v":""},{"$f":"IF(Results!D63=\"\",\"\",Results!D63)","v":""},{"$f":"IF(Results!E63=\"\",\"\",Results!E63)","v":""},{"$f":"IF(Results!F63=\"\",\"\",Results!F63)","v":""},"",""]
[null,61,{"$f":"IF(Results!C64=\"\",\"\",Results!C64)","v":""},{"$f":"IF(Results!D64=\"\",\"\",Results!D64)","v":""},{"$f":"IF(Results!E64=\"\",\"\",Results!E64)","v":""},{"$f":"IF(Results!F64=\"\",\"\",Results!F64)","v":""},"",""]
[null,62,{"$f":"IF(Results!C65=\"\",\"\",Results!C65)","v":""},{"$f":"IF(Results!D65=\"\",\"\",Results!D65)","v":""},{"$f":"IF(Results!E65=\"\",\"\",Results!E65)","v":""},{"$f":"IF(Results!F65=\"\",\"\",Results!F65)","v":""},"",""]
[null,63,{"$f":"IF(Results!C66=\"\",\"\",Results!C66)","v":""},{"$f":"IF(Results!D66=\"\",\"\",Results!D66)","v":""},{"$f":"IF(Results!E66=\"\",\"\",Results!E66)","v":""},{"$f":"IF(Results!F66=\"\",\"\",Results!F66)","v":""},"",""]
[null,64,{"$f":"IF(Results!C67=\"\",\"\",Results!C67)","v":""},{"$f":"IF(Results!D67=\"\",\"\",Results!D67)","v":""},{"$f":"IF(Results!E67=\"\",\"\",Results!E67)","v":""},{"$f":"IF(Results!F67=\"\",\"\",Results!F67)","v":""},"",""]
[null,65,{"$f":"IF(Results!C68=\"\",\"\",Results!C68)","v":""},{"$f":"IF(Results!D68=\"\",\"\",Results!D68)","v":""},{"$f":"IF(Results!E68=\"\",\"\",Results!E68)","v":""},{"$f":"IF(Results!F68=\"\",\"\",Results!F68)","v":""},{"$f":"IF(D68=\"\",\"\",SUM(D68:F68))","v":""},{"$f":"IF(F68=\"\",\"\",RANK($G68,$G$4:$G$103))","v":""}]
[null,66,{"$f":"IF(Results!C69=\"\",\"\",Results!C69)","v":""},{"$f":"IF(Results!D69=\"\",\"\",Results!D69)","v":""},{"$f":"IF(Results!E69=\"\",\"\",Results!E69)","v":""},{"$f":"IF(Results!F69=\"\",\"\",Results!F69)","v":""},"",""]
[null,67,{"$f":"IF(Results!C70=\"\",\"\",Results!C70)","v":""},{"$f":"IF(Results!D70=\"\",\"\",Results!D70)","v":""},{"$f":"IF(Results!E70=\"\",\"\",Results!E70)","v":""},{"$f":"IF(Results!F70=\"\",\"\",Results!F70)","v":""},"",""]
[null,68,{"$f":"IF(Results!C71=\"\",\"\",Results!C71)","v":""},{"$f":"IF(Results!D71=\"\",\"\",Results!D71)","v":""},{"$f":"IF(Results!E71=\"\",\"\",Results!E71)","v":""},{"$f":"IF(Results!F71=\"\",\"\",Results!F71)","v":""},"",""]
[null,69,{"$f":"IF(Results!C72=\"\",\"\",Results!C72)","v":""},{"$f":"IF(Results!D72=\"\",\"\",Results!D72)","v":""},{"$f":"IF(Results!E72=\"\",\"\",Results!E72)","v":""},{"$f":"IF(Results!F72=\"\",\"\",Results!F72)","v":""},"",""]
[null,70,{"$f":"IF(Results!C73=\"\",\"\",Results!C73)","v":""},{"$f":"IF(Results!D73=\"\",\"\",Results!D73)","v":""},{"$f":"IF(Results!E73=\"\",\"\",Results!E73)","v":""},{"$f":"IF(Results!F73=\"\",\"\",Results!F73)","v":""},"",""]
[null,71,{"$f":"IF(Results!C74=\"\",\"\",Results!C74)","v":""},{"$f":"IF(Results!D74=\"\",\"\",Results!D74)","v":""},{"$f":"IF(Results!E74=\"\",\"\",Results!E74)","v":""},{"$f":"IF(Results!F74=\"\",\"\",Results!F74)","v":""},"",""]
[null,72,{"$f":"IF(Results!C75=\"\",\"\",Results!C75)","v":""},{"$f":"IF(Results!D75=\"\",\"\",Results!D75)","v":""},{"$f":"IF(Results!E75=\"\",\"\",Results!E75)","v":""},{"$f":"IF(Results!F75=\"\",\"\",Results!F75)","v":""},"",""]
[null,73,{"$f":"IF(Results!C76=\"\",\"\",Results!C76)","v":""},{"$f":"IF(Results!D76=\"\",\"\",Results!D76)","v":""},{"$f":"IF(Results!E76=\"\",\"\",Results!E76)","v":""},{"$f":"IF(Results!F76=\"\",\"\",Results!F76)","v":""},"",""]
[null,74,{"$f":"IF(Results!C77=\"\",\"\",Results!C77)","v":""},{"$f":"IF(Results!D77=\"\",\"\",Results!D77)","v":""},{"$f":"IF(Results!E77=\"\",\"\",Results!E77)","v":""},{"$f":"IF(Results!F77=\"\",\"\",Results!F77)","v":""},"",""]
[null,75,{"$f":"IF(Results!C78=\"\",\"\",Results!C78)","v":""},{"$f":"IF(Results!D78=\"\",\"\",Results!D78)","v":""},{"$f":"IF(Results!E78=\"\",\"\",Results!E78)","v":""},{"$f":"IF(Results!F78=\"\",\"\",Results!F78)","v":""},"",""]
[null,76,{"$f":"IF(Results!C79=\"\",\"\",Results!C79)","v":""},{"$f":"IF(Results!D79=\"\",\"\",Results!D79)","v":""},{"$f":"IF(Results!E79=\"\",\"\",Results!E79)","v":""},{"$f":"IF(Results!F79=\"\",\"\",Results!F79)","v":""},"",""]
[null,77,{"$f":"IF(Results!C80=\"\",\"\",Results!C80)","v":""},{"$f":"IF(Results!D80=\"\",\"\",Results!D80)","v":""},{"$f":"IF(Results!E80=\"\",\"\",Results!E80)","v":""},{"$f":"IF(Results!F80=\"\",\"\",Results!F80)","v":""},"",""]
[null,78,{"$f":"IF(Results!C81=\"\",\"\",Results!C81)","v":""},{"$f":"IF(Results!D81=\"\",\"\",Results!D81)","v":""},{"$f":"IF(Results!E81=\"\",\"\",Results!E81)","v":""},{"$f":"IF(Results!F81=\"\",\"\",Results!F81)","v":""},"",""]
[null,79,{"$f":"IF(Results!C82=\"\",\"\",Results!C82)","v":""},{"$f":"IF(Results!D82=\"\",\"\",Results!D82)","v":""},{"$f":"IF(Results!E82=\"\",\"\",Results!E82)","v":""},{"$f":"IF(Results!F82=\"\",\"\",Results!F82)","v":""},"",""]
[null,80,{"$f":"IF(Results!C83=\"\",\"\",Results!C83)","v":""},{"$f":"IF(Results!D83=\"\",\"\",Results!D83)","v":""},{"$f":"IF(Results!E83=\"\",\"\",Results!E83)","v":""},{"$f":"IF(Results!F83=\"\",\"\",Results!F83)","v":""},"",""]
[null,81,{"$f":"IF(Results!C84=\"\",\"\",Results!C84)","v":""},{"$f":"IF(Results!D84=\"\",\"\",Results!D84)","v":""},{"$f":"IF(Results!E84=\"\",\"\",Results!E84)","v":""},{"$f":"IF(Results!F84=\"\",\"\",Results!F84)","v":""},"",""]
[null,82,{"$f":"IF(Results!C85=\"\",\"\",Results!C85)","v":""},{"$f":"IF(Results!D85=\"\",\"\",Results!D85)","v":""},{"$f":"IF(Results!E85=\"\",\"\",Results!E85)","v":""},{"$f":"IF(Results!F85=\"\",\"\",Results!F85)","v":""},"",""]
[null,83,{"$f":"IF(Results!C86=\"\",\"\",Results!C86)","v":""},{"$f":"IF(Results!D86=\"\",\"\",Results!D86)","v":""},{"$f":"IF(Results!E86=\"\",\"\",Results!E86)","v":""},{"$f":"IF(Results!F86=\"\",\"\",Results!F86)","v":""},"",""]
[null,84,{"$f":"IF(Results!C87=\"\",\"\",Results!C87)","v":""},{"$f":"IF(Results!D87=\"\",\"\",Results!D87)","v":""},{"$f":"IF(Results!E87=\"\",\"\",Results!E87)","v":""},{"$f":"IF(Results!F87=\"\",\"\",Results!F87)","v":""},"",""]
[null,85,{"$f":"IF(Results!C88=\"\",\"\",Results!C88)","v":""},{"$f":"IF(Results!D88=\"\",\"\",Results!D88)","v":""},{"$f":"IF(Results!E88=\"\",\"\",Results!E88)","v":""},{"$f":"IF(Results!F88=\"\",\"\",Results!F88)","v":""},"",""]
[null,86,{"$f":"IF(Results!C89=\"\",\"\",Results!C89)","v":""},{"$f":"IF(Results!D89=\"\",\"\",Results!D89)","v":""},{"$f":"IF(Results!E89=\"\",\"\",Results!E89)","v":""},{"$f":"IF(Results!F89=\"\",\"\",Results!F89)","v":""},"",""]
[null,87,{"$f":"IF(Results!C90=\"\",\"\",Results!C90)","v":""},{"$f":"IF(Results!D90=\"\",\"\",Results!D90)","v":""},{"$f":"IF(Results!E90=\"\",\"\",Results!E90)","v":""},{"$f":"IF(Results!F90=\"\",\"\",Results!F90)","v":""},"",""]
[null,88,{"$f":"IF(Results!C91=\"\",\"\",Results!C91)","v":""},{"$f":"IF(Results!D91=\"\",\"\",Results!D91)","v":""},{"$f":"IF(Results!E91=\"\",\"\",Results!E91)","v":""},{"$f":"IF(Results!F91=\"\",\"\",Results!F91)","v":""},"",""]
[null,89,{"$f":"IF(Results!C92=\"\",\"\",Results!C92)","v":""},{"$f":"IF(Results!D92=\"\",\"\",Results!D92)","v":""},{"$f":"IF(Results!E92=\"\",\"\",Results!E92)","v":""},{"$f":"IF(Results!F92=\"\",\"\",Results!F92)","v":""},"",""]
[null,90,{"$f":"IF(Results!C93=\"\",\"\",Results!C93)","v":""},{"$f":"IF(Results!D93=\"\",\"\",Results!D93)","v":""},{"$f":"IF(Results!E93=\"\",\"\",Results!E93)","v":""},{"$f":"IF(Results!F93=\"\",\"\",Results!F93)","v":""},"",""]
[null,91,{"$f":"IF(Results!C94=\"\",\"\",Results!C94)","v":""},{"$f":"IF(Results!D94=\"\",\"\",Results!D94)","v":""},{"$f":"IF(Results!E94=\"\",\"\",Results!E94)","v":""},{"$f":"IF(Results!F94=\"\",\"\",Results!F94)","v":""},"",""]
[null,92,{"$f":"IF(Results!C95=\"\",\"\",Results!C95)","v":""},{"$f":"IF(Results!D95=\"\",\"\",Results!D95)","v":""},{"$f":"IF(Results!E95=\"\",\"\",Results!E95)","v":""},{"$f":"IF(Results!F95=\"\",\"\",Results!F95)","v":""},"",""]
[null,93,{"$f":"IF(Results!C96=\"\",\"\",Results!C96)","v":""},{"$f":"IF(Results!D96=\"\",\"\",Results!D96)","v":""},{"$f":"IF(Results!E96=\"\",\"\",Results!E96)","v":""},{"$f":"IF(Results!F96=\"\",\"\",Results!F96)","v":""},"",""]
[null,94,{"$f":"IF(Results!C97=\"\",\"\",Results!C97)","v":""},{"$f":"IF(Results!D97=\"\",\"\",Results!D97)","v":""},{"$f":"IF(Results!E97=\"\",\"\",Results!E97)","v":""},{"$f":"IF(Results!F97=\"\",\"\",Results!F97)","v":""},"",""]
[null,95,{"$f":"IF(Results!C98=\"\",\"\",Results!C98)","v":""},{"$f":"IF(Results!D98=\"\",\"\",Results!D98)","v":""},{"$f":"IF(Results!E98=\"\",\"\",Results!E98)","v":""},{"$f":"IF(Results!F98=\"\",\"\",Results!F98)","v":""},"",""]
[null,96,{"$f":"IF(Results!C99=\"\",\"\",Results!C99)","v":""},{"$f":"IF(Results!D99=\"\",\"\",Results!D99)","v":""},{"$f":"IF(Results!E99=\"\",\"\",Results!E99)","v":""},{"$f":"IF(Results!F99=\"\",\"\",Results!F99)","v":""},"",""]
[null,97,{"$f":"IF(Results!C100=\"\",\"\",Results!C100)","v":""},{"$f":"IF(Results!D100=\"\",\"\",Results!D100)","v":""},{"$f":"IF(Results!E100=\"\",\"\",Results!E100)","v":""},{"$f":"IF(Results!F100=\"\",\"\",Results!F100)","v":""},{"$f":"IF(D100=\"\",\"\",SUM(D100:F100))","v":""},{"$f":"IF(F100=\"\",\"\",RANK($G100,$G$4:$G$103))","v":""}]
[null,98,{"$f":"IF(Results!C101=\"\",\"\",Results!C101)","v":""},{"$f":"IF(Results!D101=\"\",\"\",Results!D101)","v":""},{"$f":"IF(Results!E101=\"\",\"\",Results!E101)","v":""},{"$f":"IF(Results!F101=\"\",\"\",Results!F101)","v":""},"",""]
[null,99,{"$f":"IF(Results!C102=\"\",\"\",Results!C102)","v":""},{"$f":"IF(Results!D102=\"\",\"\",Results!D102)","v":""},{"$f":"IF(Results!E102=\"\",\"\",Results!E102)","v":""},{"$f":"IF(Results!F102=\"\",\"\",Results!F102)","v":""},"",""]
[null,100,{"$f":"IF(Results!C103=\"\",\"\",Results!C103)","v":""},{"$f":"IF(Results!D103=\"\",\"\",Results!D103)","v":""},{"$f":"IF(Results!E103=\"\",\"\",Results!E103)","v":""},{"$f":"IF(Results!F103=\"\",\"\",Results!F103)","v":""},"",""]
[null,101,{"$f":"IF(Results!C104=\"\",\"\",Results!C104)","v":""},{"$f":"IF(Results!D104=\"\",\"\",Results!D104)","v":""},{"$f":"IF(Results!E104=\"\",\"\",Results!E104)","v":""},{"$f":"IF(Results!F104=\"\",\"\",Results!F104)","v":""},"",""]
[null,102,{"$f":"IF(Results!C105=\"\",\"\",Results!C105)","v":""},{"$f":"IF(Results!D105=\"\",\"\",Results!D105)","v":""},{"$f":"IF(Results!E105=\"\",\"\",Results!E105)","v":""},{"$f":"IF(Results!F105=\"\",\"\",Results!F105)","v":""},"",""]
[null,103,{"$f":"IF(Results!C106=\"\",\"\",Results!C106)","v":""},{"$f":"IF(Results!D106=\"\",\"\",Results!D106)","v":""},{"$f":"IF(Results!E106=\"\",\"\",Results!E106)","v":""},{"$f":"IF(Results!F106=\"\",\"\",Results!F106)","v":""},"",""]
[null,104,{"$f":"IF(Results!C107=\"\",\"\",Results!C107)","v":""},{"$f":"IF(Results!D107=\"\",\"\",Results!D107)","v":""},{"$f":"IF(Results!E107=\"\",\"\",Results!E107)","v":""},{"$f":"IF(Results!F107=\"\",\"\",Results!F107)","v":""},"",""]
[null,105,{"$f":"IF(Results!C108=\"\",\"\",Results!C108)","v":""},{"$f":"IF(Results!D108=\"\",\"\",Results!D108)","v":""},{"$f":"IF(Results!E108=\"\",\"\",Results!E108)","v":""},{"$f":"IF(Results!F108=\"\",\"\",Results!F108)","v":""},"",""]
[null,106,{"$f":"IF(Results!C109=\"\",\"\",Results!C109)","v":""},{"$f":"IF(Results!D109=\"\",\"\",Results!D109)","v":""},{"$f":"IF(Results!E109=\"\",\"\",Results!E109)","v":""},{"$f":"IF(Results!F109=\"\",\"\",Results!F109)","v":""},"",""]
[null,107,{"$f":"IF(Results!C110=\"\",\"\",Results!C110)","v":""},{"$f":"IF(Results!D110=\"\",\"\",Results!D110)","v":""},{"$f":"IF(Results!E110=\"\",\"\",Results!E110)","v":""},{"$f":"IF(Results!F110=\"\",\"\",Results!F110)","v":""},"",""]
[null,108,{"$f":"IF(Results!C111=\"\",\"\",Results!C111)","v":""},{"$f":"IF(Results!D111=\"\",\"\",Results!D111)","v":""},{"$f":"IF(Results!E111=\"\",\"\",Results!E111)","v":""},{"$f":"IF(Results!F111=\"\",\"\",Results!F111)","v":""},"",""]
[null,109,{"$f":"IF(Results!C112=\"\",\"\",Results!C112)","v":""},{"$f":"IF(Results!D112=\"\",\"\",Results!D112)","v":""},{"$f":"IF(Results!E112=\"\",\"\",Results!E112)","v":""},{"$f":"IF(Results!F112=\"\",\"\",Results!F112)","v":""},"",""]
[null,110,{"$f":"IF(Results!C113=\"\",\"\",Results!C113)","v":""},{"$f":"IF(Results!D113=\"\",\"\",Results!D113)","v":""},{"$f":"IF(Results!E113=\"\",\"\",Results!E113)","v":""},{"$f":"IF(Results!F113=\"\",\"\",Results!F113)","v":""},"",""]
[null,111,{"$f":"IF(Results!C114=\"\",\"\",Results!C114)","v":""},{"$f":"IF(Results!D114=\"\",\"\",Results!D114)","v":""},{"$f":"IF(Results!E114=\"\",\"\",Results!E114)","v":""},{"$f":"IF(Results!F114=\"\",\"\",Results!F114)","v":""},"",""]
[null,112,{"$f":"IF(Results!C115=\"\",\"\",Results!C115)","v":""},{"$f":"IF(Results!D115=\"\",\"\",Results!D115)","v":""},{"$f":"IF(Results!E115=\"\",\"\",Results!E115)","v":""},{"$f":"IF(Results!F115=\"\",\"\",Results!F115)","v":""},"",""]
[null,113,{"$f":"IF(Results!C116=\"\",\"\",Results!C116)","v":""},{"$f":"IF(Results!D116=\"\",\"\",Results!D116)","v":""},{"$f":"IF(Results!E116=\"\",\"\",Results!E116)","v":""},{"$f":"IF(Results!F116=\"\",\"\",Results!F116)","v":""},"",""]
[null,114,{"$f":"IF(Results!C117=\"\",\"\",Results!C117)","v":""},{"$f":"IF(Results!D117=\"\",\"\",Results!D117)","v":""},{"$f":"IF(Results!E117=\"\",\"\",Results!E117)","v":""},{"$f":"IF(Results!F117=\"\",\"\",Results!F117)","v":""},"",""]
[null,115,{"$f":"IF(Results!C118=\"\",\"\",Results!C118)","v":""},{"$f":"IF(Results!D118=\"\",\"\",Results!D118)","v":""},{"$f":"IF(Results!E118=\"\",\"\",Results!E118)","v":""},{"$f":"IF(Results!F118=\"\",\"\",Results!F118)","v":""},"",""]
[null,116,{"$f":"IF(Results!C119=\"\",\"\",Results!C119)","v":""},{"$f":"IF(Results!D119=\"\",\"\",Results!D119)","v":""},{"$f":"IF(Results!E119=\"\",\"\",Results!E119)","v":""},{"$f":"IF(Results!F119=\"\",\"\",Results!F119)","v":""},"",""]
[null,117,{"$f":"IF(Results!C120=\"\",\"\",Results!C120)","v":""},{"$f":"IF(Results!D120=\"\",\"\",Results!D120)","v":""},{"$f":"IF(Results!E120=\"\",\"\",Results!E120)","v":""},{"$f":"IF(Results!F120=\"\",\"\",Results!F120)","v":""},"",""]
[null,118,{"$f":"IF(Results!C121=\"\",\"\",Results!C121)","v":""},{"$f":"IF(Results!D121=\"\",\"\",Results!D121)","v":""},{"$f":"IF(Results!E121=\"\",\"\",Results!E121)","v":""},{"$f":"IF(Results!F121=\"\",\"\",Results!F121)","v":""},"",""]
[null,119,{"$f":"IF(Results!C122=\"\",\"\",Results!C122)","v":""},{"$f":"IF(Results!D122=\"\",\"\",Results!D122)","v":""},{"$f":"IF(Results!E122=\"\",\"\",Results!E122)","v":""},{"$f":"IF(Results!F122=\"\",\"\",Results!F122)","v":""},"",""]
[null,120,{"$f":"IF(Results!C123=\"\",\"\",Results!C123)","v":""},{"$f":"IF(Results!D123=\"\",\"\",Results!D123)","v":""},{"$f":"IF(Results!E123=\"\",\"\",Results!E123)","v":""},{"$f":"IF(Results!F123=\"\",\"\",Results!F123)","v":""},"",""]
[null,121,{"$f":"IF(Results!C124=\"\",\"\",Results!C124)","v":""},{"$f":"IF(Results!D124=\"\",\"\",Results!D124)","v":""},{"$f":"IF(Results!E124=\"\",\"\",Results!E124)","v":""},{"$f":"IF(Results!F124=\"\",\"\",Results!F124)","v":""},"",""]
[null,122,{"$f":"IF(Results!C125=\"\",\"\",Results!C125)","v":""},{"$f":"IF(Results!D125=\"\",\"\",Results!D125)","v":""},{"$f":"IF(Results!E125=\"\",\"\",Results!E125)","v":""},{"$f":"IF(Results!F125=\"\",\"\",Results!F125)","v":""},"",""]
[null,123,{"$f":"IF(Results!C126=\"\",\"\",Results!C126)","v":""},{"$f":"IF(Results!D126=\"\",\"\",Results!D126)","v":""},{"$f":"IF(Results!E126=\"\",\"\",Results!E126)","v":""},{"$f":"IF(Results!F126=\"\",\"\",Results!F126)","v":""},"",""]
[null,124,{"$f":"IF(Results!C127=\"\",\"\",Results!C127)","v":""},{"$f":"IF(Results!D127=\"\",\"\",Results!D127)","v":""},{"$f":"IF(Results!E127=\"\",\"\",Results!E127)","v":""},{"$f":"IF(Results!F127=\"\",\"\",Results!F127)","v":""},"",""]
[null,125,{"$f":"IF(Results!C128=\"\",\"\",Results!C128)","v":""},{"$f":"IF(Results!D128=\"\",\"\",Results!D128)","v":""},{"$f":"IF(Results!E128=\"\",\"\",Results!E128)","v":""},{"$f":"IF(Results!F128=\"\",\"\",Results!F128)","v":""},"",""]
[null,126,{"$f":"IF(Results!C129=\"\",\"\",Results!C129)","v":""},{"$f":"IF(Results!D129=\"\",\"\",Results!D129)","v":""},{"$f":"IF(Results!E129=\"\",\"\",Results!E129)","v":""},{"$f":"IF(Results!F129=\"\",\"\",Results!F129)","v":""},"",""]
[null,127,{"$f":"IF(Results!C130=\"\",\"\",Results!C130)","v":""},{"$f":"IF(Results!D130=\"\",\"\",Results!D130)","v":""},{"$f":"IF(Results!E130=\"\",\"\",Results!E130)","v":""},{"$f":"IF(Results!F130=\"\",\"\",Results!F130)","v":""},"",""]
[null,128,{"$f":"IF(Results!C131=\"\",\"\",Results!C131)","v":""},{"$f":"IF(Results!D131=\"\",\"\",Results!D131)","v":""},{"$f":"IF(Results!E131=\"\",\"\",Results!E131)","v":""},{"$f":"IF(Results!F131=\"\",\"\",Results!F131)","v":""},"",""]
[null,129,{"$f":"IF(Results!C132=\"\",\"\",Results!C132)","v":""},{"$f":"IF(Results!D132=\"\",\"\",Results!D132)","v":""},{"$f":"IF(Results!E132=\"\",\"\",Results!E132)","v":""},{"$f":"IF(Results!F132=\"\",\"\",Results!F132)","v":""},{"$f":"IF(D132=\"\",\"\",SUM(D132:F132))","v":""},{"$f":"IF(F132=\"\",\"\",RANK($G132,$G$4:$G$103))","v":""}]
[null,130,{"$f":"IF(Results!C133=\"\",\"\",Results!C133)","v":""},{"$f":"IF(Results!D133=\"\",\"\",Results!D133)","v":""},{"$f":"IF(Results!E133=\"\",\"\",Results!E133)","v":""},{"$f":"IF(Results!F133=\"\",\"\",Results!F133)","v":""},"",""]
[null,131,{"$f":"IF(Results!C134=\"\",\"\",Results!C134)","v":""},{"$f":"IF(Results!D134=\"\",\"\",Results!D134)","v":""},{"$f":"IF(Results!E134=\"\",\"\",Results!E134)","v":""},{"$f":"IF(Results!F134=\"\",\"\",Results!F134)","v":""},"",""]
[null,132,{"$f":"IF(Results!C135=\"\",\"\",Results!C135)","v":""},{"$f":"IF(Results!D135=\"\",\"\",Results!D135)","v":""},{"$f":"IF(Results!E135=\"\",\"\",Results!E135)","v":""},{"$f":"IF(Results!F135=\"\",\"\",Results!F135)","v":""},"",""]
[null,133,{"$f":"IF(Results!C136=\"\",\"\",Results!C136)","v":""},{"$f":"IF(Results!D136=\"\",\"\",Results!D136)","v":""},{"$f":"IF(Results!E136=\"\",\"\",Results!E136)","v":""},{"$f":"IF(Results!F136=\"\",\"\",Results!F136)","v":""},"",""]
[null,134,{"$f":"IF(Results!C137=\"\",\"\",Results!C137)","v":""},{"$f":"IF(Results!D137=\"\",\"\",Results!D137)","v":""},{"$f":"IF(Results!E137=\"\",\"\",Results!E137)","v":""},{"$f":"IF(Results!F137=\"\",\"\",Results!F137)","v":""},"",""]
[null,135,{"$f":"IF(Results!C138=\"\",\"\",Results!C138)","v":""},{"$f":"IF(Results!D138=\"\",\"\",Results!D138)","v":""},{"$f":"IF(Results!E138=\"\",\"\",Results!E138)","v":""},{"$f":"IF(Results!F138=\"\",\"\",Results!F138)","v":""},"",""]
[null,136,{"$f":"IF(Results!C139=\"\",\"\",Results!C139)","v":""},{"$f":"IF(Results!D139=\"\",\"\",Results!D139)","v":""},{"$f":"IF(Results!E139=\"\",\"\",Results!E139)","v":""},{"$f":"IF(Results!F139=\"\",\"\",Results!F139)","v":""},"",""]
[null,137,{"$f":"IF(Results!C140=\"\",\"\",Results!C140)","v":""},{"$f":"IF(Results!D140=\"\",\"\",Results!D140)","v":""},{"$f":"IF(Results!E140=\"\",\"\",Results!E140)","v":""},{"$f":"IF(Results!F140=\"\",\"\",Results!F140)","v":""},"",""]
[null,138,{"$f":"IF(Results!C141=\"\",\"\",Results!C141)","v":""},{"$f":"IF(Results!D141=\"\",\"\",Results!D141)","v":""},{"$f":"IF(Results!E141=\"\",\"\",Results!E141)","v":""},{"$f":"IF(Results!F141=\"\",\"\",Results!F141)","v":""},"",""]
[null,139,{"$f":"IF(Results!C142=\"\",\"\",Results!C142)","v":""},{"$f":"IF(Results!D142=\"\",\"\",Results!D142)","v":""},{"$f":"IF(Results!E142=\"\",\"\",Results!E142)","v":""},{"$f":"IF(Results!F142=\"\",\"\",Results!F142)","v":""},"",""]
[null,140,{"$f":"IF(Results!C143=\"\",\"\",Results!C143)","v":""},{"$f":"IF(Results!D143=\"\",\"\",Results!D143)","v":""},{"$f":"IF(Results!E143=\"\",\"\",Results!E143)","v":""},{"$f":"IF(Results!F143=\"\",\"\",Results!F143)","v":""},"",""]
[null,141,{"$f":"IF(Results!C144=\"\",\"\",Results!C144)","v":""},{"$f":"IF(Results!D144=\"\",\"\",Results!D144)","v":""},{"$f":"IF(Results!E144=\"\",\"\",Results!E144)","v":""},{"$f":"IF(Results!F144=\"\",\"\",Results!F144)","v":""},"",""]
[null,142,{"$f":"IF(Results!C145=\"\",\"\",Results!C145)","v":""},{"$f":"IF(Results!D145=\"\",\"\",Results!D145)","v":""},{"$f":"IF(Results!E145=\"\",\"\",Results!E145)","v":""},{"$f":"IF(Results!F145=\"\",\"\",Results!F145)","v":""},"",""]
[null,143,{"$f":"IF(Results!C146=\"\",\"\",Results!C146)","v":""},{"$f":"IF(Results!D146=\"\",\"\",Results!D146)","v":""},{"$f":"IF(Results!E146=\"\",\"\",Results!E146)","v":""},{"$f":"IF(Results!F146=\"\",\"\",Results!F146)","v":""},"",""]
[null,144,{"$f":"IF(Results!C147=\"\",\"\",Results!C147)","v":""},{"$f":"IF(Results!D147=\"\",\"\",Results!D147)","v":""},{"$f":"IF(Results!E147=\"\",\"\",Results!E147)","v":""},{"$f":"IF(Results!F147=\"\",\"\",Results!F147)","v":""},"",""]
[null,145,{"$f":"IF(Results!C148=\"\",\"\",Results!C148)","v":""},{"$f":"IF(Results!D148=\"\",\"\",Results!D148)","v":""},{"$f":"IF(Results!E148=\"\",\"\",Results!E148)","v":""},{"$f":"IF(Results!F148=\"\",\"\",Results!F148)","v":""},"",""]
[null,146,{"$f":"IF(Results!C149=\"\",\"\",Results!C149)","v":""},{"$f":"IF(Results!D149=\"\",\"\",Results!D149)","v":""},{"$f":"IF(Results!E149=\"\",\"\",Results!E149)","v":""},{"$f":"IF(Results!F149=\"\",\"\",Results!F149)","v":""},"",""]
[null,147,{"$f":"IF(Results!C150=\"\",\"\",Results!C150)","v":""},{"$f":"IF(Results!D150=\"\",\"\",Results!D150)","v":""},{"$f":"IF(Results!E150=\"\",\"\",Results!E150)","v":""},{"$f":"IF(Results!F150=\"\",\"\",Results!F150)","v":""},"",""]
[null,148,{"$f":"IF(Results!C151=\"\",\"\",Results!C151)","v":""},{"$f":"IF(Results!D151=\"\",\"\",Results!D151)","v":""},{"$f":"IF(Results!E151=\"\",\"\",Results!E151)","v":""},{"$f":"IF(Results!F151=\"\",\"\",Results!F151)","v":""},"",""]
[null,149,{"$f":"IF(Results!C152=\"\",\"\",Results!C152)","v":""},{"$f":"IF(Results!D152=\"\",\"\",Results!D152)","v":""},{"$f":"IF(Results!E152=\"\",\"\",Results!E152)","v":""},{"$f":"IF(Results!F152=\"\",\"\",Results!F152)","v":""},"",""]
[null,150,{"$f":"IF(Results!C153=\"\",\"\",Results!C153)","v":""},{"$f":"IF(Results!D153=\"\",\"\",Results!D153)","v":""},{"$f":"IF(Results!E153=\"\",\"\",Results!E153)","v":""},{"$f":"IF(Results!F153=\"\",\"\",Results!F153)","v":""},"",""]
[null,151,{"$f":"IF(Results!C154=\"\",\"\",Results!C154)","v":""},{"$f":"IF(Results!D154=\"\",\"\",Results!D154)","v":""},{"$f":"IF(Results!E154=\"\",\"\",Results!E154)","v":""},{"$f":"IF(Results!F154=\"\",\"\",Results!F154)","v":""},"",""]
[null,152,{"$f":"IF(Results!C155=\"\",\"\",Results!C155)","v":""},{"$f":"IF(Results!D155=\"\",\"\",Results!D155)","v":""},{"$f":"IF(Results!E155=\"\",\"\",Results!E155)","v":""},{"$f":"IF(Results!F155=\"\",\"\",Results!F155)","v":""},"",""]
[null,153,{"$f":"IF(Results!C156=\"\",\"\",Results!C156)","v":""},{"$f":"IF(Results!D156=\"\",\"\",Results!D156)","v":""},{"$f":"IF(Results!E156=\"\",\"\",Results!E156)","v":""},{"$f":"IF(Results!F156=\"\",\"\",Results!F156)","v":""},"",""]
[null,154,{"$f":"IF(Results!C157=\"\",\"\",Results!C157)","v":""},{"$f":"IF(Results!D157=\"\",\"\",Results!D157)","v":""},{"$f":"IF(Results!E157=\"\",\"\",Results!E157)","v":""},{"$f":"IF(Results!F157=\"\",\"\",Results!F157)","v":""},"",""]
[null,155,{"$f":"IF(Results!C158=\"\",\"\",Results!C158)","v":""},{"$f":"IF(Results!D158=\"\",\"\",Results!D158)","v":""},{"$f":"IF(Results!E158=\"\",\"\",Results!E158)","v":""},{"$f":"IF(Results!F158=\"\",\"\",Results!F158)","v":""},"",""]
[null,156,{"$f":"IF(Results!C159=\"\",\"\",Results!C159)","v":""},{"$f":"IF(Results!D159=\"\",\"\",Results!D159)","v":""},{"$f":"IF(Results!E159=\"\",\"\",Results!E159)","v":""},{"$f":"IF(Results!F159=\"\",\"\",Results!F159)","v":""},"",""]
[null,157,{"$f":"IF(Results!C160=\"\",\"\",Results!C160)","v":""},{"$f":"IF(Results!D160=\"\",\"\",Results!D160)","v":""},{"$f":"IF(Results!E160=\"\",\"\",Results!E160)","v":""},{"$f":"IF(Results!F160=\"\",\"\",Results!F160)","v":""},"",""]
[null,158,{"$f":"IF(Results!C161=\"\",\"\",Results!C161)","v":""},{"$f":"IF(Results!D161=\"\",\"\",Results!D161)","v":""},{"$f":"IF(Results!E161=\"\",\"\",Results!E161)","v":""},{"$f":"IF(Results!F161=\"\",\"\",Results!F161)","v":""},"",""]
[null,159,{"$f":"IF(Results!C162=\"\",\"\",Results!C162)","v":""},{"$f":"IF(Results!D162=\"\",\"\",Results!D162)","v":""},{"$f":"IF(Results!E162=\"\",\"\",Results!E162)","v":""},{"$f":"IF(Results!F162=\"\",\"\",Results!F162)","v":""},"",""]
[null,160,{"$f":"IF(Results!C163=\"\",\"\",Results!C163)","v":""},{"$f":"IF(Results!D163=\"\",\"\",Results!D163)","v":""},{"$f":"IF(Results!E163=\"\",\"\",Results!E163)","v":""},{"$f":"IF(Results!F163=\"\",\"\",Results!F163)","v":""},"",""]
[null,161,{"$f":"IF(Results!C164=\"\",\"\",Results!C164)","v":""},{"$f":"IF(Results!D164=\"\",\"\",Results!D164)","v":""},{"$f":"IF(Results!E164=\"\",\"\",Results!E164)","v":""},{"$f":"IF(Results!F164=\"\",\"\",Results!F164)","v":""},{"$f":"IF(D164=\"\",\"\",SUM(D164:F164))","v":""},{"$f":"IF(F164=\"\",\"\",RANK($G164,$G$4:$G$103))","v":""}]
[null,162,{"$f":"IF(Results!C165=\"\",\"\",Results!C165)","v":""},{"$f":"IF(Results!D165=\"\",\"\",Results!D165)","v":""},{"$f":"IF(Results!E165=\"\",\"\",Results!E165)","v":""},{"$f":"IF(Results!F165=\"\",\"\",Results!F165)","v":""},"",""]
[null,163,{"$f":"IF(Results!C166=\"\",\"\",Results!C166)","v":""},{"$f":"IF(Results!D166=\"\",\"\",Results!D166)","v":""},{"$f":"IF(Results!E166=\"\",\"\",Results!E166)","v":""},{"$f":"IF(Results!F166=\"\",\"\",Results!F166)","v":""},"",""]
[null,164,{"$f":"IF(Results!C167=\"\",\"\",Results!C167)","v":""},{"$f":"IF(Results!D167=\"\",\"\",Results!D167)","v":""},{"$f":"IF(Results!E167=\"\",\"\",Results!E167)","v":""},{"$f":"IF(Results!F167=\"\",\"\",Results!F167)","v":""},"",""]
[null,165,{"$f":"IF(Results!C168=\"\",\"\",Results!C168)","v":""},{"$f":"IF(Results!D168=\"\",\"\",Results!D168)","v":""},{"$f":"IF(Results!E168=\"\",\"\",Results!E168)","v":""},{"$f":"IF(Results!F168=\"\",\"\",Results!F168)","v":""},"",""]
[null,166,{"$f":"IF(Results!C169=\"\",\"\",Results!C169)","v":""},{"$f":"IF(Results!D169=\"\",\"\",Results!D169)","v":""},{"$f":"IF(Results!E169=\"\",\"\",Results!E169)","v":""},{"$f":"IF(Results!F169=\"\",\"\",Results!F169)","v":""},"",""]
[null,167,{"$f":"IF(Results!C170=\"\",\"\",Results!C170)","v":""},{"$f":"IF(Results!D170=\"\",\"\",Results!D170)","v":""},{"$f":"IF(Results!E170=\"\",\"\",Results!E170)","v":""},{"$f":"IF(Results!F170=\"\",\"\",Results!F170)","v":""},"",""]
[null,168,{"$f":"IF(Results!C171=\"\",\"\",Results!C171)","v":""},{"$f":"IF(Results!D171=\"\",\"\",Results!D171)","v":""},{"$f":"IF(Results!E171=\"\",\"\",Results!E171)","v":""},{"$f":"IF(Results!F171=\"\",\"\",Results!F171)","v":""},"",""]
[null,169,{"$f":"IF(Results!C172=\"\",\"\",Results!C172)","v":""},{"$f":"IF(Results!D172=\"\",\"\",Results!D172)","v":""},{"$f":"IF(Results!E172=\"\",\"\",Results!E172)","v":""},{"$f":"IF(Results!F172=\"\",\"\",Results!F172)","v":""},"",""]
[null,170,{"$f":"IF(Results!C173=\"\",\"\",Results!C173)","v":""},{"$f":"IF(Results!D173=\"\",\"\",Results!D173)","v":""},{"$f":"IF(Results!E173=\"\",\"\",Results!E173)","v":""},{"$f":"IF(Results!F173=\"\",\"\",Results!F173)","v":""},"",""]
[null,171,{"$f":"IF(Results!C174=\"\",\"\",Results!C174)","v":""},{"$f":"IF(Results!D174=\"\",\"\",Results!D174)","v":""},{"$f":"IF(Results!E174=\"\",\"\",Results!E174)","v":""},{"$f":"IF(Results!F174=\"\",\"\",Results!F174)","v":""},"",""]
[null,172,{"$f":"IF(Results!C175=\"\",\"\",Results!C175)","v":""},{"$f":"IF(Results!D175=\"\",\"\",Results!D175)","v":""},{"$f":"IF(Results!E175=\"\",\"\",Results!E175)","v":""},{"$f":"IF(Results!F175=\"\",\"\",Results!F175)","v":""},"",""]
[null,173,{"$f":"IF(Results!C176=\"\",\"\",Results!C176)","v":""},{"$f":"IF(Results!D176=\"\",\"\",Results!D176)","v":""},{"$f":"IF(Results!E176=\"\",\"\",Results!E176)","v":""},{"$f":"IF(Results!F176=\"\",\"\",Results!F176)","v":""},"",""]
[null,174,{"$f":"IF(Results!C177=\"\",\"\",Results!C177)","v":""},{"$f":"IF(Results!D177=\"\",\"\",Results!D177)","v":""},{"$f":"IF(Results!E177=\"\",\"\",Results!E177)","v":""},{"$f":"IF(Results!F177=\"\",\"\",Results!F177)","v":""},"",""]
[null,175,{"$f":"IF(Results!C178=\"\",\"\",Results!C178)","v":""},{"$f":"IF(Results!D178=\"\",\"\",Results!D178)","v":""},{"$f":"IF(Results!E178=\"\",\"\",Results!E178)","v":""},{"$f":"IF(Results!F178=\"\",\"\",Results!F178)","v":""},"",""]
[null,176,{"$f":"IF(Results!C179=\"\",\"\",Results!C179)","v":""},{"$f":"IF(Results!D179=\"\",\"\",Results!D179)","v":""},{"$f":"IF(Results!E179=\"\",\"\",Results!E179)","v":""},{"$f":"IF(Results!F179=\"\",\"\",Results!F179)","v":""},"",""]
[null,177,{"$f":"IF(Results!C180=\"\",\"\",Results!C180)","v":""},{"$f":"IF(Results!D180=\"\",\"\",Results!D180)","v":""},{"$f":"IF(Results!E180=\"\",\"\",Results!E180)","v":""},{"$f":"IF(Results!F180=\"\",\"\",Results!F180)","v":""},"",""]
[null,178,{"$f":"IF(Results!C181=\"\",\"\",Results!C181)","v":""},{"$f":"IF(Results!D181=\"\",\"\",Results!D181)","v":""},{"$f":"IF(Results!E181=\"\",\"\",Results!E181)","v":""},{"$f":"IF(Results!F181=\"\",\"\",Results!F181)","v":""},"",""]
[null,179,{"$f":"IF(Results!C182=\"\",\"\",Results!C182)","v":""},{"$f":"IF(Results!D182=\"\",\"\",Results!D182)","v":""},{"$f":"IF(Results!E182=\"\",\"\",Results!E182)","v":""},{"$f":"IF(Results!F182=\"\",\"\",Results!F182)","v":""},"",""]
[null,180,{"$f":"IF(Results!C183=\"\",\"\",Results!C183)","v":""},{"$f":"IF(Results!D183=\"\",\"\",Results!D183)","v":""},{"$f":"IF(Results!E183=\"\",\"\",Results!E183)","v":""},{"$f":"IF(Results!F183=\"\",\"\",Results!F183)","v":""},"",""]
[null,181,{"$f":"IF(Results!C184=\"\",\"\",Results!C184)","v":""},{"$f":"IF(Results!D184=\"\",\"\",Results!D184)","v":""},{"$f":"IF(Results!E184=\"\",\"\",Results!E184)","v":""},{"$f":"IF(Results!F184=\"\",\"\",Results!F184)","v":""},"",""]
[null,182,{"$f":"IF(Results!C185=\"\",\"\",Results!C185)","v":""},{"$f":"IF(Results!D185=\"\",\"\",Results!D185)","v":""},{"$f":"IF(Results!E185=\"\",\"\",Results!E185)","v":""},{"$f":"IF(Results!F185=\"\",\"\",Results!F185)","v":""},"",""]
[null,183,{"$f":"IF(Results!C186=\"\",\"\",Results!C186)","v":""},{"$f":"IF(Results!D186=\"\",\"\",Results!D186)","v":""},{"$f":"IF(Results!E186=\"\",\"\",Results!E186)","v":""},{"$f":"IF(Results!F186=\"\",\"\",Results!F186)","v":""},"",""]
[null,184,{"$f":"IF(Results!C187=\"\",\"\",Results!C187)","v":""},{"$f":"IF(Results!D187=\"\",\"\",Results!D187)","v":""},{"$f":"IF(Results!E187=\"\",\"\",Results!E187)","v":""},{"$f":"IF(Results!F187=\"\",\"\",Results!F187)","v":""},"",""]
[null,185,{"$f":"IF(Results!C188=\"\",\"\",Results!C188)","v":""},{"$f":"IF(Results!D188=\"\",\"\",Results!D188)","v":""},{"$f":"IF(Results!E188=\"\",\"\",Results!E188)","v":""},{"$f":"IF(Results!F188=\"\",\"\",Results!F188)","v":""},"",""]
[null,186,{"$f":"IF(Results!C189=\"\",\"\",Results!C189)","v":""},{"$f":"IF(Results!D189=\"\",\"\",Results!D189)","v":""},{"$f":"IF(Results!E189=\"\",\"\",Results!E189)","v":""},{"$f":"IF(Results!F189=\"\",\"\",Results!F189)","v":""},"",""]
[null,187,{"$f":"IF(Results!C190=\"\",\"\",Results!C190)","v":""},{"$f":"IF(Results!D190=\"\",\"\",Results!D190)","v":""},{"$f":"IF(Results!E190=\"\",\"\",Results!E190)","v":""},{"$f":"IF(Results!F190=\"\",\"\",Results!F190)","v":""},"",""]
[null,188,{"$f":"IF(Results!C191=\"\",\"\",Results!C191)","v":""},{"$f":"IF(Results!D191=\"\",\"\",Results!D191)","v":""},{"$f":"IF(Results!E191=\"\",\"\",Results!E191)","v":""},{"$f":"IF(Results!F191=\"\",\"\",Results!F191)","v":""},"",""]
[null,189,{"$f":"IF(Results!C192=\"\",\"\",Results!C192)","v":""},{"$f":"IF(Results!D192=\"\",\"\",Results!D192)","v":""},{"$f":"IF(Results!E192=\"\",\"\",Results!E192)","v":""},{"$f":"IF(Results!F192=\"\",\"\",Results!F192)","v":""},"",""]
[null,190,{"$f":"IF(Results!C193=\"\",\"\",Results!C193)","v":""},{"$f":"IF(Results!D193=\"\",\"\",Results!D193)","v":""},{"$f":"IF(Results!E193=\"\",\"\",Results!E193)","v":""},{"$f":"IF(Results!F193=\"\",\"\",Results!F193)","v":""},"",""]
[null,191,{"$f":"IF(Results!C194=\"\",\"\",Results!C194)","v":""},{"$f":"IF(Results!D194=\"\",\"\",Results!D194)","v":""},{"$f":"IF(Results!E194=\"\",\"\",Results!E194)","v":""},{"$f":"IF(Results!F194=\"\",\"\",Results!F194)","v":""},"",""]
[null,192,{"$f":"IF(Results!C195=\"\",\"\",Results!C195)","v":""},{"$f":"IF(Results!D195=\"\",\"\",Results!D195)","v":""},{"$f":"IF(Results!E195=\"\",\"\",Results!E195)","v":""},{"$f":"IF(Results!F195=\"\",\"\",Results!F195)","v":""},"",""]
[null,193,{"$f":"IF(Results!C196=\"\",\"\",Results!C196)","v":""},{"$f":"IF(Results!D196=\"\",\"\",Results!D196)","v":""},{"$f":"IF(Results!E196=\"\",\"\",Results!E196)","v":""},{"$f":"IF(Results!F196=\"\",\"\",Results!F196)","v":""},{"$f":"IF(D196=\"\",\"\",SUM(D196:F196))","v":""},{"$f":"IF(F196=\"\",\"\",RANK($G196,$G$4:$G$103))","v":""}]
[null,194,{"$f":"IF(Results!C197=\"\",\"\",Results!C197)","v":""},{"$f":"IF(Results!D197=\"\",\"\",Results!D197)","v":""},{"$f":"IF(Results!E197=\"\",\"\",Results!E197)","v":""},{"$f":"IF(Results!F197=\"\",\"\",Results!F197)","v":""},"",""]
[null,195,{"$f":"IF(Results!C198=\"\",\"\",Results!C198)","v":""},{"$f":"IF(Results!D198=\"\",\"\",Results!D198)","v":""},{"$f":"IF(Results!E198=\"\",\"\",Results!E198)","v":""},{"$f":"IF(Results!F198=\"\",\"\",Results!F198)","v":""},"",""]
[null,196,{"$f":"IF(Results!C199=\"\",\"\",Results!C199)","v":""},{"$f":"IF(Results!D199=\"\",\"\",Results!D199)","v":""},{"$f":"IF(Results!E199=\"\",\"\",Results!E199)","v":""},{"$f":"IF(Results!F199=\"\",\"\",Results!F199)","v":""},"",""]
[null,197,{"$f":"IF(Results!C200=\"\",\"\",Results!C200)","v":""},{"$f":"IF(Results!D200=\"\",\"\",Results!D200)","v":""},{"$f":"IF(Results!E200=\"\",\"\",Results!E200)","v":""},{"$f":"IF(Results!F200=\"\",\"\",Results!F200)","v":""},"",""]
[null,198,{"$f":"IF(Results!C201=\"\",\"\",Results!C201)","v":""},{"$f":"IF(Results!D201=\"\",\"\",Results!D201)","v":""},{"$f":"IF(Results!E201=\"\",\"\",Results!E201)","v":""},{"$f":"IF(Results!F201=\"\",\"\",Results!F201)","v":""},"",""]
[null,199,{"$f":"IF(Results!C202=\"\",\"\",Results!C202)","v":""},{"$f":"IF(Results!D202=\"\",\"\",Results!D202)","v":""},{"$f":"IF(Results!E202=\"\",\"\",Results!E202)","v":""},{"$f":"IF(Results!F202=\"\",\"\",Results!F202)","v":""},"",""]
[null,200,{"$f":"IF(Results!C203=\"\",\"\",Results!C203)","v":""},{"$f":"IF(Results!D203=\"\",\"\",Results!D203)","v":""},{"$f":"IF(Results!E203=\"\",\"\",Results!E203)","v":""},{"$f":"IF(Results!F203=\"\",\"\",Results!F203)","v":""},"",""]

{"sheet":"Full","index":8,"n_rows":204,"n_cols":12,"rows_kept":204,"cut":false,"hidden":false,"merged":[[1,1,1,5],[0,1,0,5],[0,6,0,11],[1,7,1,11],[2,1,2,2],[2,3,2,5]]}
[null,{"$f":"Title!H9","v":"Competition Name"},null,null,null,null,{"$f":"Title!H11","v":"Host/ Event"}]
[null,{"$f":"Title!H15","v":"Locaton"},null,null,null,null,null,{"$f":"Title!H16","v":"Date"}]
[null,"OVER - JUDGE :",null,{"$f":"IF(Title!J13=\"\",\"\",Title!J13)","v":""}]
[null,"NO","NAME",{"$f":"IF(Group1!D2=\"\",\"\",Group1!D2)","v":""},{"$f":"IF(Group2!D2=\"\",\"\",Group2!D2)","v":""},{"$f":"IF(Group3!D2=\"\",\"\",Group3!D2)","v":""},{"$f":"IF(Group4!D2=\"\",\"\",Group4!D2)","v":""},"VISUAL TOTAL","HANDLING SCORE","ORAL SCORE","TOTAL SCORE","PLACE"]
[null,1,{"$f":"IF(Results!C4=\"\",\"\",Results!C4)","v":""},{"$f":"IF(Results!$C4=\"\",\"\",IF(Results!$H$2>=1,VALUE(VLOOKUP($B5,Group1!$I$4:$K$103,3)),0))","v":""},{"$f":"IF(Results!$C4=\"\",\"\",IF(Results!$H$2>=2,VALUE(VLOOKUP($B5,Group2!$I$4:$K$103,3)),0))","v":""},{"$f":"IF(Results!$C4=\"\",\"\",IF(Results!$H$2>=3,VALUE(VLOOKUP($B5,Group3!$I$4:$K$103,3)),0))","v":""},{"$f":"IF(Results!$C4=\"\",\"\",IF(Results!$H$2>=4,VALUE(VLOOKUP($B5,Group4!$I$4:$K$103,3)),0))","v":""},{"$f":"IF(Results!$C4=\"\",\"\",SUM(D5:G5))","v":""},{"$f":"IF(Results!E4=\"\",\"\",Results!E4)","v":""},{"$f":"IF(Results!F4=\"\",\"\",Results!F4)","v":49},{"$f":"IF(C5=\"\",\"\",SUM(H5:J5))","v":""},{"$f":"IF(Results!$I4=\"\",\"\",Results!$I4)","v":""}]
[null,2,{"$f":"IF(Results!C5=\"\",\"\",Results!C5)","v":""},{"$f":"IF(Results!$C5=\"\",\"\",IF(Results!$H$2>=1,VALUE(VLOOKUP($B6,Group1!$I$4:$K$103,3)),0))","v":""},{"$f":"IF(Results!$C5=\"\",\"\",IF(Results!$H$2>=2,VALUE(VLOOKUP($B6,Group2!$I$4:$K$103,3)),0))","v":""},{"$f":"IF(Results!$C5=\"\",\"\",IF(Results!$H$2>=3,VALUE(VLOOKUP($B6,Group3!$I$4:$K$103,3)),0))","v":""},{"$f":"IF(Results!$C5=\"\",\"\",IF(Results!$H$2>=4,VALUE(VLOOKUP($B6,Group4!$I$4:$K$103,3)),0))","v":""},{"$f":"IF(Results!$C5=\"\",\"\",SUM(D6:G6))","v":""},{"$f":"IF(Results!E5=\"\",\"\",Results!E5)","v":""},{"$f":"IF(Results!F5=\"\",\"\",Results!F5)","v":47},{"$f":"IF(C6=\"\",\"\",SUM(H6:J6))","v":""},{"$f":"IF(Results!$I5=\"\",\"\",Results!$I5)","v":""}]
[null,3,{"$f":"IF(Results!C6=\"\",\"\",Results!C6)","v":""},{"$f":"IF(Results!$C6=\"\",\"\",IF(Results!$H$2>=1,VALUE(VLOOKUP($B7,Group1!$I$4:$K$103,3)),0))","v":""},{"$f":"IF(Results!$C6=\"\",\"\",IF(Results!$H$2>=2,VALUE(VLOOKUP($B7,Group2!$I$4:$K$103,3)),0))","v":""},{"$f":"IF(Results!$C6=\"\",\"\",IF(Results!$H$2>=3,VALUE(VLOOKUP($B7,Group3!$I$4:$K$103,3)),0))","v":""},{"$f":"IF(Results!$C6=\"\",\"\",IF(Results!$H$2>=4,VALUE(VLOOKUP($B7,Group4!$I$4:$K$103,3)),0))","v":""},{"$f":"IF(Results!$C6=\"\",\"\",SUM(D7:G7))","v":""},{"$f":"IF(Results!E6=\"\",\"\",Results!E6)","v":""},{"$f":"IF(Results!F6=\"\",\"\",Results!F6)","v":38},"",{"$f":"IF(Results!$I6=\"\",\"\",Results!$I6)","v":""}]
[null,4,{"$f":"IF(Results!C7=\"\",\"\",Results!C7)","v":""},{"$f":"IF(Results!$C7=\"\",\"\",IF(Results!$H$2>=1,VALUE(VLOOKUP($B8,Group1!$I$4:$K$103,3)),0))","v":""},{"$f":"IF(Results!$C7=\"\",\"\",IF(Results!$H$2>=2,VALUE(VLOOKUP($B8,Group2!$I$4:$K$103,3)),0))","v":""},{"$f":"IF(Results!$C7=\"\",\"\",IF(Results!$H$2>=3,VALUE(VLOOKUP($B8,Group3!$I$4:$K$103,3)),0))","v":""},{"$f":"IF(Results!$C7=\"\",\"\",IF(Results!$H$2>=4,VALUE(VLOOKUP($B8,Group4!$I$4:$K$103,3)),0))","v":""},{"$f":"IF(Results!$C7=\"\",\"\",SUM(D8:G8))","v":""},{"$f":"IF(Results!E7=\"\",\"\",Results!E7)","v":""},{"$f":"IF(Results!F7=\"\",\"\",Results!F7)","v":44},"",{"$f":"IF(Results!$I7=\"\",\"\",Results!$I7)","v":""}]
[null,5,{"$f":"IF(Results!C8=\"\",\"\",Results!C8)","v":""},{"$f":"IF(Results!$C8=\"\",\"\",IF(Results!$H$2>=1,VALUE(VLOOKUP($B9,Group1!$I$4:$K$103,3)),0))","v":""},{"$f":"IF(Results!$C8=\"\",\"\",IF(Results!$H$2>=2,VALUE(VLOOKUP($B9,Group2!$I$4:$K$103,3)),0))","v":""},{"$f":"IF(Results!$C8=\"\",\"\",IF(Results!$H$2>=3,VALUE(VLOOKUP($B9,Group3!$I$4:$K$103,3)),0))","v":""},{"$f":"IF(Results!$C8=\"\",\"\",IF(Results!$H$2>=4,VALUE(VLOOKUP($B9,Group4!$I$4:$K$103,3)),0))","v":""},{"$f":"IF(Results!$C8=\"\",\"\",SUM(D9:G9))","v":""},{"$f":"IF(Results!E8=\"\",\"\",Results!E8)","v":""},{"$f":"IF(Results!F8=\"\",\"\",Results!F8)","v":35},"",{"$f":"IF(Results!$I8=\"\",\"\",Results!$I8)","v":""}]
[null,6,{"$f":"IF(Results!C9=\"\",\"\",Results!C9)","v":""},{"$f":"IF(Results!$C9=\"\",\"\",IF(Results!$H$2>=1,VALUE(VLOOKUP($B10,Group1!$I$4:$K$103,3)),0))","v":""},{"$f":"IF(Results!$C9=\"\",\"\",IF(Results!$H$2>=2,VALUE(VLOOKUP($B10,Group2!$I$4:$K$103,3)),0))","v":""},{"$f":"IF(Results!$C9=\"\",\"\",IF(Results!$H$2>=3,VALUE(VLOOKUP($B10,Group3!$I$4:$K$103,3)),0))","v":""},{"$f":"IF(Results!$C9=\"\",\"\",IF(Results!$H$2>=4,VALUE(VLOOKUP($B10,Group4!$I$4:$K$103,3)),0))","v":""},{"$f":"IF(Results!$C9=\"\",\"\",SUM(D10:G10))","v":""},{"$f":"IF(Results!E9=\"\",\"\",Results!E9)","v":""},{"$f":"IF(Results!F9=\"\",\"\",Results!F9)","v":""},"",{"$f":"IF(Results!$I9=\"\",\"\",Results!$I9)","v":""}]
[null,7,{"$f":"IF(Results!C10=\"\",\"\",Results!C10)","v":""},{"$f":"IF(Results!$C10=\"\",\"\",IF(Results!$H$2>=1,VALUE(VLOOKUP($B11,Group1!$I$4:$K$103,3)),0))","v":""},{"$f":"IF(Results!$C10=\"\",\"\",IF(Results!$H$2>=2,VALUE(VLOOKUP($B11,Group2!$I$4:$K$103,3)),0))","v":""},{"$f":"IF(Results!$C10=\"\",\"\",IF(Results!$H$2>=3,VALUE(VLOOKUP($B11,Group3!$I$4:$K$103,3)),0))","v":""},{"$f":"IF(Results!$C10=\"\",\"\",IF(Results!$H$2>=4,VALUE(VLOOKUP($B11,Group4!$I$4:$K$103,3)),0))","v":""},{"$f":"IF(Results!$C10=\"\",\"\",SUM(D11:G11))","v":""},{"$f":"IF(Results!E10=\"\",\"\",Results!E10)","v":""},{"$f":"IF(Results!F10=\"\",\"\",Results!F10)","v":""},"",{"$f":"IF(Results!$I10=\"\",\"\",Results!$I10)","v":""}]
[null,8,{"$f":"IF(Results!C11=\"\",\"\",Results!C11)","v":""},{"$f":"IF(Results!$C11=\"\",\"\",IF(Results!$H$2>=1,VALUE(VLOOKUP($B12,Group1!$I$4:$K$103,3)),0))","v":""},{"$f":"IF(Results!$C11=\"\",\"\",IF(Results!$H$2>=2,VALUE(VLOOKUP($B12,Group2!$I$4:$K$103,3)),0))","v":""},{"$f":"IF(Results!$C11=\"\",\"\",IF(Results!$H$2>=3,VALUE(VLOOKUP($B12,Group3!$I$4:$K$103,3)),0))","v":""},{"$f":"IF(Results!$C11=\"\",\"\",IF(Results!$H$2>=4,VALUE(VLOOKUP($B12,Group4!$I$4:$K$103,3)),0))","v":""},{"$f":"IF(Results!$C11=\"\",\"\",SUM(D12:G12))","v":""},{"$f":"IF(Results!E11=\"\",\"\",Results!E11)","v":""},{"$f":"IF(Results!F11=\"\",\"\",Results!F11)","v":""},"",{"$f":"IF(Results!$I11=\"\",\"\",Results!$I11)","v":""}]
[null,9,{"$f":"IF(Results!C12=\"\",\"\",Results!C12)","v":""},{"$f":"IF(Results!$C12=\"\",\"\",IF(Results!$H$2>=1,VALUE(VLOOKUP($B13,Group1!$I$4:$K$103,3)),0))","v":""},{"$f":"IF(Results!$C12=\"\",\"\",IF(Results!$H$2>=2,VALUE(VLOOKUP($B13,Group2!$I$4:$K$103,3)),0))","v":""},{"$f":"IF(Results!$C12=\"\",\"\",IF(Results!$H$2>=3,VALUE(VLOOKUP($B13,Group3!$I$4:$K$103,3)),0))","v":""},{"$f":"IF(Results!$C12=\"\",\"\",IF(Results!$H$2>=4,VALUE(VLOOKUP($B13,Group4!$I$4:$K$103,3)),0))","v":""},{"$f":"IF(Results!$C12=\"\",\"\",SUM(D13:G13))","v":""},{"$f":"IF(Results!E12=\"\",\"\",Results!E12)","v":""},{"$f":"IF(Results!F12=\"\",\"\",Results!F12)","v":""},"",{"$f":"IF(Results!$I12=\"\",\"\",Results!$I12)","v":""}]
[null,10,{"$f":"IF(Results!C13=\"\",\"\",Results!C13)","v":""},{"$f":"IF(Results!$C13=\"\",\"\",IF(Results!$H$2>=1,VALUE(VLOOKUP($B14,Group1!$I$4:$K$103,3)),0))","v":""},{"$f":"IF(Results!$C13=\"\",\"\",IF(Results!$H$2>=2,VALUE(VLOOKUP($B14,Group2!$I$4:$K$103,3)),0))","v":""},{"$f":"IF(Results!$C13=\"\",\"\",IF(Results!$H$2>=3,VALUE(VLOOKUP($B14,Group3!$I$4:$K$103,3)),0))","v":""},{"$f":"IF(Results!$C13=\"\",\"\",IF(Results!$H$2>=4,VALUE(VLOOKUP($B14,Group4!$I$4:$K$103,3)),0))","v":""},{"$f":"IF(Results!$C13=\"\",\"\",SUM(D14:G14))","v":""},{"$f":"IF(Results!E13=\"\",\"\",Results!E13)","v":""},{"$f":"IF(Results!F13=\"\",\"\",Results!F13)","v":""},"",{"$f":"IF(Results!$I13=\"\",\"\",Results!$I13)","v":""}]
[null,11,{"$f":"IF(Results!C14=\"\",\"\",Results!C14)","v":""},{"$f":"IF(Results!$C14=\"\",\"\",IF(Results!$H$2>=1,VALUE(VLOOKUP($B15,Group1!$I$4:$K$103,3)),0))","v":""},{"$f":"IF(Results!$C14=\"\",\"\",IF(Results!$H$2>=2,VALUE(VLOOKUP($B15,Group2!$I$4:$K$103,3)),0))","v":""},{"$f":"IF(Results!$C14=\"\",\"\",IF(Results!$H$2>=3,VALUE(VLOOKUP($B15,Group3!$I$4:$K$103,3)),0))","v":""},{"$f":"IF(Results!$C14=\"\",\"\",IF(Results!$H$2>=4,VALUE(VLOOKUP($B15,Group4!$I$4:$K$103,3)),0))","v":""},{"$f":"IF(Results!$C14=\"\",\"\",SUM(D15:G15))","v":""},{"$f":"IF(Results!E14=\"\",\"\",Results!E14)","v":""},{"$f":"IF(Results!F14=\"\",\"\",Results!F14)","v":""},"",{"$f":"IF(Results!$I14=\"\",\"\",Results!$I14)","v":""}]
[null,12,{"$f":"IF(Results!C15=\"\",\"\",Results!C15)","v":""},{"$f":"IF(Results!$C15=\"\",\"\",IF(Results!$H$2>=1,VALUE(VLOOKUP($B16,Group1!$I$4:$K$103,3)),0))","v":""},{"$f":"IF(Results!$C15=\"\",\"\",IF(Results!$H$2>=2,VALUE(VLOOKUP($B16,Group2!$I$4:$K$103,3)),0))","v":""},{"$f":"IF(Results!$C15=\"\",\"\",IF(Results!$H$2>=3,VALUE(VLOOKUP($B16,Group3!$I$4:$K$103,3)),0))","v":""},{"$f":"IF(Results!$C15=\"\",\"\",IF(Results!$H$2>=4,VALUE(VLOOKUP($B16,Group4!$I$4:$K$103,3)),0))","v":""},{"$f":"IF(Results!$C15=\"\",\"\",SUM(D16:G16))","v":""},{"$f":"IF(Results!E15=\"\",\"\",Results!E15)","v":""},{"$f":"IF(Results!F15=\"\",\"\",Results!F15)","v":""},"",{"$f":"IF(Results!$I15=\"\",\"\",Results!$I15)","v":""}]
[null,13,{"$f":"IF(Results!C16=\"\",\"\",Results!C16)","v":""},{"$f":"IF(Results!$C16=\"\",\"\",IF(Results!$H$2>=1,VALUE(VLOOKUP($B17,Group1!$I$4:$K$103,3)),0))","v":""},{"$f":"IF(Results!$C16=\"\",\"\",IF(Results!$H$2>=2,VALUE(VLOOKUP($B17,Group2!$I$4:$K$103,3)),0))","v":""},{"$f":"IF(Results!$C16=\"\",\"\",IF(Results!$H$2>=3,VALUE(VLOOKUP($B17,Group3!$I$4:$K$103,3)),0))","v":""},{"$f":"IF(Results!$C16=\"\",\"\",IF(Results!$H$2>=4,VALUE(VLOOKUP($B17,Group4!$I$4:$K$103,3)),0))","v":""},{"$f":"IF(Results!$C16=\"\",\"\",SUM(D17:G17))","v":""},{"$f":"IF(Results!E16=\"\",\"\",Results!E16)","v":""},{"$f":"IF(Results!F16=\"\",\"\",Results!F16)","v":""},"",{"$f":"IF(Results!$I16=\"\",\"\",Results!$I16)","v":""}]
[null,14,{"$f":"IF(Results!C17=\"\",\"\",Results!C17)","v":""},{"$f":"IF(Results!$C17=\"\",\"\",IF(Results!$H$2>=1,VALUE(VLOOKUP($B18,Group1!$I$4:$K$103,3)),0))","v":""},{"$f":"IF(Results!$C17=\"\",\"\",IF(Results!$H$2>=2,VALUE(VLOOKUP($B18,Group2!$I$4:$K$103,3)),0))","v":""},{"$f":"IF(Results!$C17=\"\",\"\",IF(Results!$H$2>=3,VALUE(VLOOKUP($B18,Group3!$I$4:$K$103,3)),0))","v":""},{"$f":"IF(Results!$C17=\"\",\"\",IF(Results!$H$2>=4,VALUE(VLOOKUP($B18,Group4!$I$4:$K$103,3)),0))","v":""},{"$f":"IF(Results!$C17=\"\",\"\",SUM(D18:G18))","v":""},{"$f":"IF(Results!E17=\"\",\"\",Results!E17)","v":""},{"$f":"IF(Results!F17=\"\",\"\",Results!F17)","v":""},"",{"$f":"IF(Results!$I17=\"\",\"\",Results!$I17)","v":""}]
[null,15,{"$f":"IF(Results!C18=\"\",\"\",Results!C18)","v":""},{"$f":"IF(Results!$C18=\"\",\"\",IF(Results!$H$2>=1,VALUE(VLOOKUP($B19,Group1!$I$4:$K$103,3)),0))","v":""},{"$f":"IF(Results!$C18=\"\",\"\",IF(Results!$H$2>=2,VALUE(VLOOKUP($B19,Group2!$I$4:$K$103,3)),0))","v":""},{"$f":"IF(Results!$C18=\"\",\"\",IF(Results!$H$2>=3,VALUE(VLOOKUP($B19,Group3!$I$4:$K$103,3)),0))","v":""},{"$f":"IF(Results!$C18=\"\",\"\",IF(Results!$H$2>=4,VALUE(VLOOKUP($B19,Group4!$I$4:$K$103,3)),0))","v":""},{"$f":"IF(Results!$C18=\"\",\"\",SUM(D19:G19))","v":""},{"$f":"IF(Results!E18=\"\",\"\",Results!E18)","v":""},{"$f":"IF(Results!F18=\"\",\"\",Results!F18)","v":""},"",{"$f":"IF(Results!$I18=\"\",\"\",Results!$I18)","v":""}]
[null,16,{"$f":"IF(Results!C19=\"\",\"\",Results!C19)","v":""},{"$f":"IF(Results!$C19=\"\",\"\",IF(Results!$H$2>=1,VALUE(VLOOKUP($B20,Group1!$I$4:$K$103,3)),0))","v":""},{"$f":"IF(Results!$C19=\"\",\"\",IF(Results!$H$2>=2,VALUE(VLOOKUP($B20,Group2!$I$4:$K$103,3)),0))","v":""},{"$f":"IF(Results!$C19=\"\",\"\",IF(Results!$H$2>=3,VALUE(VLOOKUP($B20,Group3!$I$4:$K$103,3)),0))","v":""},{"$f":"IF(Results!$C19=\"\",\"\",IF(Results!$H$2>=4,VALUE(VLOOKUP($B20,Group4!$I$4:$K$103,3)),0))","v":""},{"$f":"IF(Results!$C19=\"\",\"\",SUM(D20:G20))","v":""},{"$f":"IF(Results!E19=\"\",\"\",Results!E19)","v":""},{"$f":"IF(Results!F19=\"\",\"\",Results!F19)","v":""},"",{"$f":"IF(Results!$I19=\"\",\"\",Results!$I19)","v":""}]
[null,17,{"$f":"IF(Results!C20=\"\",\"\",Results!C20)","v":""},{"$f":"IF(Results!$C20=\"\",\"\",IF(Results!$H$2>=1,VALUE(VLOOKUP($B21,Group1!$I$4:$K$103,3)),0))","v":""},{"$f":"IF(Results!$C20=\"\",\"\",IF(Results!$H$2>=2,VALUE(VLOOKUP($B21,Group2!$I$4:$K$103,3)),0))","v":""},{"$f":"IF(Results!$C20=\"\",\"\",IF(Results!$H$2>=3,VALUE(VLOOKUP($B21,Group3!$I$4:$K$103,3)),0))","v":""},{"$f":"IF(Results!$C20=\"\",\"\",IF(Results!$H$2>=4,VALUE(VLOOKUP($B21,Group4!$I$4:$K$103,3)),0))","v":""},{"$f":"IF(Results!$C20=\"\",\"\",SUM(D21:G21))","v":""},{"$f":"IF(Results!E20=\"\",\"\",Results!E20)","v":""},{"$f":"IF(Results!F20=\"\",\"\",Results!F20)","v":""},"",{"$f":"IF(Results!$I20=\"\",\"\",Results!$I20)","v":""}]
[null,18,{"$f":"IF(Results!C21=\"\",\"\",Results!C21)","v":""},{"$f":"IF(Results!$C21=\"\",\"\",IF(Results!$H$2>=1,VALUE(VLOOKUP($B22,Group1!$I$4:$K$103,3)),0))","v":""},{"$f":"IF(Results!$C21=\"\",\"\",IF(Results!$H$2>=2,VALUE(VLOOKUP($B22,Group2!$I$4:$K$103,3)),0))","v":""},{"$f":"IF(Results!$C21=\"\",\"\",IF(Results!$H$2>=3,VALUE(VLOOKUP($B22,Group3!$I$4:$K$103,3)),0))","v":""},{"$f":"IF(Results!$C21=\"\",\"\",IF(Results!$H$2>=4,VALUE(VLOOKUP($B22,Group4!$I$4:$K$103,3)),0))","v":""},{"$f":"IF(Results!$C21=\"\",\"\",SUM(D22:G22))","v":""},{"$f":"IF(Results!E21=\"\",\"\",Results!E21)","v":""},{"$f":"IF(Results!F21=\"\",\"\",Results!F21)","v":""},"",{"$f":"IF(Results!$I21=\"\",\"\",Results!$I21)","v":""}]
[null,19,{"$f":"IF(Results!C22=\"\",\"\",Results!C22)","v":""},{"$f":"IF(Results!$C22=\"\",\"\",IF(Results!$H$2>=1,VALUE(VLOOKUP($B23,Group1!$I$4:$K$103,3)),0))","v":""},{"$f":"IF(Results!$C22=\"\",\"\",IF(Results!$H$2>=2,VALUE(VLOOKUP($B23,Group2!$I$4:$K$103,3)),0))","v":""},{"$f":"IF(Results!$C22=\"\",\"\",IF(Results!$H$2>=3,VALUE(VLOOKUP($B23,Group3!$I$4:$K$103,3)),0))","v":""},{"$f":"IF(Results!$C22=\"\",\"\",IF(Results!$H$2>=4,VALUE(VLOOKUP($B23,Group4!$I$4:$K$103,3)),0))","v":""},{"$f":"IF(Results!$C22=\"\",\"\",SUM(D23:G23))","v":""},{"$f":"IF(Results!E22=\"\",\"\",Results!E22)","v":""},{"$f":"IF(Results!F22=\"\",\"\",Results!F22)","v":""},"",{"$f":"IF(Results!$I22=\"\",\"\",Results!$I22)","v":""}]
[null,20,{"$f":"IF(Results!C23=\"\",\"\",Results!C23)","v":""},{"$f":"IF(Results!$C23=\"\",\"\",IF(Results!$H$2>=1,VALUE(VLOOKUP($B24,Group1!$I$4:$K$103,3)),0))","v":""},{"$f":"IF(Results!$C23=\"\",\"\",IF(Results!$H$2>=2,VALUE(VLOOKUP($B24,Group2!$I$4:$K$103,3)),0))","v":""},{"$f":"IF(Results!$C23=\"\",\"\",IF(Results!$H$2>=3,VALUE(VLOOKUP($B24,Group3!$I$4:$K$103,3)),0))","v":""},{"$f":"IF(Results!$C23=\"\",\"\",IF(Results!$H$2>=4,VALUE(VLOOKUP($B24,Group4!$I$4:$K$103,3)),0))","v":""},{"$f":"IF(Results!$C23=\"\",\"\",SUM(D24:G24))","v":""},{"$f":"IF(Results!E23=\"\",\"\",Results!E23)","v":""},{"$f":"IF(Results!F23=\"\",\"\",Results!F23)","v":""},"",{"$f":"IF(Results!$I23=\"\",\"\",Results!$I23)","v":""}]
[null,21,{"$f":"IF(Results!C24=\"\",\"\",Results!C24)","v":""},{"$f":"IF(Results!$C24=\"\",\"\",IF(Results!$H$2>=1,VALUE(VLOOKUP($B25,Group1!$I$4:$K$103,3)),0))","v":""},{"$f":"IF(Results!$C24=\"\",\"\",IF(Results!$H$2>=2,VALUE(VLOOKUP($B25,Group2!$I$4:$K$103,3)),0))","v":""},{"$f":"IF(Results!$C24=\"\",\"\",IF(Results!$H$2>=3,VALUE(VLOOKUP($B25,Group3!$I$4:$K$103,3)),0))","v":""},{"$f":"IF(Results!$C24=\"\",\"\",IF(Results!$H$2>=4,VALUE(VLOOKUP($B25,Group4!$I$4:$K$103,3)),0))","v":""},{"$f":"IF(Results!$C24=\"\",\"\",SUM(D25:G25))","v":""},{"$f":"IF(Results!E24=\"\",\"\",Results!E24)","v":""},{"$f":"IF(Results!F24=\"\",\"\",Results!F24)","v":""},"",{"$f":"IF(Results!$I24=\"\",\"\",Results!$I24)","v":""}]
[null,22,{"$f":"IF(Results!C25=\"\",\"\",Results!C25)","v":""},{"$f":"IF(Results!$C25=\"\",\"\",IF(Results!$H$2>=1,VALUE(VLOOKUP($B26,Group1!$I$4:$K$103,3)),0))","v":""},{"$f":"IF(Results!$C25=\"\",\"\",IF(Results!$H$2>=2,VALUE(VLOOKUP($B26,Group2!$I$4:$K$103,3)),0))","v":""},{"$f":"IF(Results!$C25=\"\",\"\",IF(Results!$H$2>=3,VALUE(VLOOKUP($B26,Group3!$I$4:$K$103,3)),0))","v":""},{"$f":"IF(Results!$C25=\"\",\"\",IF(Results!$H$2>=4,VALUE(VLOOKUP($B26,Group4!$I$4:$K$103,3)),0))","v":""},{"$f":"IF(Results!$C25=\"\",\"\",SUM(D26:G26))","v":""},{"$f":"IF(Results!E25=\"\",\"\",Results!E25)","v":""},{"$f":"IF(Results!F25=\"\",\"\",Results!F25)","v":""},"",{"$f":"IF(Results!$I25=\"\",\"\",Results!$I25)","v":""}]
[null,23,{"$f":"IF(Results!C26=\"\",\"\",Results!C26)","v":""},{"$f":"IF(Results!$C26=\"\",\"\",IF(Results!$H$2>=1,VALUE(VLOOKUP($B27,Group1!$I$4:$K$103,3)),0))","v":""},{"$f":"IF(Results!$C26=\"\",\"\",IF(Results!$H$2>=2,VALUE(VLOOKUP($B27,Group2!$I$4:$K$103,3)),0))","v":""},{"$f":"IF(Results!$C26=\"\",\"\",IF(Results!$H$2>=3,VALUE(VLOOKUP($B27,Group3!$I$4:$K$103,3)),0))","v":""},{"$f":"IF(Results!$C26=\"\",\"\",IF(Results!$H$2>=4,VALUE(VLOOKUP($B27,Group4!$I$4:$K$103,3)),0))","v":""},{"$f":"IF(Results!$C26=\"\",\"\",SUM(D27:G27))","v":""},{"$f":"IF(Results!E26=\"\",\"\",Results!E26)","v":""},{"$f":"IF(Results!F26=\"\",\"\",Results!F26)","v":""},"",{"$f":"IF(Results!$I26=\"\",\"\",Results!$I26)","v":""}]
[null,24,{"$f":"IF(Results!C27=\"\",\"\",Results!C27)","v":""},{"$f":"IF(Results!$C27=\"\",\"\",IF(Results!$H$2>=1,VALUE(VLOOKUP($B28,Group1!$I$4:$K$103,3)),0))","v":""},{"$f":"IF(Results!$C27=\"\",\"\",IF(Results!$H$2>=2,VALUE(VLOOKUP($B28,Group2!$I$4:$K$103,3)),0))","v":""},{"$f":"IF(Results!$C27=\"\",\"\",IF(Results!$H$2>=3,VALUE(VLOOKUP($B28,Group3!$I$4:$K$103,3)),0))","v":""},{"$f":"IF(Results!$C27=\"\",\"\",IF(Results!$H$2>=4,VALUE(VLOOKUP($B28,Group4!$I$4:$K$103,3)),0))","v":""},{"$f":"IF(Results!$C27=\"\",\"\",SUM(D28:G28))","v":""},{"$f":"IF(Results!E27=\"\",\"\",Results!E27)","v":""},{"$f":"IF(Results!F27=\"\",\"\",Results!F27)","v":""},"",{"$f":"IF(Results!$I27=\"\",\"\",Results!$I27)","v":""}]
[null,25,{"$f":"IF(Results!C28=\"\",\"\",Results!C28)","v":""},{"$f":"IF(Results!$C28=\"\",\"\",IF(Results!$H$2>=1,VALUE(VLOOKUP($B29,Group1!$I$4:$K$103,3)),0))","v":""},{"$f":"IF(Results!$C28=\"\",\"\",IF(Results!$H$2>=2,VALUE(VLOOKUP($B29,Group2!$I$4:$K$103,3)),0))","v":""},{"$f":"IF(Results!$C28=\"\",\"\",IF(Results!$H$2>=3,VALUE(VLOOKUP($B29,Group3!$I$4:$K$103,3)),0))","v":""},{"$f":"IF(Results!$C28=\"\",\"\",IF(Results!$H$2>=4,VALUE(VLOOKUP($B29,Group4!$I$4:$K$103,3)),0))","v":""},{"$f":"IF(Results!$C28=\"\",\"\",SUM(D29:G29))","v":""},{"$f":"IF(Results!E28=\"\",\"\",Results!E28)","v":""},{"$f":"IF(Results!F28=\"\",\"\",Results!F28)","v":""},"",{"$f":"IF(Results!$I28=\"\",\"\",Results!$I28)","v":""}]
[null,26,{"$f":"IF(Results!C29=\"\",\"\",Results!C29)","v":""},{"$f":"IF(Results!$C29=\"\",\"\",IF(Results!$H$2>=1,VALUE(VLOOKUP($B30,Group1!$I$4:$K$103,3)),0))","v":""},{"$f":"IF(Results!$C29=\"\",\"\",IF(Results!$H$2>=2,VALUE(VLOOKUP($B30,Group2!$I$4:$K$103,3)),0))","v":""},{"$f":"IF(Results!$C29=\"\",\"\",IF(Results!$H$2>=3,VALUE(VLOOKUP($B30,Group3!$I$4:$K$103,3)),0))","v":""},{"$f":"IF(Results!$C29=\"\",\"\",IF(Results!$H$2>=4,VALUE(VLOOKUP($B30,Group4!$I$4:$K$103,3)),0))","v":""},{"$f":"IF(Results!$C29=\"\",\"\",SUM(D30:G30))","v":""},{"$f":"IF(Results!E29=\"\",\"\",Results!E29)","v":""},{"$f":"IF(Results!F29=\"\",\"\",Results!F29)","v":""},"",{"$f":"IF(Results!$I29=\"\",\"\",Results!$I29)","v":""}]
[null,27,{"$f":"IF(Results!C30=\"\",\"\",Results!C30)","v":""},{"$f":"IF(Results!$C30=\"\",\"\",IF(Results!$H$2>=1,VALUE(VLOOKUP($B31,Group1!$I$4:$K$103,3)),0))","v":""},{"$f":"IF(Results!$C30=\"\",\"\",IF(Results!$H$2>=2,VALUE(VLOOKUP($B31,Group2!$I$4:$K$103,3)),0))","v":""},{"$f":"IF(Results!$C30=\"\",\"\",IF(Results!$H$2>=3,VALUE(VLOOKUP($B31,Group3!$I$4:$K$103,3)),0))","v":""},{"$f":"IF(Results!$C30=\"\",\"\",IF(Results!$H$2>=4,VALUE(VLOOKUP($B31,Group4!$I$4:$K$103,3)),0))","v":""},{"$f":"IF(Results!$C30=\"\",\"\",SUM(D31:G31))","v":""},{"$f":"IF(Results!E30=\"\",\"\",Results!E30)","v":""},{"$f":"IF(Results!F30=\"\",\"\",Results!F30)","v":""},"",{"$f":"IF(Results!$I30=\"\",\"\",Results!$I30)","v":""}]
[null,28,{"$f":"IF(Results!C31=\"\",\"\",Results!C31)","v":""},{"$f":"IF(Results!$C31=\"\",\"\",IF(Results!$H$2>=1,VALUE(VLOOKUP($B32,Group1!$I$4:$K$103,3)),0))","v":""},{"$f":"IF(Results!$C31=\"\",\"\",IF(Results!$H$2>=2,VALUE(VLOOKUP($B32,Group2!$I$4:$K$103,3)),0))","v":""},{"$f":"IF(Results!$C31=\"\",\"\",IF(Results!$H$2>=3,VALUE(VLOOKUP($B32,Group3!$I$4:$K$103,3)),0))","v":""},{"$f":"IF(Results!$C31=\"\",\"\",IF(Results!$H$2>=4,VALUE(VLOOKUP($B32,Group4!$I$4:$K$103,3)),0))","v":""},{"$f":"IF(Results!$C31=\"\",\"\",SUM(D32:G32))","v":""},{"$f":"IF(Results!E31=\"\",\"\",Results!E31)","v":""},{"$f":"IF(Results!F31=\"\",\"\",Results!F31)","v":""},"",{"$f":"IF(Results!$I31=\"\",\"\",Results!$I31)","v":""}]
[null,29,{"$f":"IF(Results!C32=\"\",\"\",Results!C32)","v":""},{"$f":"IF(Results!$C32=\"\",\"\",IF(Results!$H$2>=1,VALUE(VLOOKUP($B33,Group1!$I$4:$K$103,3)),0))","v":""},{"$f":"IF(Results!$C32=\"\",\"\",IF(Results!$H$2>=2,VALUE(VLOOKUP($B33,Group2!$I$4:$K$103,3)),0))","v":""},{"$f":"IF(Results!$C32=\"\",\"\",IF(Results!$H$2>=3,VALUE(VLOOKUP($B33,Group3!$I$4:$K$103,3)),0))","v":""},{"$f":"IF(Results!$C32=\"\",\"\",IF(Results!$H$2>=4,VALUE(VLOOKUP($B33,Group4!$I$4:$K$103,3)),0))","v":""},{"$f":"IF(Results!$C32=\"\",\"\",SUM(D33:G33))","v":""},{"$f":"IF(Results!E32=\"\",\"\",Results!E32)","v":""},{"$f":"IF(Results!F32=\"\",\"\",Results!F32)","v":""},"",{"$f":"IF(Results!$I32=\"\",\"\",Results!$I32)","v":""}]
[null,30,{"$f":"IF(Results!C33=\"\",\"\",Results!C33)","v":""},{"$f":"IF(Results!$C33=\"\",\"\",IF(Results!$H$2>=1,VALUE(VLOOKUP($B34,Group1!$I$4:$K$103,3)),0))","v":""},{"$f":"IF(Results!$C33=\"\",\"\",IF(Results!$H$2>=2,VALUE(VLOOKUP($B34,Group2!$I$4:$K$103,3)),0))","v":""},{"$f":"IF(Results!$C33=\"\",\"\",IF(Results!$H$2>=3,VALUE(VLOOKUP($B34,Group3!$I$4:$K$103,3)),0))","v":""},{"$f":"IF(Results!$C33=\"\",\"\",IF(Results!$H$2>=4,VALUE(VLOOKUP($B34,Group4!$I$4:$K$103,3)),0))","v":""},{"$f":"IF(Results!$C33=\"\",\"\",SUM(D34:G34))","v":""},{"$f":"IF(Results!E33=\"\",\"\",Results!E33)","v":""},{"$f":"IF(Results!F33=\"\",\"\",Results!F33)","v":""},"",{"$f":"IF(Results!$I33=\"\",\"\",Results!$I33)","v":""}]
[null,31,{"$f":"IF(Results!C34=\"\",\"\",Results!C34)","v":""},{"$f":"IF(Results!$C34=\"\",\"\",IF(Results!$H$2>=1,VALUE(VLOOKUP($B35,Group1!$I$4:$K$103,3)),0))","v":""},{"$f":"IF(Results!$C34=\"\",\"\",IF(Results!$H$2>=2,VALUE(VLOOKUP($B35,Group2!$I$4:$K$103,3)),0))","v":""},{"$f":"IF(Results!$C34=\"\",\"\",IF(Results!$H$2>=3,VALUE(VLOOKUP($B35,Group3!$I$4:$K$103,3)),0))","v":""},{"$f":"IF(Results!$C34=\"\",\"\",IF(Results!$H$2>=4,VALUE(VLOOKUP($B35,Group4!$I$4:$K$103,3)),0))","v":""},{"$f":"IF(Results!$C34=\"\",\"\",SUM(D35:G35))","v":""},{"$f":"IF(Results!E34=\"\",\"\",Results!E34)","v":""},{"$f":"IF(Results!F34=\"\",\"\",Results!F34)","v":""},{"$f":"IF(C35=\"\",\"\",SUM(H35:J35))","v":""},{"$f":"IF(Results!$I34=\"\",\"\",Results!$I34)","v":""}]
[null,32,{"$f":"IF(Results!C35=\"\",\"\",Results!C35)","v":""},{"$f":"IF(Results!$C35=\"\",\"\",IF(Results!$H$2>=1,VALUE(VLOOKUP($B36,Group1!$I$4:$K$103,3)),0))","v":""},{"$f":"IF(Results!$C35=\"\",\"\",IF(Results!$H$2>=2,VALUE(VLOOKUP($B36,Group2!$I$4:$K$103,3)),0))","v":""},{"$f":"IF(Results!$C35=\"\",\"\",IF(Results!$H$2>=3,VALUE(VLOOKUP($B36,Group3!$I$4:$K$103,3)),0))","v":""},{"$f":"IF(Results!$C35=\"\",\"\",IF(Results!$H$2>=4,VALUE(VLOOKUP($B36,Group4!$I$4:$K$103,3)),0))","v":""},{"$f":"IF(Results!$C35=\"\",\"\",SUM(D36:G36))","v":""},{"$f":"IF(Results!E35=\"\",\"\",Results!E35)","v":""},{"$f":"IF(Results!F35=\"\",\"\",Results!F35)","v":""},"",{"$f":"IF(Results!$I35=\"\",\"\",Results!$I35)","v":""}]
[null,33,{"$f":"IF(Results!C36=\"\",\"\",Results!C36)","v":""},{"$f":"IF(Results!$C36=\"\",\"\",IF(Results!$H$2>=1,VALUE(VLOOKUP($B37,Group1!$I$4:$K$103,3)),0))","v":""},{"$f":"IF(Results!$C36=\"\",\"\",IF(Results!$H$2>=2,VALUE(VLOOKUP($B37,Group2!$I$4:$K$103,3)),0))","v":""},{"$f":"IF(Results!$C36=\"\",\"\",IF(Results!$H$2>=3,VALUE(VLOOKUP($B37,Group3!$I$4:$K$103,3)),0))","v":""},{"$f":"IF(Results!$C36=\"\",\"\",IF(Results!$H$2>=4,VALUE(VLOOKUP($B37,Group4!$I$4:$K$103,3)),0))","v":""},{"$f":"IF(Results!$C36=\"\",\"\",SUM(D37:G37))","v":""},{"$f":"IF(Results!E36=\"\",\"\",Results!E36)","v":""},{"$f":"IF(Results!F36=\"\",\"\",Results!F36)","v":""},"",{"$f":"IF(Results!$I36=\"\",\"\",Results!$I36)","v":""}]
[null,34,{"$f":"IF(Results!C37=\"\",\"\",Results!C37)","v":""},{"$f":"IF(Results!$C37=\"\",\"\",IF(Results!$H$2>=1,VALUE(VLOOKUP($B38,Group1!$I$4:$K$103,3)),0))","v":""},{"$f":"IF(Results!$C37=\"\",\"\",IF(Results!$H$2>=2,VALUE(VLOOKUP($B38,Group2!$I$4:$K$103,3)),0))","v":""},{"$f":"IF(Results!$C37=\"\",\"\",IF(Results!$H$2>=3,VALUE(VLOOKUP($B38,Group3!$I$4:$K$103,3)),0))","v":""},{"$f":"IF(Results!$C37=\"\",\"\",IF(Results!$H$2>=4,VALUE(VLOOKUP($B38,Group4!$I$4:$K$103,3)),0))","v":""},{"$f":"IF(Results!$C37=\"\",\"\",SUM(D38:G38))","v":""},{"$f":"IF(Results!E37=\"\",\"\",Results!E37)","v":""},{"$f":"IF(Results!F37=\"\",\"\",Results!F37)","v":""},"",{"$f":"IF(Results!$I37=\"\",\"\",Results!$I37)","v":""}]
[null,35,{"$f":"IF(Results!C38=\"\",\"\",Results!C38)","v":""},{"$f":"IF(Results!$C38=\"\",\"\",IF(Results!$H$2>=1,VALUE(VLOOKUP($B39,Group1!$I$4:$K$103,3)),0))","v":""},{"$f":"IF(Results!$C38=\"\",\"\",IF(Results!$H$2>=2,VALUE(VLOOKUP($B39,Group2!$I$4:$K$103,3)),0))","v":""},{"$f":"IF(Results!$C38=\"\",\"\",IF(Results!$H$2>=3,VALUE(VLOOKUP($B39,Group3!$I$4:$K$103,3)),0))","v":""},{"$f":"IF(Results!$C38=\"\",\"\",IF(Results!$H$2>=4,VALUE(VLOOKUP($B39,Group4!$I$4:$K$103,3)),0))","v":""},{"$f":"IF(Results!$C38=\"\",\"\",SUM(D39:G39))","v":""},{"$f":"IF(Results!E38=\"\",\"\",Results!E38)","v":""},{"$f":"IF(Results!F38=\"\",\"\",Results!F38)","v":""},"",{"$f":"IF(Results!$I38=\"\",\"\",Results!$I38)","v":""}]
[null,36,{"$f":"IF(Results!C39=\"\",\"\",Results!C39)","v":""},{"$f":"IF(Results!$C39=\"\",\"\",IF(Results!$H$2>=1,VALUE(VLOOKUP($B40,Group1!$I$4:$K$103,3)),0))","v":""},{"$f":"IF(Results!$C39=\"\",\"\",IF(Results!$H$2>=2,VALUE(VLOOKUP($B40,Group2!$I$4:$K$103,3)),0))","v":""},{"$f":"IF(Results!$C39=\"\",\"\",IF(Results!$H$2>=3,VALUE(VLOOKUP($B40,Group3!$I$4:$K$103,3)),0))","v":""},{"$f":"IF(Results!$C39=\"\",\"\",IF(Results!$H$2>=4,VALUE(VLOOKUP($B40,Group4!$I$4:$K$103,3)),0))","v":""},{"$f":"IF(Results!$C39=\"\",\"\",SUM(D40:G40))","v":""},{"$f":"IF(Results!E39=\"\",\"\",Results!E39)","v":""},{"$f":"IF(Results!F39=\"\",\"\",Results!F39)","v":""},"",{"$f":"IF(Results!$I39=\"\",\"\",Results!$I39)","v":""}]
[null,37,{"$f":"IF(Results!C40=\"\",\"\",Results!C40)","v":""},{"$f":"IF(Results!$C40=\"\",\"\",IF(Results!$H$2>=1,VALUE(VLOOKUP($B41,Group1!$I$4:$K$103,3)),0))","v":""},{"$f":"IF(Results!$C40=\"\",\"\",IF(Results!$H$2>=2,VALUE(VLOOKUP($B41,Group2!$I$4:$K$103,3)),0))","v":""},{"$f":"IF(Results!$C40=\"\",\"\",IF(Results!$H$2>=3,VALUE(VLOOKUP($B41,Group3!$I$4:$K$103,3)),0))","v":""},{"$f":"IF(Results!$C40=\"\",\"\",IF(Results!$H$2>=4,VALUE(VLOOKUP($B41,Group4!$I$4:$K$103,3)),0))","v":""},{"$f":"IF(Results!$C40=\"\",\"\",SUM(D41:G41))","v":""},{"$f":"IF(Results!E40=\"\",\"\",Results!E40)","v":""},{"$f":"IF(Results!F40=\"\",\"\",Results!F40)","v":""},"",{"$f":"IF(Results!$I40=\"\",\"\",Results!$I40)","v":""}]
[null,38,{"$f":"IF(Results!C41=\"\",\"\",Results!C41)","v":""},{"$f":"IF(Results!$C41=\"\",\"\",IF(Results!$H$2>=1,VALUE(VLOOKUP($B42,Group1!$I$4:$K$103,3)),0))","v":""},{"$f":"IF(Results!$C41=\"\",\"\",IF(Results!$H$2>=2,VALUE(VLOOKUP($B42,Group2!$I$4:$K$103,3)),0))","v":""},{"$f":"IF(Results!$C41=\"\",\"\",IF(Results!$H$2>=3,VALUE(VLOOKUP($B42,Group3!$I$4:$K$103,3)),0))","v":""},{"$f":"IF(Results!$C41=\"\",\"\",IF(Results!$H$2>=4,VALUE(VLOOKUP($B42,Group4!$I$4:$K$103,3)),0))","v":""},{"$f":"IF(Results!$C41=\"\",\"\",SUM(D42:G42))","v":""},{"$f":"IF(Results!E41=\"\",\"\",Results!E41)","v":""},{"$f":"IF(Results!F41=\"\",\"\",Results!F41)","v":""},"",{"$f":"IF(Results!$I41=\"\",\"\",Results!$I41)","v":""}]
[null,39,{"$f":"IF(Results!C42=\"\",\"\",Results!C42)","v":""},{"$f":"IF(Results!$C42=\"\",\"\",IF(Results!$H$2>=1,VALUE(VLOOKUP($B43,Group1!$I$4:$K$103,3)),0))","v":""},{"$f":"IF(Results!$C42=\"\",\"\",IF(Results!$H$2>=2,VALUE(VLOOKUP($B43,Group2!$I$4:$K$103,3)),0))","v":""},{"$f":"IF(Results!$C42=\"\",\"\",IF(Results!$H$2>=3,VALUE(VLOOKUP($B43,Group3!$I$4:$K$103,3)),0))","v":""},{"$f":"IF(Results!$C42=\"\",\"\",IF(Results!$H$2>=4,VALUE(VLOOKUP($B43,Group4!$I$4:$K$103,3)),0))","v":""},{"$f":"IF(Results!$C42=\"\",\"\",SUM(D43:G43))","v":""},{"$f":"IF(Results!E42=\"\",\"\",Results!E42)","v":""},{"$f":"IF(Results!F42=\"\",\"\",Results!F42)","v":""},"",{"$f":"IF(Results!$I42=\"\",\"\",Results!$I42)","v":""}]
[null,40,{"$f":"IF(Results!C43=\"\",\"\",Results!C43)","v":""},{"$f":"IF(Results!$C43=\"\",\"\",IF(Results!$H$2>=1,VALUE(VLOOKUP($B44,Group1!$I$4:$K$103,3)),0))","v":""},{"$f":"IF(Results!$C43=\"\",\"\",IF(Results!$H$2>=2,VALUE(VLOOKUP($B44,Group2!$I$4:$K$103,3)),0))","v":""},{"$f":"IF(Results!$C43=\"\",\"\",IF(Results!$H$2>=3,VALUE(VLOOKUP($B44,Group3!$I$4:$K$103,3)),0))","v":""},{"$f":"IF(Results!$C43=\"\",\"\",IF(Results!$H$2>=4,VALUE(VLOOKUP($B44,Group4!$I$4:$K$103,3)),0))","v":""},{"$f":"IF(Results!$C43=\"\",\"\",SUM(D44:G44))","v":""},{"$f":"IF(Results!E43=\"\",\"\",Results!E43)","v":""},{"$f":"IF(Results!F43=\"\",\"\",Results!F43)","v":""},"",{"$f":"IF(Results!$I43=\"\",\"\",Results!$I43)","v":""}]
[null,41,{"$f":"IF(Results!C44=\"\",\"\",Results!C44)","v":""},{"$f":"IF(Results!$C44=\"\",\"\",IF(Results!$H$2>=1,VALUE(VLOOKUP($B45,Group1!$I$4:$K$103,3)),0))","v":""},{"$f":"IF(Results!$C44=\"\",\"\",IF(Results!$H$2>=2,VALUE(VLOOKUP($B45,Group2!$I$4:$K$103,3)),0))","v":""},{"$f":"IF(Results!$C44=\"\",\"\",IF(Results!$H$2>=3,VALUE(VLOOKUP($B45,Group3!$I$4:$K$103,3)),0))","v":""},{"$f":"IF(Results!$C44=\"\",\"\",IF(Results!$H$2>=4,VALUE(VLOOKUP($B45,Group4!$I$4:$K$103,3)),0))","v":""},{"$f":"IF(Results!$C44=\"\",\"\",SUM(D45:G45))","v":""},{"$f":"IF(Results!E44=\"\",\"\",Results!E44)","v":""},{"$f":"IF(Results!F44=\"\",\"\",Results!F44)","v":""},"",{"$f":"IF(Results!$I44=\"\",\"\",Results!$I44)","v":""}]
[null,42,{"$f":"IF(Results!C45=\"\",\"\",Results!C45)","v":""},{"$f":"IF(Results!$C45=\"\",\"\",IF(Results!$H$2>=1,VALUE(VLOOKUP($B46,Group1!$I$4:$K$103,3)),0))","v":""},{"$f":"IF(Results!$C45=\"\",\"\",IF(Results!$H$2>=2,VALUE(VLOOKUP($B46,Group2!$I$4:$K$103,3)),0))","v":""},{"$f":"IF(Results!$C45=\"\",\"\",IF(Results!$H$2>=3,VALUE(VLOOKUP($B46,Group3!$I$4:$K$103,3)),0))","v":""},{"$f":"IF(Results!$C45=\"\",\"\",IF(Results!$H$2>=4,VALUE(VLOOKUP($B46,Group4!$I$4:$K$103,3)),0))","v":""},{"$f":"IF(Results!$C45=\"\",\"\",SUM(D46:G46))","v":""},{"$f":"IF(Results!E45=\"\",\"\",Results!E45)","v":""},{"$f":"IF(Results!F45=\"\",\"\",Results!F45)","v":""},"",{"$f":"IF(Results!$I45=\"\",\"\",Results!$I45)","v":""}]
[null,43,{"$f":"IF(Results!C46=\"\",\"\",Results!C46)","v":""},{"$f":"IF(Results!$C46=\"\",\"\",IF(Results!$H$2>=1,VALUE(VLOOKUP($B47,Group1!$I$4:$K$103,3)),0))","v":""},{"$f":"IF(Results!$C46=\"\",\"\",IF(Results!$H$2>=2,VALUE(VLOOKUP($B47,Group2!$I$4:$K$103,3)),0))","v":""},{"$f":"IF(Results!$C46=\"\",\"\",IF(Results!$H$2>=3,VALUE(VLOOKUP($B47,Group3!$I$4:$K$103,3)),0))","v":""},{"$f":"IF(Results!$C46=\"\",\"\",IF(Results!$H$2>=4,VALUE(VLOOKUP($B47,Group4!$I$4:$K$103,3)),0))","v":""},{"$f":"IF(Results!$C46=\"\",\"\",SUM(D47:G47))","v":""},{"$f":"IF(Results!E46=\"\",\"\",Results!E46)","v":""},{"$f":"IF(Results!F46=\"\",\"\",Results!F46)","v":""},"",{"$f":"IF(Results!$I46=\"\",\"\",Results!$I46)","v":""}]
[null,44,{"$f":"IF(Results!C47=\"\",\"\",Results!C47)","v":""},{"$f":"IF(Results!$C47=\"\",\"\",IF(Results!$H$2>=1,VALUE(VLOOKUP($B48,Group1!$I$4:$K$103,3)),0))","v":""},{"$f":"IF(Results!$C47=\"\",\"\",IF(Results!$H$2>=2,VALUE(VLOOKUP($B48,Group2!$I$4:$K$103,3)),0))","v":""},{"$f":"IF(Results!$C47=\"\",\"\",IF(Results!$H$2>=3,VALUE(VLOOKUP($B48,Group3!$I$4:$K$103,3)),0))","v":""},{"$f":"IF(Results!$C47=\"\",\"\",IF(Results!$H$2>=4,VALUE(VLOOKUP($B48,Group4!$I$4:$K$103,3)),0))","v":""},{"$f":"IF(Results!$C47=\"\",\"\",SUM(D48:G48))","v":""},{"$f":"IF(Results!E47=\"\",\"\",Results!E47)","v":""},{"$f":"IF(Results!F47=\"\",\"\",Results!F47)","v":""},"",{"$f":"IF(Results!$I47=\"\",\"\",Results!$I47)","v":""}]
[null,45,{"$f":"IF(Results!C48=\"\",\"\",Results!C48)","v":""},{"$f":"IF(Results!$C48=\"\",\"\",IF(Results!$H$2>=1,VALUE(VLOOKUP($B49,Group1!$I$4:$K$103,3)),0))","v":""},{"$f":"IF(Results!$C48=\"\",\"\",IF(Results!$H$2>=2,VALUE(VLOOKUP($B49,Group2!$I$4:$K$103,3)),0))","v":""},{"$f":"IF(Results!$C48=\"\",\"\",IF(Results!$H$2>=3,VALUE(VLOOKUP($B49,Group3!$I$4:$K$103,3)),0))","v":""},{"$f":"IF(Results!$C48=\"\",\"\",IF(Results!$H$2>=4,VALUE(VLOOKUP($B49,Group4!$I$4:$K$103,3)),0))","v":""},{"$f":"IF(Results!$C48=\"\",\"\",SUM(D49:G49))","v":""},{"$f":"IF(Results!E48=\"\",\"\",Results!E48)","v":""},{"$f":"IF(Results!F48=\"\",\"\",Results!F48)","v":""},"",{"$f":"IF(Results!$I48=\"\",\"\",Results!$I48)","v":""}]
[null,46,{"$f":"IF(Results!C49=\"\",\"\",Results!C49)","v":""},{"$f":"IF(Results!$C49=\"\",\"\",IF(Results!$H$2>=1,VALUE(VLOOKUP($B50,Group1!$I$4:$K$103,3)),0))","v":""},{"$f":"IF(Results!$C49=\"\",\"\",IF(Results!$H$2>=2,VALUE(VLOOKUP($B50,Group2!$I$4:$K$103,3)),0))","v":""},{"$f":"IF(Results!$C49=\"\",\"\",IF(Results!$H$2>=3,VALUE(VLOOKUP($B50,Group3!$I$4:$K$103,3)),0))","v":""},{"$f":"IF(Results!$C49=\"\",\"\",IF(Results!$H$2>=4,VALUE(VLOOKUP($B50,Group4!$I$4:$K$103,3)),0))","v":""},{"$f":"IF(Results!$C49=\"\",\"\",SUM(D50:G50))","v":""},{"$f":"IF(Results!E49=\"\",\"\",Results!E49)","v":""},{"$f":"IF(Results!F49=\"\",\"\",Results!F49)","v":""},"",{"$f":"IF(Results!$I49=\"\",\"\",Results!$I49)","v":""}]
[null,47,{"$f":"IF(Results!C50=\"\",\"\",Results!C50)","v":""},{"$f":"IF(Results!$C50=\"\",\"\",IF(Results!$H$2>=1,VALUE(VLOOKUP($B51,Group1!$I$4:$K$103,3)),0))","v":""},{"$f":"IF(Results!$C50=\"\",\"\",IF(Results!$H$2>=2,VALUE(VLOOKUP($B51,Group2!$I$4:$K$103,3)),0))","v":""},{"$f":"IF(Results!$C50=\"\",\"\",IF(Results!$H$2>=3,VALUE(VLOOKUP($B51,Group3!$I$4:$K$103,3)),0))","v":""},{"$f":"IF(Results!$C50=\"\",\"\",IF(Results!$H$2>=4,VALUE(VLOOKUP($B51,Group4!$I$4:$K$103,3)),0))","v":""},{"$f":"IF(Results!$C50=\"\",\"\",SUM(D51:G51))","v":""},{"$f":"IF(Results!E50=\"\",\"\",Results!E50)","v":""},{"$f":"IF(Results!F50=\"\",\"\",Results!F50)","v":""},"",{"$f":"IF(Results!$I50=\"\",\"\",Results!$I50)","v":""}]
[null,48,{"$f":"IF(Results!C51=\"\",\"\",Results!C51)","v":""},{"$f":"IF(Results!$C51=\"\",\"\",IF(Results!$H$2>=1,VALUE(VLOOKUP($B52,Group1!$I$4:$K$103,3)),0))","v":""},{"$f":"IF(Results!$C51=\"\",\"\",IF(Results!$H$2>=2,VALUE(VLOOKUP($B52,Group2!$I$4:$K$103,3)),0))","v":""},{"$f":"IF(Results!$C51=\"\",\"\",IF(Results!$H$2>=3,VALUE(VLOOKUP($B52,Group3!$I$4:$K$103,3)),0))","v":""},{"$f":"IF(Results!$C51=\"\",\"\",IF(Results!$H$2>=4,VALUE(VLOOKUP($B52,Group4!$I$4:$K$103,3)),0))","v":""},{"$f":"IF(Results!$C51=\"\",\"\",SUM(D52:G52))","v":""},{"$f":"IF(Results!E51=\"\",\"\",Results!E51)","v":""},{"$f":"IF(Results!F51=\"\",\"\",Results!F51)","v":""},"",{"$f":"IF(Results!$I51=\"\",\"\",Results!$I51)","v":""}]
[null,49,{"$f":"IF(Results!C52=\"\",\"\",Results!C52)","v":""},{"$f":"IF(Results!$C52=\"\",\"\",IF(Results!$H$2>=1,VALUE(VLOOKUP($B53,Group1!$I$4:$K$103,3)),0))","v":""},{"$f":"IF(Results!$C52=\"\",\"\",IF(Results!$H$2>=2,VALUE(VLOOKUP($B53,Group2!$I$4:$K$103,3)),0))","v":""},{"$f":"IF(Results!$C52=\"\",\"\",IF(Results!$H$2>=3,VALUE(VLOOKUP($B53,Group3!$I$4:$K$103,3)),0))","v":""},{"$f":"IF(Results!$C52=\"\",\"\",IF(Results!$H$2>=4,VALUE(VLOOKUP($B53,Group4!$I$4:$K$103,3)),0))","v":""},{"$f":"IF(Results!$C52=\"\",\"\",SUM(D53:G53))","v":""},{"$f":"IF(Results!E52=\"\",\"\",Results!E52)","v":""},{"$f":"IF(Results!F52=\"\",\"\",Results!F52)","v":""},"",{"$f":"IF(Results!$I52=\"\",\"\",Results!$I52)","v":""}]
[null,50,{"$f":"IF(Results!C53=\"\",\"\",Results!C53)","v":""},{"$f":"IF(Results!$C53=\"\",\"\",IF(Results!$H$2>=1,VALUE(VLOOKUP($B54,Group1!$I$4:$K$103,3)),0))","v":""},{"$f":"IF(Results!$C53=\"\",\"\",IF(Results!$H$2>=2,VALUE(VLOOKUP($B54,Group2!$I$4:$K$103,3)),0))","v":""},{"$f":"IF(Results!$C53=\"\",\"\",IF(Results!$H$2>=3,VALUE(VLOOKUP($B54,Group3!$I$4:$K$103,3)),0))","v":""},{"$f":"IF(Results!$C53=\"\",\"\",IF(Results!$H$2>=4,VALUE(VLOOKUP($B54,Group4!$I$4:$K$103,3)),0))","v":""},{"$f":"IF(Results!$C53=\"\",\"\",SUM(D54:G54))","v":""},{"$f":"IF(Results!E53=\"\",\"\",Results!E53)","v":""},{"$f":"IF(Results!F53=\"\",\"\",Results!F53)","v":""},"",{"$f":"IF(Results!$I53=\"\",\"\",Results!$I53)","v":""}]
[null,51,{"$f":"IF(Results!C54=\"\",\"\",Results!C54)","v":""},{"$f":"IF(Results!$C54=\"\",\"\",IF(Results!$H$2>=1,VALUE(VLOOKUP($B55,Group1!$I$4:$K$103,3)),0))","v":""},{"$f":"IF(Results!$C54=\"\",\"\",IF(Results!$H$2>=2,VALUE(VLOOKUP($B55,Group2!$I$4:$K$103,3)),0))","v":""},{"$f":"IF(Results!$C54=\"\",\"\",IF(Results!$H$2>=3,VALUE(VLOOKUP($B55,Group3!$I$4:$K$103,3)),0))","v":""},{"$f":"IF(Results!$C54=\"\",\"\",IF(Results!$H$2>=4,VALUE(VLOOKUP($B55,Group4!$I$4:$K$103,3)),0))","v":""},{"$f":"IF(Results!$C54=\"\",\"\",SUM(D55:G55))","v":""},{"$f":"IF(Results!E54=\"\",\"\",Results!E54)","v":""},{"$f":"IF(Results!F54=\"\",\"\",Results!F54)","v":""},"",{"$f":"IF(Results!$I54=\"\",\"\",Results!$I54)","v":""}]
[null,52,{"$f":"IF(Results!C55=\"\",\"\",Results!C55)","v":""},{"$f":"IF(Results!$C55=\"\",\"\",IF(Results!$H$2>=1,VALUE(VLOOKUP($B56,Group1!$I$4:$K$103,3)),0))","v":""},{"$f":"IF(Results!$C55=\"\",\"\",IF(Results!$H$2>=2,VALUE(VLOOKUP($B56,Group2!$I$4:$K$103,3)),0))","v":""},{"$f":"IF(Results!$C55=\"\",\"\",IF(Results!$H$2>=3,VALUE(VLOOKUP($B56,Group3!$I$4:$K$103,3)),0))","v":""},{"$f":"IF(Results!$C55=\"\",\"\",IF(Results!$H$2>=4,VALUE(VLOOKUP($B56,Group4!$I$4:$K$103,3)),0))","v":""},{"$f":"IF(Results!$C55=\"\",\"\",SUM(D56:G56))","v":""},{"$f":"IF(Results!E55=\"\",\"\",Results!E55)","v":""},{"$f":"IF(Results!F55=\"\",\"\",Results!F55)","v":""},"",{"$f":"IF(Results!$I55=\"\",\"\",Results!$I55)","v":""}]
[null,53,{"$f":"IF(Results!C56=\"\",\"\",Results!C56)","v":""},{"$f":"IF(Results!$C56=\"\",\"\",IF(Results!$H$2>=1,VALUE(VLOOKUP($B57,Group1!$I$4:$K$103,3)),0))","v":""},{"$f":"IF(Results!$C56=\"\",\"\",IF(Results!$H$2>=2,VALUE(VLOOKUP($B57,Group2!$I$4:$K$103,3)),0))","v":""},{"$f":"IF(Results!$C56=\"\",\"\",IF(Results!$H$2>=3,VALUE(VLOOKUP($B57,Group3!$I$4:$K$103,3)),0))","v":""},{"$f":"IF(Results!$C56=\"\",\"\",IF(Results!$H$2>=4,VALUE(VLOOKUP($B57,Group4!$I$4:$K$103,3)),0))","v":""},{"$f":"IF(Results!$C56=\"\",\"\",SUM(D57:G57))","v":""},{"$f":"IF(Results!E56=\"\",\"\",Results!E56)","v":""},{"$f":"IF(Results!F56=\"\",\"\",Results!F56)","v":""},"",{"$f":"IF(Results!$I56=\"\",\"\",Results!$I56)","v":""}]
[null,54,{"$f":"IF(Results!C57=\"\",\"\",Results!C57)","v":""},{"$f":"IF(Results!$C57=\"\",\"\",IF(Results!$H$2>=1,VALUE(VLOOKUP($B58,Group1!$I$4:$K$103,3)),0))","v":""},{"$f":"IF(Results!$C57=\"\",\"\",IF(Results!$H$2>=2,VALUE(VLOOKUP($B58,Group2!$I$4:$K$103,3)),0))","v":""},{"$f":"IF(Results!$C57=\"\",\"\",IF(Results!$H$2>=3,VALUE(VLOOKUP($B58,Group3!$I$4:$K$103,3)),0))","v":""},{"$f":"IF(Results!$C57=\"\",\"\",IF(Results!$H$2>=4,VALUE(VLOOKUP($B58,Group4!$I$4:$K$103,3)),0))","v":""},{"$f":"IF(Results!$C57=\"\",\"\",SUM(D58:G58))","v":""},{"$f":"IF(Results!E57=\"\",\"\",Results!E57)","v":""},{"$f":"IF(Results!F57=\"\",\"\",Results!F57)","v":""},"",{"$f":"IF(Results!$I57=\"\",\"\",Results!$I57)","v":""}]
[null,55,{"$f":"IF(Results!C58=\"\",\"\",Results!C58)","v":""},{"$f":"IF(Results!$C58=\"\",\"\",IF(Results!$H$2>=1,VALUE(VLOOKUP($B59,Group1!$I$4:$K$103,3)),0))","v":""},{"$f":"IF(Results!$C58=\"\",\"\",IF(Results!$H$2>=2,VALUE(VLOOKUP($B59,Group2!$I$4:$K$103,3)),0))","v":""},{"$f":"IF(Results!$C58=\"\",\"\",IF(Results!$H$2>=3,VALUE(VLOOKUP($B59,Group3!$I$4:$K$103,3)),0))","v":""},{"$f":"IF(Results!$C58=\"\",\"\",IF(Results!$H$2>=4,VALUE(VLOOKUP($B59,Group4!$I$4:$K$103,3)),0))","v":""},{"$f":"IF(Results!$C58=\"\",\"\",SUM(D59:G59))","v":""},{"$f":"IF(Results!E58=\"\",\"\",Results!E58)","v":""},{"$f":"IF(Results!F58=\"\",\"\",Results!F58)","v":""},"",{"$f":"IF(Results!$I58=\"\",\"\",Results!$I58)","v":""}]
[null,56,{"$f":"IF(Results!C59=\"\",\"\",Results!C59)","v":""},{"$f":"IF(Results!$C59=\"\",\"\",IF(Results!$H$2>=1,VALUE(VLOOKUP($B60,Group1!$I$4:$K$103,3)),0))","v":""},{"$f":"IF(Results!$C59=\"\",\"\",IF(Results!$H$2>=2,VALUE(VLOOKUP($B60,Group2!$I$4:$K$103,3)),0))","v":""},{"$f":"IF(Results!$C59=\"\",\"\",IF(Results!$H$2>=3,VALUE(VLOOKUP($B60,Group3!$I$4:$K$103,3)),0))","v":""},{"$f":"IF(Results!$C59=\"\",\"\",IF(Results!$H$2>=4,VALUE(VLOOKUP($B60,Group4!$I$4:$K$103,3)),0))","v":""},{"$f":"IF(Results!$C59=\"\",\"\",SUM(D60:G60))","v":""},{"$f":"IF(Results!E59=\"\",\"\",Results!E59)","v":""},{"$f":"IF(Results!F59=\"\",\"\",Results!F59)","v":""},"",{"$f":"IF(Results!$I59=\"\",\"\",Results!$I59)","v":""}]
[null,57,{"$f":"IF(Results!C60=\"\",\"\",Results!C60)","v":""},{"$f":"IF(Results!$C60=\"\",\"\",IF(Results!$H$2>=1,VALUE(VLOOKUP($B61,Group1!$I$4:$K$103,3)),0))","v":""},{"$f":"IF(Results!$C60=\"\",\"\",IF(Results!$H$2>=2,VALUE(VLOOKUP($B61,Group2!$I$4:$K$103,3)),0))","v":""},{"$f":"IF(Results!$C60=\"\",\"\",IF(Results!$H$2>=3,VALUE(VLOOKUP($B61,Group3!$I$4:$K$103,3)),0))","v":""},{"$f":"IF(Results!$C60=\"\",\"\",IF(Results!$H$2>=4,VALUE(VLOOKUP($B61,Group4!$I$4:$K$103,3)),0))","v":""},{"$f":"IF(Results!$C60=\"\",\"\",SUM(D61:G61))","v":""},{"$f":"IF(Results!E60=\"\",\"\",Results!E60)","v":""},{"$f":"IF(Results!F60=\"\",\"\",Results!F60)","v":""},"",{"$f":"IF(Results!$I60=\"\",\"\",Results!$I60)","v":""}]
[null,58,{"$f":"IF(Results!C61=\"\",\"\",Results!C61)","v":""},{"$f":"IF(Results!$C61=\"\",\"\",IF(Results!$H$2>=1,VALUE(VLOOKUP($B62,Group1!$I$4:$K$103,3)),0))","v":""},{"$f":"IF(Results!$C61=\"\",\"\",IF(Results!$H$2>=2,VALUE(VLOOKUP($B62,Group2!$I$4:$K$103,3)),0))","v":""},{"$f":"IF(Results!$C61=\"\",\"\",IF(Results!$H$2>=3,VALUE(VLOOKUP($B62,Group3!$I$4:$K$103,3)),0))","v":""},{"$f":"IF(Results!$C61=\"\",\"\",IF(Results!$H$2>=4,VALUE(VLOOKUP($B62,Group4!$I$4:$K$103,3)),0))","v":""},{"$f":"IF(Results!$C61=\"\",\"\",SUM(D62:G62))","v":""},{"$f":"IF(Results!E61=\"\",\"\",Results!E61)","v":""},{"$f":"IF(Results!F61=\"\",\"\",Results!F61)","v":""},"",{"$f":"IF(Results!$I61=\"\",\"\",Results!$I61)","v":""}]
[null,59,{"$f":"IF(Results!C62=\"\",\"\",Results!C62)","v":""},{"$f":"IF(Results!$C62=\"\",\"\",IF(Results!$H$2>=1,VALUE(VLOOKUP($B63,Group1!$I$4:$K$103,3)),0))","v":""},{"$f":"IF(Results!$C62=\"\",\"\",IF(Results!$H$2>=2,VALUE(VLOOKUP($B63,Group2!$I$4:$K$103,3)),0))","v":""},{"$f":"IF(Results!$C62=\"\",\"\",IF(Results!$H$2>=3,VALUE(VLOOKUP($B63,Group3!$I$4:$K$103,3)),0))","v":""},{"$f":"IF(Results!$C62=\"\",\"\",IF(Results!$H$2>=4,VALUE(VLOOKUP($B63,Group4!$I$4:$K$103,3)),0))","v":""},{"$f":"IF(Results!$C62=\"\",\"\",SUM(D63:G63))","v":""},{"$f":"IF(Results!E62=\"\",\"\",Results!E62)","v":""},{"$f":"IF(Results!F62=\"\",\"\",Results!F62)","v":""},"",{"$f":"IF(Results!$I62=\"\",\"\",Results!$I62)","v":""}]
[null,60,{"$f":"IF(Results!C63=\"\",\"\",Results!C63)","v":""},{"$f":"IF(Results!$C63=\"\",\"\",IF(Results!$H$2>=1,VALUE(VLOOKUP($B64,Group1!$I$4:$K$103,3)),0))","v":""},{"$f":"IF(Results!$C63=\"\",\"\",IF(Results!$H$2>=2,VALUE(VLOOKUP($B64,Group2!$I$4:$K$103,3)),0))","v":""},{"$f":"IF(Results!$C63=\"\",\"\",IF(Results!$H$2>=3,VALUE(VLOOKUP($B64,Group3!$I$4:$K$103,3)),0))","v":""},{"$f":"IF(Results!$C63=\"\",\"\",IF(Results!$H$2>=4,VALUE(VLOOKUP($B64,Group4!$I$4:$K$103,3)),0))","v":""},{"$f":"IF(Results!$C63=\"\",\"\",SUM(D64:G64))","v":""},{"$f":"IF(Results!E63=\"\",\"\",Results!E63)","v":""},{"$f":"IF(Results!F63=\"\",\"\",Results!F63)","v":""},"",{"$f":"IF(Results!$I63=\"\",\"\",Results!$I63)","v":""}]
[null,61,{"$f":"IF(Results!C64=\"\",\"\",Results!C64)","v":""},{"$f":"IF(Results!$C64=\"\",\"\",IF(Results!$H$2>=1,VALUE(VLOOKUP($B65,Group1!$I$4:$K$103,3)),0))","v":""},{"$f":"IF(Results!$C64=\"\",\"\",IF(Results!$H$2>=2,VALUE(VLOOKUP($B65,Group2!$I$4:$K$103,3)),0))","v":""},{"$f":"IF(Results!$C64=\"\",\"\",IF(Results!$H$2>=3,VALUE(VLOOKUP($B65,Group3!$I$4:$K$103,3)),0))","v":""},{"$f":"IF(Results!$C64=\"\",\"\",IF(Results!$H$2>=4,VALUE(VLOOKUP($B65,Group4!$I$4:$K$103,3)),0))","v":""},{"$f":"IF(Results!$C64=\"\",\"\",SUM(D65:G65))","v":""},{"$f":"IF(Results!E64=\"\",\"\",Results!E64)","v":""},{"$f":"IF(Results!F64=\"\",\"\",Results!F64)","v":""},"",{"$f":"IF(Results!$I64=\"\",\"\",Results!$I64)","v":""}]
[null,62,{"$f":"IF(Results!C65=\"\",\"\",Results!C65)","v":""},{"$f":"IF(Results!$C65=\"\",\"\",IF(Results!$H$2>=1,VALUE(VLOOKUP($B66,Group1!$I$4:$K$103,3)),0))","v":""},{"$f":"IF(Results!$C65=\"\",\"\",IF(Results!$H$2>=2,VALUE(VLOOKUP($B66,Group2!$I$4:$K$103,3)),0))","v":""},{"$f":"IF(Results!$C65=\"\",\"\",IF(Results!$H$2>=3,VALUE(VLOOKUP($B66,Group3!$I$4:$K$103,3)),0))","v":""},{"$f":"IF(Results!$C65=\"\",\"\",IF(Results!$H$2>=4,VALUE(VLOOKUP($B66,Group4!$I$4:$K$103,3)),0))","v":""},{"$f":"IF(Results!$C65=\"\",\"\",SUM(D66:G66))","v":""},{"$f":"IF(Results!E65=\"\",\"\",Results!E65)","v":""},{"$f":"IF(Results!F65=\"\",\"\",Results!F65)","v":""},"",{"$f":"IF(Results!$I65=\"\",\"\",Results!$I65)","v":""}]
[null,63,{"$f":"IF(Results!C66=\"\",\"\",Results!C66)","v":""},{"$f":"IF(Results!$C66=\"\",\"\",IF(Results!$H$2>=1,VALUE(VLOOKUP($B67,Group1!$I$4:$K$103,3)),0))","v":""},{"$f":"IF(Results!$C66=\"\",\"\",IF(Results!$H$2>=2,VALUE(VLOOKUP($B67,Group2!$I$4:$K$103,3)),0))","v":""},{"$f":"IF(Results!$C66=\"\",\"\",IF(Results!$H$2>=3,VALUE(VLOOKUP($B67,Group3!$I$4:$K$103,3)),0))","v":""},{"$f":"IF(Results!$C66=\"\",\"\",IF(Results!$H$2>=4,VALUE(VLOOKUP($B67,Group4!$I$4:$K$103,3)),0))","v":""},{"$f":"IF(Results!$C66=\"\",\"\",SUM(D67:G67))","v":""},{"$f":"IF(Results!E66=\"\",\"\",Results!E66)","v":""},{"$f":"IF(Results!F66=\"\",\"\",Results!F66)","v":""},"",{"$f":"IF(Results!$I66=\"\",\"\",Results!$I66)","v":""}]
[null,64,{"$f":"IF(Results!C67=\"\",\"\",Results!C67)","v":""},{"$f":"IF(Results!$C67=\"\",\"\",IF(Results!$H$2>=1,VALUE(VLOOKUP($B68,Group1!$I$4:$K$103,3)),0))","v":""},{"$f":"IF(Results!$C67=\"\",\"\",IF(Results!$H$2>=2,VALUE(VLOOKUP($B68,Group2!$I$4:$K$103,3)),0))","v":""},{"$f":"IF(Results!$C67=\"\",\"\",IF(Results!$H$2>=3,VALUE(VLOOKUP($B68,Group3!$I$4:$K$103,3)),0))","v":""},{"$f":"IF(Results!$C67=\"\",\"\",IF(Results!$H$2>=4,VALUE(VLOOKUP($B68,Group4!$I$4:$K$103,3)),0))","v":""},{"$f":"IF(Results!$C67=\"\",\"\",SUM(D68:G68))","v":""},{"$f":"IF(Results!E67=\"\",\"\",Results!E67)","v":""},{"$f":"IF(Results!F67=\"\",\"\",Results!F67)","v":""},"",{"$f":"IF(Results!$I67=\"\",\"\",Results!$I67)","v":""}]
[null,65,{"$f":"IF(Results!C68=\"\",\"\",Results!C68)","v":""},{"$f":"IF(Results!$C68=\"\",\"\",IF(Results!$H$2>=1,VALUE(VLOOKUP($B69,Group1!$I$4:$K$103,3)),0))","v":""},{"$f":"IF(Results!$C68=\"\",\"\",IF(Results!$H$2>=2,VALUE(VLOOKUP($B69,Group2!$I$4:$K$103,3)),0))","v":""},{"$f":"IF(Results!$C68=\"\",\"\",IF(Results!$H$2>=3,VALUE(VLOOKUP($B69,Group3!$I$4:$K$103,3)),0))","v":""},{"$f":"IF(Results!$C68=\"\",\"\",IF(Results!$H$2>=4,VALUE(VLOOKUP($B69,Group4!$I$4:$K$103,3)),0))","v":""},{"$f":"IF(Results!$C68=\"\",\"\",SUM(D69:G69))","v":""},{"$f":"IF(Results!E68=\"\",\"\",Results!E68)","v":""},{"$f":"IF(Results!F68=\"\",\"\",Results!F68)","v":""},"",{"$f":"IF(Results!$I68=\"\",\"\",Results!$I68)","v":""}]
[null,66,{"$f":"IF(Results!C69=\"\",\"\",Results!C69)","v":""},{"$f":"IF(Results!$C69=\"\",\"\",IF(Results!$H$2>=1,VALUE(VLOOKUP($B70,Group1!$I$4:$K$103,3)),0))","v":""},{"$f":"IF(Results!$C69=\"\",\"\",IF(Results!$H$2>=2,VALUE(VLOOKUP($B70,Group2!$I$4:$K$103,3)),0))","v":""},{"$f":"IF(Results!$C69=\"\",\"\",IF(Results!$H$2>=3,VALUE(VLOOKUP($B70,Group3!$I$4:$K$103,3)),0))","v":""},{"$f":"IF(Results!$C69=\"\",\"\",IF(Results!$H$2>=4,VALUE(VLOOKUP($B70,Group4!$I$4:$K$103,3)),0))","v":""},{"$f":"IF(Results!$C69=\"\",\"\",SUM(D70:G70))","v":""},{"$f":"IF(Results!E69=\"\",\"\",Results!E69)","v":""},{"$f":"IF(Results!F69=\"\",\"\",Results!F69)","v":""},"",{"$f":"IF(Results!$I69=\"\",\"\",Results!$I69)","v":""}]
[null,67,{"$f":"IF(Results!C70=\"\",\"\",Results!C70)","v":""},{"$f":"IF(Results!$C70=\"\",\"\",IF(Results!$H$2>=1,VALUE(VLOOKUP($B71,Group1!$I$4:$K$103,3)),0))","v":""},{"$f":"IF(Results!$C70=\"\",\"\",IF(Results!$H$2>=2,VALUE(VLOOKUP($B71,Group2!$I$4:$K$103,3)),0))","v":""},{"$f":"IF(Results!$C70=\"\",\"\",IF(Results!$H$2>=3,VALUE(VLOOKUP($B71,Group3!$I$4:$K$103,3)),0))","v":""},{"$f":"IF(Results!$C70=\"\",\"\",IF(Results!$H$2>=4,VALUE(VLOOKUP($B71,Group4!$I$4:$K$103,3)),0))","v":""},{"$f":"IF(Results!$C70=\"\",\"\",SUM(D71:G71))","v":""},{"$f":"IF(Results!E70=\"\",\"\",Results!E70)","v":""},{"$f":"IF(Results!F70=\"\",\"\",Results!F70)","v":""},"",{"$f":"IF(Results!$I70=\"\",\"\",Results!$I70)","v":""}]
[null,68,{"$f":"IF(Results!C71=\"\",\"\",Results!C71)","v":""},{"$f":"IF(Results!$C71=\"\",\"\",IF(Results!$H$2>=1,VALUE(VLOOKUP($B72,Group1!$I$4:$K$103,3)),0))","v":""},{"$f":"IF(Results!$C71=\"\",\"\",IF(Results!$H$2>=2,VALUE(VLOOKUP($B72,Group2!$I$4:$K$103,3)),0))","v":""},{"$f":"IF(Results!$C71=\"\",\"\",IF(Results!$H$2>=3,VALUE(VLOOKUP($B72,Group3!$I$4:$K$103,3)),0))","v":""},{"$f":"IF(Results!$C71=\"\",\"\",IF(Results!$H$2>=4,VALUE(VLOOKUP($B72,Group4!$I$4:$K$103,3)),0))","v":""},{"$f":"IF(Results!$C71=\"\",\"\",SUM(D72:G72))","v":""},{"$f":"IF(Results!E71=\"\",\"\",Results!E71)","v":""},{"$f":"IF(Results!F71=\"\",\"\",Results!F71)","v":""},"",{"$f":"IF(Results!$I71=\"\",\"\",Results!$I71)","v":""}]
[null,69,{"$f":"IF(Results!C72=\"\",\"\",Results!C72)","v":""},{"$f":"IF(Results!$C72=\"\",\"\",IF(Results!$H$2>=1,VALUE(VLOOKUP($B73,Group1!$I$4:$K$103,3)),0))","v":""},{"$f":"IF(Results!$C72=\"\",\"\",IF(Results!$H$2>=2,VALUE(VLOOKUP($B73,Group2!$I$4:$K$103,3)),0))","v":""},{"$f":"IF(Results!$C72=\"\",\"\",IF(Results!$H$2>=3,VALUE(VLOOKUP($B73,Group3!$I$4:$K$103,3)),0))","v":""},{"$f":"IF(Results!$C72=\"\",\"\",IF(Results!$H$2>=4,VALUE(VLOOKUP($B73,Group4!$I$4:$K$103,3)),0))","v":""},{"$f":"IF(Results!$C72=\"\",\"\",SUM(D73:G73))","v":""},{"$f":"IF(Results!E72=\"\",\"\",Results!E72)","v":""},{"$f":"IF(Results!F72=\"\",\"\",Results!F72)","v":""},"",{"$f":"IF(Results!$I72=\"\",\"\",Results!$I72)","v":""}]
[null,70,{"$f":"IF(Results!C73=\"\",\"\",Results!C73)","v":""},{"$f":"IF(Results!$C73=\"\",\"\",IF(Results!$H$2>=1,VALUE(VLOOKUP($B74,Group1!$I$4:$K$103,3)),0))","v":""},{"$f":"IF(Results!$C73=\"\",\"\",IF(Results!$H$2>=2,VALUE(VLOOKUP($B74,Group2!$I$4:$K$103,3)),0))","v":""},{"$f":"IF(Results!$C73=\"\",\"\",IF(Results!$H$2>=3,VALUE(VLOOKUP($B74,Group3!$I$4:$K$103,3)),0))","v":""},{"$f":"IF(Results!$C73=\"\",\"\",IF(Results!$H$2>=4,VALUE(VLOOKUP($B74,Group4!$I$4:$K$103,3)),0))","v":""},{"$f":"IF(Results!$C73=\"\",\"\",SUM(D74:G74))","v":""},{"$f":"IF(Results!E73=\"\",\"\",Results!E73)","v":""},{"$f":"IF(Results!F73=\"\",\"\",Results!F73)","v":""},"",{"$f":"IF(Results!$I73=\"\",\"\",Results!$I73)","v":""}]
[null,71,{"$f":"IF(Results!C74=\"\",\"\",Results!C74)","v":""},{"$f":"IF(Results!$C74=\"\",\"\",IF(Results!$H$2>=1,VALUE(VLOOKUP($B75,Group1!$I$4:$K$103,3)),0))","v":""},{"$f":"IF(Results!$C74=\"\",\"\",IF(Results!$H$2>=2,VALUE(VLOOKUP($B75,Group2!$I$4:$K$103,3)),0))","v":""},{"$f":"IF(Results!$C74=\"\",\"\",IF(Results!$H$2>=3,VALUE(VLOOKUP($B75,Group3!$I$4:$K$103,3)),0))","v":""},{"$f":"IF(Results!$C74=\"\",\"\",IF(Results!$H$2>=4,VALUE(VLOOKUP($B75,Group4!$I$4:$K$103,3)),0))","v":""},{"$f":"IF(Results!$C74=\"\",\"\",SUM(D75:G75))","v":""},{"$f":"IF(Results!E74=\"\",\"\",Results!E74)","v":""},{"$f":"IF(Results!F74=\"\",\"\",Results!F74)","v":""},"",{"$f":"IF(Results!$I74=\"\",\"\",Results!$I74)","v":""}]
[null,72,{"$f":"IF(Results!C75=\"\",\"\",Results!C75)","v":""},{"$f":"IF(Results!$C75=\"\",\"\",IF(Results!$H$2>=1,VALUE(VLOOKUP($B76,Group1!$I$4:$K$103,3)),0))","v":""},{"$f":"IF(Results!$C75=\"\",\"\",IF(Results!$H$2>=2,VALUE(VLOOKUP($B76,Group2!$I$4:$K$103,3)),0))","v":""},{"$f":"IF(Results!$C75=\"\",\"\",IF(Results!$H$2>=3,VALUE(VLOOKUP($B76,Group3!$I$4:$K$103,3)),0))","v":""},{"$f":"IF(Results!$C75=\"\",\"\",IF(Results!$H$2>=4,VALUE(VLOOKUP($B76,Group4!$I$4:$K$103,3)),0))","v":""},{"$f":"IF(Results!$C75=\"\",\"\",SUM(D76:G76))","v":""},{"$f":"IF(Results!E75=\"\",\"\",Results!E75)","v":""},{"$f":"IF(Results!F75=\"\",\"\",Results!F75)","v":""},"",{"$f":"IF(Results!$I75=\"\",\"\",Results!$I75)","v":""}]
[null,73,{"$f":"IF(Results!C76=\"\",\"\",Results!C76)","v":""},{"$f":"IF(Results!$C76=\"\",\"\",IF(Results!$H$2>=1,VALUE(VLOOKUP($B77,Group1!$I$4:$K$103,3)),0))","v":""},{"$f":"IF(Results!$C76=\"\",\"\",IF(Results!$H$2>=2,VALUE(VLOOKUP($B77,Group2!$I$4:$K$103,3)),0))","v":""},{"$f":"IF(Results!$C76=\"\",\"\",IF(Results!$H$2>=3,VALUE(VLOOKUP($B77,Group3!$I$4:$K$103,3)),0))","v":""},{"$f":"IF(Results!$C76=\"\",\"\",IF(Results!$H$2>=4,VALUE(VLOOKUP($B77,Group4!$I$4:$K$103,3)),0))","v":""},{"$f":"IF(Results!$C76=\"\",\"\",SUM(D77:G77))","v":""},{"$f":"IF(Results!E76=\"\",\"\",Results!E76)","v":""},{"$f":"IF(Results!F76=\"\",\"\",Results!F76)","v":""},"",{"$f":"IF(Results!$I76=\"\",\"\",Results!$I76)","v":""}]
[null,74,{"$f":"IF(Results!C77=\"\",\"\",Results!C77)","v":""},{"$f":"IF(Results!$C77=\"\",\"\",IF(Results!$H$2>=1,VALUE(VLOOKUP($B78,Group1!$I$4:$K$103,3)),0))","v":""},{"$f":"IF(Results!$C77=\"\",\"\",IF(Results!$H$2>=2,VALUE(VLOOKUP($B78,Group2!$I$4:$K$103,3)),0))","v":""},{"$f":"IF(Results!$C77=\"\",\"\",IF(Results!$H$2>=3,VALUE(VLOOKUP($B78,Group3!$I$4:$K$103,3)),0))","v":""},{"$f":"IF(Results!$C77=\"\",\"\",IF(Results!$H$2>=4,VALUE(VLOOKUP($B78,Group4!$I$4:$K$103,3)),0))","v":""},{"$f":"IF(Results!$C77=\"\",\"\",SUM(D78:G78))","v":""},{"$f":"IF(Results!E77=\"\",\"\",Results!E77)","v":""},{"$f":"IF(Results!F77=\"\",\"\",Results!F77)","v":""},"",{"$f":"IF(Results!$I77=\"\",\"\",Results!$I77)","v":""}]
[null,75,{"$f":"IF(Results!C78=\"\",\"\",Results!C78)","v":""},{"$f":"IF(Results!$C78=\"\",\"\",IF(Results!$H$2>=1,VALUE(VLOOKUP($B79,Group1!$I$4:$K$103,3)),0))","v":""},{"$f":"IF(Results!$C78=\"\",\"\",IF(Results!$H$2>=2,VALUE(VLOOKUP($B79,Group2!$I$4:$K$103,3)),0))","v":""},{"$f":"IF(Results!$C78=\"\",\"\",IF(Results!$H$2>=3,VALUE(VLOOKUP($B79,Group3!$I$4:$K$103,3)),0))","v":""},{"$f":"IF(Results!$C78=\"\",\"\",IF(Results!$H$2>=4,VALUE(VLOOKUP($B79,Group4!$I$4:$K$103,3)),0))","v":""},{"$f":"IF(Results!$C78=\"\",\"\",SUM(D79:G79))","v":""},{"$f":"IF(Results!E78=\"\",\"\",Results!E78)","v":""},{"$f":"IF(Results!F78=\"\",\"\",Results!F78)","v":""},"",{"$f":"IF(Results!$I78=\"\",\"\",Results!$I78)","v":""}]
[null,76,{"$f":"IF(Results!C79=\"\",\"\",Results!C79)","v":""},{"$f":"IF(Results!$C79=\"\",\"\",IF(Results!$H$2>=1,VALUE(VLOOKUP($B80,Group1!$I$4:$K$103,3)),0))","v":""},{"$f":"IF(Results!$C79=\"\",\"\",IF(Results!$H$2>=2,VALUE(VLOOKUP($B80,Group2!$I$4:$K$103,3)),0))","v":""},{"$f":"IF(Results!$C79=\"\",\"\",IF(Results!$H$2>=3,VALUE(VLOOKUP($B80,Group3!$I$4:$K$103,3)),0))","v":""},{"$f":"IF(Results!$C79=\"\",\"\",IF(Results!$H$2>=4,VALUE(VLOOKUP($B80,Group4!$I$4:$K$103,3)),0))","v":""},{"$f":"IF(Results!$C79=\"\",\"\",SUM(D80:G80))","v":""},{"$f":"IF(Results!E79=\"\",\"\",Results!E79)","v":""},{"$f":"IF(Results!F79=\"\",\"\",Results!F79)","v":""},"",{"$f":"IF(Results!$I79=\"\",\"\",Results!$I79)","v":""}]
[null,77,{"$f":"IF(Results!C80=\"\",\"\",Results!C80)","v":""},{"$f":"IF(Results!$C80=\"\",\"\",IF(Results!$H$2>=1,VALUE(VLOOKUP($B81,Group1!$I$4:$K$103,3)),0))","v":""},{"$f":"IF(Results!$C80=\"\",\"\",IF(Results!$H$2>=2,VALUE(VLOOKUP($B81,Group2!$I$4:$K$103,3)),0))","v":""},{"$f":"IF(Results!$C80=\"\",\"\",IF(Results!$H$2>=3,VALUE(VLOOKUP($B81,Group3!$I$4:$K$103,3)),0))","v":""},{"$f":"IF(Results!$C80=\"\",\"\",IF(Results!$H$2>=4,VALUE(VLOOKUP($B81,Group4!$I$4:$K$103,3)),0))","v":""},{"$f":"IF(Results!$C80=\"\",\"\",SUM(D81:G81))","v":""},{"$f":"IF(Results!E80=\"\",\"\",Results!E80)","v":""},{"$f":"IF(Results!F80=\"\",\"\",Results!F80)","v":""},"",{"$f":"IF(Results!$I80=\"\",\"\",Results!$I80)","v":""}]
[null,78,{"$f":"IF(Results!C81=\"\",\"\",Results!C81)","v":""},{"$f":"IF(Results!$C81=\"\",\"\",IF(Results!$H$2>=1,VALUE(VLOOKUP($B82,Group1!$I$4:$K$103,3)),0))","v":""},{"$f":"IF(Results!$C81=\"\",\"\",IF(Results!$H$2>=2,VALUE(VLOOKUP($B82,Group2!$I$4:$K$103,3)),0))","v":""},{"$f":"IF(Results!$C81=\"\",\"\",IF(Results!$H$2>=3,VALUE(VLOOKUP($B82,Group3!$I$4:$K$103,3)),0))","v":""},{"$f":"IF(Results!$C81=\"\",\"\",IF(Results!$H$2>=4,VALUE(VLOOKUP($B82,Group4!$I$4:$K$103,3)),0))","v":""},{"$f":"IF(Results!$C81=\"\",\"\",SUM(D82:G82))","v":""},{"$f":"IF(Results!E81=\"\",\"\",Results!E81)","v":""},{"$f":"IF(Results!F81=\"\",\"\",Results!F81)","v":""},"",{"$f":"IF(Results!$I81=\"\",\"\",Results!$I81)","v":""}]
[null,79,{"$f":"IF(Results!C82=\"\",\"\",Results!C82)","v":""},{"$f":"IF(Results!$C82=\"\",\"\",IF(Results!$H$2>=1,VALUE(VLOOKUP($B83,Group1!$I$4:$K$103,3)),0))","v":""},{"$f":"IF(Results!$C82=\"\",\"\",IF(Results!$H$2>=2,VALUE(VLOOKUP($B83,Group2!$I$4:$K$103,3)),0))","v":""},{"$f":"IF(Results!$C82=\"\",\"\",IF(Results!$H$2>=3,VALUE(VLOOKUP($B83,Group3!$I$4:$K$103,3)),0))","v":""},{"$f":"IF(Results!$C82=\"\",\"\",IF(Results!$H$2>=4,VALUE(VLOOKUP($B83,Group4!$I$4:$K$103,3)),0))","v":""},{"$f":"IF(Results!$C82=\"\",\"\",SUM(D83:G83))","v":""},{"$f":"IF(Results!E82=\"\",\"\",Results!E82)","v":""},{"$f":"IF(Results!F82=\"\",\"\",Results!F82)","v":""},"",{"$f":"IF(Results!$I82=\"\",\"\",Results!$I82)","v":""}]
[null,80,{"$f":"IF(Results!C83=\"\",\"\",Results!C83)","v":""},{"$f":"IF(Results!$C83=\"\",\"\",IF(Results!$H$2>=1,VALUE(VLOOKUP($B84,Group1!$I$4:$K$103,3)),0))","v":""},{"$f":"IF(Results!$C83=\"\",\"\",IF(Results!$H$2>=2,VALUE(VLOOKUP($B84,Group2!$I$4:$K$103,3)),0))","v":""},{"$f":"IF(Results!$C83=\"\",\"\",IF(Results!$H$2>=3,VALUE(VLOOKUP($B84,Group3!$I$4:$K$103,3)),0))","v":""},{"$f":"IF(Results!$C83=\"\",\"\",IF(Results!$H$2>=4,VALUE(VLOOKUP($B84,Group4!$I$4:$K$103,3)),0))","v":""},{"$f":"IF(Results!$C83=\"\",\"\",SUM(D84:G84))","v":""},{"$f":"IF(Results!E83=\"\",\"\",Results!E83)","v":""},{"$f":"IF(Results!F83=\"\",\"\",Results!F83)","v":""},"",{"$f":"IF(Results!$I83=\"\",\"\",Results!$I83)","v":""}]
[null,81,{"$f":"IF(Results!C84=\"\",\"\",Results!C84)","v":""},{"$f":"IF(Results!$C84=\"\",\"\",IF(Results!$H$2>=1,VALUE(VLOOKUP($B85,Group1!$I$4:$K$103,3)),0))","v":""},{"$f":"IF(Results!$C84=\"\",\"\",IF(Results!$H$2>=2,VALUE(VLOOKUP($B85,Group2!$I$4:$K$103,3)),0))","v":""},{"$f":"IF(Results!$C84=\"\",\"\",IF(Results!$H$2>=3,VALUE(VLOOKUP($B85,Group3!$I$4:$K$103,3)),0))","v":""},{"$f":"IF(Results!$C84=\"\",\"\",IF(Results!$H$2>=4,VALUE(VLOOKUP($B85,Group4!$I$4:$K$103,3)),0))","v":""},{"$f":"IF(Results!$C84=\"\",\"\",SUM(D85:G85))","v":""},{"$f":"IF(Results!E84=\"\",\"\",Results!E84)","v":""},{"$f":"IF(Results!F84=\"\",\"\",Results!F84)","v":""},"",{"$f":"IF(Results!$I84=\"\",\"\",Results!$I84)","v":""}]
[null,82,{"$f":"IF(Results!C85=\"\",\"\",Results!C85)","v":""},{"$f":"IF(Results!$C85=\"\",\"\",IF(Results!$H$2>=1,VALUE(VLOOKUP($B86,Group1!$I$4:$K$103,3)),0))","v":""},{"$f":"IF(Results!$C85=\"\",\"\",IF(Results!$H$2>=2,VALUE(VLOOKUP($B86,Group2!$I$4:$K$103,3)),0))","v":""},{"$f":"IF(Results!$C85=\"\",\"\",IF(Results!$H$2>=3,VALUE(VLOOKUP($B86,Group3!$I$4:$K$103,3)),0))","v":""},{"$f":"IF(Results!$C85=\"\",\"\",IF(Results!$H$2>=4,VALUE(VLOOKUP($B86,Group4!$I$4:$K$103,3)),0))","v":""},{"$f":"IF(Results!$C85=\"\",\"\",SUM(D86:G86))","v":""},{"$f":"IF(Results!E85=\"\",\"\",Results!E85)","v":""},{"$f":"IF(Results!F85=\"\",\"\",Results!F85)","v":""},"",{"$f":"IF(Results!$I85=\"\",\"\",Results!$I85)","v":""}]
[null,83,{"$f":"IF(Results!C86=\"\",\"\",Results!C86)","v":""},{"$f":"IF(Results!$C86=\"\",\"\",IF(Results!$H$2>=1,VALUE(VLOOKUP($B87,Group1!$I$4:$K$103,3)),0))","v":""},{"$f":"IF(Results!$C86=\"\",\"\",IF(Results!$H$2>=2,VALUE(VLOOKUP($B87,Group2!$I$4:$K$103,3)),0))","v":""},{"$f":"IF(Results!$C86=\"\",\"\",IF(Results!$H$2>=3,VALUE(VLOOKUP($B87,Group3!$I$4:$K$103,3)),0))","v":""},{"$f":"IF(Results!$C86=\"\",\"\",IF(Results!$H$2>=4,VALUE(VLOOKUP($B87,Group4!$I$4:$K$103,3)),0))","v":""},{"$f":"IF(Results!$C86=\"\",\"\",SUM(D87:G87))","v":""},{"$f":"IF(Results!E86=\"\",\"\",Results!E86)","v":""},{"$f":"IF(Results!F86=\"\",\"\",Results!F86)","v":""},"",{"$f":"IF(Results!$I86=\"\",\"\",Results!$I86)","v":""}]
[null,84,{"$f":"IF(Results!C87=\"\",\"\",Results!C87)","v":""},{"$f":"IF(Results!$C87=\"\",\"\",IF(Results!$H$2>=1,VALUE(VLOOKUP($B88,Group1!$I$4:$K$103,3)),0))","v":""},{"$f":"IF(Results!$C87=\"\",\"\",IF(Results!$H$2>=2,VALUE(VLOOKUP($B88,Group2!$I$4:$K$103,3)),0))","v":""},{"$f":"IF(Results!$C87=\"\",\"\",IF(Results!$H$2>=3,VALUE(VLOOKUP($B88,Group3!$I$4:$K$103,3)),0))","v":""},{"$f":"IF(Results!$C87=\"\",\"\",IF(Results!$H$2>=4,VALUE(VLOOKUP($B88,Group4!$I$4:$K$103,3)),0))","v":""},{"$f":"IF(Results!$C87=\"\",\"\",SUM(D88:G88))","v":""},{"$f":"IF(Results!E87=\"\",\"\",Results!E87)","v":""},{"$f":"IF(Results!F87=\"\",\"\",Results!F87)","v":""},"",{"$f":"IF(Results!$I87=\"\",\"\",Results!$I87)","v":""}]
[null,85,{"$f":"IF(Results!C88=\"\",\"\",Results!C88)","v":""},{"$f":"IF(Results!$C88=\"\",\"\",IF(Results!$H$2>=1,VALUE(VLOOKUP($B89,Group1!$I$4:$K$103,3)),0))","v":""},{"$f":"IF(Results!$C88=\"\",\"\",IF(Results!$H$2>=2,VALUE(VLOOKUP($B89,Group2!$I$4:$K$103,3)),0))","v":""},{"$f":"IF(Results!$C88=\"\",\"\",IF(Results!$H$2>=3,VALUE(VLOOKUP($B89,Group3!$I$4:$K$103,3)),0))","v":""},{"$f":"IF(Results!$C88=\"\",\"\",IF(Results!$H$2>=4,VALUE(VLOOKUP($B89,Group4!$I$4:$K$103,3)),0))","v":""},{"$f":"IF(Results!$C88=\"\",\"\",SUM(D89:G89))","v":""},{"$f":"IF(Results!E88=\"\",\"\",Results!E88)","v":""},{"$f":"IF(Results!F88=\"\",\"\",Results!F88)","v":""},"",{"$f":"IF(Results!$I88=\"\",\"\",Results!$I88)","v":""}]
[null,86,{"$f":"IF(Results!C89=\"\",\"\",Results!C89)","v":""},{"$f":"IF(Results!$C89=\"\",\"\",IF(Results!$H$2>=1,VALUE(VLOOKUP($B90,Group1!$I$4:$K$103,3)),0))","v":""},{"$f":"IF(Results!$C89=\"\",\"\",IF(Results!$H$2>=2,VALUE(VLOOKUP($B90,Group2!$I$4:$K$103,3)),0))","v":""},{"$f":"IF(Results!$C89=\"\",\"\",IF(Results!$H$2>=3,VALUE(VLOOKUP($B90,Group3!$I$4:$K$103,3)),0))","v":""},{"$f":"IF(Results!$C89=\"\",\"\",IF(Results!$H$2>=4,VALUE(VLOOKUP($B90,Group4!$I$4:$K$103,3)),0))","v":""},{"$f":"IF(Results!$C89=\"\",\"\",SUM(D90:G90))","v":""},{"$f":"IF(Results!E89=\"\",\"\",Results!E89)","v":""},{"$f":"IF(Results!F89=\"\",\"\",Results!F89)","v":""},"",{"$f":"IF(Results!$I89=\"\",\"\",Results!$I89)","v":""}]
[null,87,{"$f":"IF(Results!C90=\"\",\"\",Results!C90)","v":""},{"$f":"IF(Results!$C90=\"\",\"\",IF(Results!$H$2>=1,VALUE(VLOOKUP($B91,Group1!$I$4:$K$103,3)),0))","v":""},{"$f":"IF(Results!$C90=\"\",\"\",IF(Results!$H$2>=2,VALUE(VLOOKUP($B91,Group2!$I$4:$K$103,3)),0))","v":""},{"$f":"IF(Results!$C90=\"\",\"\",IF(Results!$H$2>=3,VALUE(VLOOKUP($B91,Group3!$I$4:$K$103,3)),0))","v":""},{"$f":"IF(Results!$C90=\"\",\"\",IF(Results!$H$2>=4,VALUE(VLOOKUP($B91,Group4!$I$4:$K$103,3)),0))","v":""},{"$f":"IF(Results!$C90=\"\",\"\",SUM(D91:G91))","v":""},{"$f":"IF(Results!E90=\"\",\"\",Results!E90)","v":""},{"$f":"IF(Results!F90=\"\",\"\",Results!F90)","v":""},"",{"$f":"IF(Results!$I90=\"\",\"\",Results!$I90)","v":""}]
[null,88,{"$f":"IF(Results!C91=\"\",\"\",Results!C91)","v":""},{"$f":"IF(Results!$C91=\"\",\"\",IF(Results!$H$2>=1,VALUE(VLOOKUP($B92,Group1!$I$4:$K$103,3)),0))","v":""},{"$f":"IF(Results!$C91=\"\",\"\",IF(Results!$H$2>=2,VALUE(VLOOKUP($B92,Group2!$I$4:$K$103,3)),0))","v":""},{"$f":"IF(Results!$C91=\"\",\"\",IF(Results!$H$2>=3,VALUE(VLOOKUP($B92,Group3!$I$4:$K$103,3)),0))","v":""},{"$f":"IF(Results!$C91=\"\",\"\",IF(Results!$H$2>=4,VALUE(VLOOKUP($B92,Group4!$I$4:$K$103,3)),0))","v":""},{"$f":"IF(Results!$C91=\"\",\"\",SUM(D92:G92))","v":""},{"$f":"IF(Results!E91=\"\",\"\",Results!E91)","v":""},{"$f":"IF(Results!F91=\"\",\"\",Results!F91)","v":""},"",{"$f":"IF(Results!$I91=\"\",\"\",Results!$I91)","v":""}]
[null,89,{"$f":"IF(Results!C92=\"\",\"\",Results!C92)","v":""},{"$f":"IF(Results!$C92=\"\",\"\",IF(Results!$H$2>=1,VALUE(VLOOKUP($B93,Group1!$I$4:$K$103,3)),0))","v":""},{"$f":"IF(Results!$C92=\"\",\"\",IF(Results!$H$2>=2,VALUE(VLOOKUP($B93,Group2!$I$4:$K$103,3)),0))","v":""},{"$f":"IF(Results!$C92=\"\",\"\",IF(Results!$H$2>=3,VALUE(VLOOKUP($B93,Group3!$I$4:$K$103,3)),0))","v":""},{"$f":"IF(Results!$C92=\"\",\"\",IF(Results!$H$2>=4,VALUE(VLOOKUP($B93,Group4!$I$4:$K$103,3)),0))","v":""},{"$f":"IF(Results!$C92=\"\",\"\",SUM(D93:G93))","v":""},{"$f":"IF(Results!E92=\"\",\"\",Results!E92)","v":""},{"$f":"IF(Results!F92=\"\",\"\",Results!F92)","v":""},"",{"$f":"IF(Results!$I92=\"\",\"\",Results!$I92)","v":""}]
[null,90,{"$f":"IF(Results!C93=\"\",\"\",Results!C93)","v":""},{"$f":"IF(Results!$C93=\"\",\"\",IF(Results!$H$2>=1,VALUE(VLOOKUP($B94,Group1!$I$4:$K$103,3)),0))","v":""},{"$f":"IF(Results!$C93=\"\",\"\",IF(Results!$H$2>=2,VALUE(VLOOKUP($B94,Group2!$I$4:$K$103,3)),0))","v":""},{"$f":"IF(Results!$C93=\"\",\"\",IF(Results!$H$2>=3,VALUE(VLOOKUP($B94,Group3!$I$4:$K$103,3)),0))","v":""},{"$f":"IF(Results!$C93=\"\",\"\",IF(Results!$H$2>=4,VALUE(VLOOKUP($B94,Group4!$I$4:$K$103,3)),0))","v":""},{"$f":"IF(Results!$C93=\"\",\"\",SUM(D94:G94))","v":""},{"$f":"IF(Results!E93=\"\",\"\",Results!E93)","v":""},{"$f":"IF(Results!F93=\"\",\"\",Results!F93)","v":""},"",{"$f":"IF(Results!$I93=\"\",\"\",Results!$I93)","v":""}]
[null,91,{"$f":"IF(Results!C94=\"\",\"\",Results!C94)","v":""},{"$f":"IF(Results!$C94=\"\",\"\",IF(Results!$H$2>=1,VALUE(VLOOKUP($B95,Group1!$I$4:$K$103,3)),0))","v":""},{"$f":"IF(Results!$C94=\"\",\"\",IF(Results!$H$2>=2,VALUE(VLOOKUP($B95,Group2!$I$4:$K$103,3)),0))","v":""},{"$f":"IF(Results!$C94=\"\",\"\",IF(Results!$H$2>=3,VALUE(VLOOKUP($B95,Group3!$I$4:$K$103,3)),0))","v":""},{"$f":"IF(Results!$C94=\"\",\"\",IF(Results!$H$2>=4,VALUE(VLOOKUP($B95,Group4!$I$4:$K$103,3)),0))","v":""},{"$f":"IF(Results!$C94=\"\",\"\",SUM(D95:G95))","v":""},{"$f":"IF(Results!E94=\"\",\"\",Results!E94)","v":""},{"$f":"IF(Results!F94=\"\",\"\",Results!F94)","v":""},"",{"$f":"IF(Results!$I94=\"\",\"\",Results!$I94)","v":""}]
[null,92,{"$f":"IF(Results!C95=\"\",\"\",Results!C95)","v":""},{"$f":"IF(Results!$C95=\"\",\"\",IF(Results!$H$2>=1,VALUE(VLOOKUP($B96,Group1!$I$4:$K$103,3)),0))","v":""},{"$f":"IF(Results!$C95=\"\",\"\",IF(Results!$H$2>=2,VALUE(VLOOKUP($B96,Group2!$I$4:$K$103,3)),0))","v":""},{"$f":"IF(Results!$C95=\"\",\"\",IF(Results!$H$2>=3,VALUE(VLOOKUP($B96,Group3!$I$4:$K$103,3)),0))","v":""},{"$f":"IF(Results!$C95=\"\",\"\",IF(Results!$H$2>=4,VALUE(VLOOKUP($B96,Group4!$I$4:$K$103,3)),0))","v":""},{"$f":"IF(Results!$C95=\"\",\"\",SUM(D96:G96))","v":""},{"$f":"IF(Results!E95=\"\",\"\",Results!E95)","v":""},{"$f":"IF(Results!F95=\"\",\"\",Results!F95)","v":""},"",{"$f":"IF(Results!$I95=\"\",\"\",Results!$I95)","v":""}]
[null,93,{"$f":"IF(Results!C96=\"\",\"\",Results!C96)","v":""},{"$f":"IF(Results!$C96=\"\",\"\",IF(Results!$H$2>=1,VALUE(VLOOKUP($B97,Group1!$I$4:$K$103,3)),0))","v":""},{"$f":"IF(Results!$C96=\"\",\"\",IF(Results!$H$2>=2,VALUE(VLOOKUP($B97,Group2!$I$4:$K$103,3)),0))","v":""},{"$f":"IF(Results!$C96=\"\",\"\",IF(Results!$H$2>=3,VALUE(VLOOKUP($B97,Group3!$I$4:$K$103,3)),0))","v":""},{"$f":"IF(Results!$C96=\"\",\"\",IF(Results!$H$2>=4,VALUE(VLOOKUP($B97,Group4!$I$4:$K$103,3)),0))","v":""},{"$f":"IF(Results!$C96=\"\",\"\",SUM(D97:G97))","v":""},{"$f":"IF(Results!E96=\"\",\"\",Results!E96)","v":""},{"$f":"IF(Results!F96=\"\",\"\",Results!F96)","v":""},"",{"$f":"IF(Results!$I96=\"\",\"\",Results!$I96)","v":""}]
[null,94,{"$f":"IF(Results!C97=\"\",\"\",Results!C97)","v":""},{"$f":"IF(Results!$C97=\"\",\"\",IF(Results!$H$2>=1,VALUE(VLOOKUP($B98,Group1!$I$4:$K$103,3)),0))","v":""},{"$f":"IF(Results!$C97=\"\",\"\",IF(Results!$H$2>=2,VALUE(VLOOKUP($B98,Group2!$I$4:$K$103,3)),0))","v":""},{"$f":"IF(Results!$C97=\"\",\"\",IF(Results!$H$2>=3,VALUE(VLOOKUP($B98,Group3!$I$4:$K$103,3)),0))","v":""},{"$f":"IF(Results!$C97=\"\",\"\",IF(Results!$H$2>=4,VALUE(VLOOKUP($B98,Group4!$I$4:$K$103,3)),0))","v":""},{"$f":"IF(Results!$C97=\"\",\"\",SUM(D98:G98))","v":""},{"$f":"IF(Results!E97=\"\",\"\",Results!E97)","v":""},{"$f":"IF(Results!F97=\"\",\"\",Results!F97)","v":""},"",{"$f":"IF(Results!$I97=\"\",\"\",Results!$I97)","v":""}]
[null,95,{"$f":"IF(Results!C98=\"\",\"\",Results!C98)","v":""},{"$f":"IF(Results!$C98=\"\",\"\",IF(Results!$H$2>=1,VALUE(VLOOKUP($B99,Group1!$I$4:$K$103,3)),0))","v":""},{"$f":"IF(Results!$C98=\"\",\"\",IF(Results!$H$2>=2,VALUE(VLOOKUP($B99,Group2!$I$4:$K$103,3)),0))","v":""},{"$f":"IF(Results!$C98=\"\",\"\",IF(Results!$H$2>=3,VALUE(VLOOKUP($B99,Group3!$I$4:$K$103,3)),0))","v":""},{"$f":"IF(Results!$C98=\"\",\"\",IF(Results!$H$2>=4,VALUE(VLOOKUP($B99,Group4!$I$4:$K$103,3)),0))","v":""},{"$f":"IF(Results!$C98=\"\",\"\",SUM(D99:G99))","v":""},{"$f":"IF(Results!E98=\"\",\"\",Results!E98)","v":""},{"$f":"IF(Results!F98=\"\",\"\",Results!F98)","v":""},{"$f":"IF(C99=\"\",\"\",SUM(H99:J99))","v":""},{"$f":"IF(Results!$I98=\"\",\"\",Results!$I98)","v":""}]
[null,96,{"$f":"IF(Results!C99=\"\",\"\",Results!C99)","v":""},{"$f":"IF(Results!$C99=\"\",\"\",IF(Results!$H$2>=1,VALUE(VLOOKUP($B100,Group1!$I$4:$K$103,3)),0))","v":""},{"$f":"IF(Results!$C99=\"\",\"\",IF(Results!$H$2>=2,VALUE(VLOOKUP($B100,Group2!$I$4:$K$103,3)),0))","v":""},{"$f":"IF(Results!$C99=\"\",\"\",IF(Results!$H$2>=3,VALUE(VLOOKUP($B100,Group3!$I$4:$K$103,3)),0))","v":""},{"$f":"IF(Results!$C99=\"\",\"\",IF(Results!$H$2>=4,VALUE(VLOOKUP($B100,Group4!$I$4:$K$103,3)),0))","v":""},{"$f":"IF(Results!$C99=\"\",\"\",SUM(D100:G100))","v":""},{"$f":"IF(Results!E99=\"\",\"\",Results!E99)","v":""},{"$f":"IF(Results!F99=\"\",\"\",Results!F99)","v":""},"",{"$f":"IF(Results!$I99=\"\",\"\",Results!$I99)","v":""}]
[null,97,{"$f":"IF(Results!C100=\"\",\"\",Results!C100)","v":""},{"$f":"IF(Results!$C100=\"\",\"\",IF(Results!$H$2>=1,VALUE(VLOOKUP($B101,Group1!$I$4:$K$103,3)),0))","v":""},{"$f":"IF(Results!$C100=\"\",\"\",IF(Results!$H$2>=2,VALUE(VLOOKUP($B101,Group2!$I$4:$K$103,3)),0))","v":""},{"$f":"IF(Results!$C100=\"\",\"\",IF(Results!$H$2>=3,VALUE(VLOOKUP($B101,Group3!$I$4:$K$103,3)),0))","v":""},{"$f":"IF(Results!$C100=\"\",\"\",IF(Results!$H$2>=4,VALUE(VLOOKUP($B101,Group4!$I$4:$K$103,3)),0))","v":""},{"$f":"IF(Results!$C100=\"\",\"\",SUM(D101:G101))","v":""},{"$f":"IF(Results!E100=\"\",\"\",Results!E100)","v":""},{"$f":"IF(Results!F100=\"\",\"\",Results!F100)","v":""},"",{"$f":"IF(Results!$I100=\"\",\"\",Results!$I100)","v":""}]
[null,98,{"$f":"IF(Results!C101=\"\",\"\",Results!C101)","v":""},{"$f":"IF(Results!$C101=\"\",\"\",IF(Results!$H$2>=1,VALUE(VLOOKUP($B102,Group1!$I$4:$K$103,3)),0))","v":""},{"$f":"IF(Results!$C101=\"\",\"\",IF(Results!$H$2>=2,VALUE(VLOOKUP($B102,Group2!$I$4:$K$103,3)),0))","v":""},{"$f":"IF(Results!$C101=\"\",\"\",IF(Results!$H$2>=3,VALUE(VLOOKUP($B102,Group3!$I$4:$K$103,3)),0))","v":""},{"$f":"IF(Results!$C101=\"\",\"\",IF(Results!$H$2>=4,VALUE(VLOOKUP($B102,Group4!$I$4:$K$103,3)),0))","v":""},{"$f":"IF(Results!$C101=\"\",\"\",SUM(D102:G102))","v":""},{"$f":"IF(Results!E101=\"\",\"\",Results!E101)","v":""},{"$f":"IF(Results!F101=\"\",\"\",Results!F101)","v":""},"",{"$f":"IF(Results!$I101=\"\",\"\",Results!$I101)","v":""}]
[null,99,{"$f":"IF(Results!C102=\"\",\"\",Results!C102)","v":""},{"$f":"IF(Results!$C102=\"\",\"\",IF(Results!$H$2>=1,VALUE(VLOOKUP($B103,Group1!$I$4:$K$103,3)),0))","v":""},{"$f":"IF(Results!$C102=\"\",\"\",IF(Results!$H$2>=2,VALUE(VLOOKUP($B103,Group2!$I$4:$K$103,3)),0))","v":""},{"$f":"IF(Results!$C102=\"\",\"\",IF(Results!$H$2>=3,VALUE(VLOOKUP($B103,Group3!$I$4:$K$103,3)),0))","v":""},{"$f":"IF(Results!$C102=\"\",\"\",IF(Results!$H$2>=4,VALUE(VLOOKUP($B103,Group4!$I$4:$K$103,3)),0))","v":""},{"$f":"IF(Results!$C102=\"\",\"\",SUM(D103:G103))","v":""},{"$f":"IF(Results!E102=\"\",\"\",Results!E102)","v":""},{"$f":"IF(Results!F102=\"\",\"\",Results!F102)","v":""},"",{"$f":"IF(Results!$I102=\"\",\"\",Results!$I102)","v":""}]
[null,100,{"$f":"IF(Results!C103=\"\",\"\",Results!C103)","v":""},{"$f":"IF(Results!$C103=\"\",\"\",IF(Results!$H$2>=1,VALUE(VLOOKUP($B104,Group1!$I$4:$K$103,3)),0))","v":""},{"$f":"IF(Results!$C103=\"\",\"\",IF(Results!$H$2>=2,VALUE(VLOOKUP($B104,Group2!$I$4:$K$103,3)),0))","v":""},{"$f":"IF(Results!$C103=\"\",\"\",IF(Results!$H$2>=3,VALUE(VLOOKUP($B104,Group3!$I$4:$K$103,3)),0))","v":""},{"$f":"IF(Results!$C103=\"\",\"\",IF(Results!$H$2>=4,VALUE(VLOOKUP($B104,Group4!$I$4:$K$103,3)),0))","v":""},{"$f":"IF(Results!$C103=\"\",\"\",SUM(D104:G104))","v":""},{"$f":"IF(Results!E103=\"\",\"\",Results!E103)","v":""},{"$f":"IF(Results!F103=\"\",\"\",Results!F103)","v":""},"",{"$f":"IF(Results!$I103=\"\",\"\",Results!$I103)","v":""}]
[null,101,{"$f":"IF(Results!C104=\"\",\"\",Results!C104)","v":""},{"$f":"IF(Results!$C104=\"\",\"\",IF(Results!$H$2>=1,VALUE(VLOOKUP($B105,Group1!$I$4:$K$103,3)),0))","v":""},{"$f":"IF(Results!$C104=\"\",\"\",IF(Results!$H$2>=2,VALUE(VLOOKUP($B105,Group2!$I$4:$K$103,3)),0))","v":""},{"$f":"IF(Results!$C104=\"\",\"\",IF(Results!$H$2>=3,VALUE(VLOOKUP($B105,Group3!$I$4:$K$103,3)),0))","v":""},{"$f":"IF(Results!$C104=\"\",\"\",IF(Results!$H$2>=4,VALUE(VLOOKUP($B105,Group4!$I$4:$K$103,3)),0))","v":""},{"$f":"IF(Results!$C104=\"\",\"\",SUM(D105:G105))","v":""},{"$f":"IF(Results!E104=\"\",\"\",Results!E104)","v":""},{"$f":"IF(Results!F104=\"\",\"\",Results!F104)","v":""},{"$f":"IF(C105=\"\",\"\",SUM(H105:J105))","v":""},{"$f":"IF(Results!$I104=\"\",\"\",Results!$I104)","v":""}]
[null,102,{"$f":"IF(Results!C105=\"\",\"\",Results!C105)","v":""},{"$f":"IF(Results!$C105=\"\",\"\",IF(Results!$H$2>=1,VALUE(VLOOKUP($B106,Group1!$I$4:$K$103,3)),0))","v":""},{"$f":"IF(Results!$C105=\"\",\"\",IF(Results!$H$2>=2,VALUE(VLOOKUP($B106,Group2!$I$4:$K$103,3)),0))","v":""},{"$f":"IF(Results!$C105=\"\",\"\",IF(Results!$H$2>=3,VALUE(VLOOKUP($B106,Group3!$I$4:$K$103,3)),0))","v":""},{"$f":"IF(Results!$C105=\"\",\"\",IF(Results!$H$2>=4,VALUE(VLOOKUP($B106,Group4!$I$4:$K$103,3)),0))","v":""},{"$f":"IF(Results!$C105=\"\",\"\",SUM(D106:G106))","v":""},{"$f":"IF(Results!E105=\"\",\"\",Results!E105)","v":""},{"$f":"IF(Results!F105=\"\",\"\",Results!F105)","v":""},"",{"$f":"IF(Results!$I105=\"\",\"\",Results!$I105)","v":""}]
[null,103,{"$f":"IF(Results!C106=\"\",\"\",Results!C106)","v":""},{"$f":"IF(Results!$C106=\"\",\"\",IF(Results!$H$2>=1,VALUE(VLOOKUP($B107,Group1!$I$4:$K$103,3)),0))","v":""},{"$f":"IF(Results!$C106=\"\",\"\",IF(Results!$H$2>=2,VALUE(VLOOKUP($B107,Group2!$I$4:$K$103,3)),0))","v":""},{"$f":"IF(Results!$C106=\"\",\"\",IF(Results!$H$2>=3,VALUE(VLOOKUP($B107,Group3!$I$4:$K$103,3)),0))","v":""},{"$f":"IF(Results!$C106=\"\",\"\",IF(Results!$H$2>=4,VALUE(VLOOKUP($B107,Group4!$I$4:$K$103,3)),0))","v":""},{"$f":"IF(Results!$C106=\"\",\"\",SUM(D107:G107))","v":""},{"$f":"IF(Results!E106=\"\",\"\",Results!E106)","v":""},{"$f":"IF(Results!F106=\"\",\"\",Results!F106)","v":""},"",{"$f":"IF(Results!$I106=\"\",\"\",Results!$I106)","v":""}]
[null,104,{"$f":"IF(Results!C107=\"\",\"\",Results!C107)","v":""},{"$f":"IF(Results!$C107=\"\",\"\",IF(Results!$H$2>=1,VALUE(VLOOKUP($B108,Group1!$I$4:$K$103,3)),0))","v":""},{"$f":"IF(Results!$C107=\"\",\"\",IF(Results!$H$2>=2,VALUE(VLOOKUP($B108,Group2!$I$4:$K$103,3)),0))","v":""},{"$f":"IF(Results!$C107=\"\",\"\",IF(Results!$H$2>=3,VALUE(VLOOKUP($B108,Group3!$I$4:$K$103,3)),0))","v":""},{"$f":"IF(Results!$C107=\"\",\"\",IF(Results!$H$2>=4,VALUE(VLOOKUP($B108,Group4!$I$4:$K$103,3)),0))","v":""},{"$f":"IF(Results!$C107=\"\",\"\",SUM(D108:G108))","v":""},{"$f":"IF(Results!E107=\"\",\"\",Results!E107)","v":""},{"$f":"IF(Results!F107=\"\",\"\",Results!F107)","v":""},"",{"$f":"IF(Results!$I107=\"\",\"\",Results!$I107)","v":""}]
[null,105,{"$f":"IF(Results!C108=\"\",\"\",Results!C108)","v":""},{"$f":"IF(Results!$C108=\"\",\"\",IF(Results!$H$2>=1,VALUE(VLOOKUP($B109,Group1!$I$4:$K$103,3)),0))","v":""},{"$f":"IF(Results!$C108=\"\",\"\",IF(Results!$H$2>=2,VALUE(VLOOKUP($B109,Group2!$I$4:$K$103,3)),0))","v":""},{"$f":"IF(Results!$C108=\"\",\"\",IF(Results!$H$2>=3,VALUE(VLOOKUP($B109,Group3!$I$4:$K$103,3)),0))","v":""},{"$f":"IF(Results!$C108=\"\",\"\",IF(Results!$H$2>=4,VALUE(VLOOKUP($B109,Group4!$I$4:$K$103,3)),0))","v":""},{"$f":"IF(Results!$C108=\"\",\"\",SUM(D109:G109))","v":""},{"$f":"IF(Results!E108=\"\",\"\",Results!E108)","v":""},{"$f":"IF(Results!F108=\"\",\"\",Results!F108)","v":""},"",{"$f":"IF(Results!$I108=\"\",\"\",Results!$I108)","v":""}]
[null,106,{"$f":"IF(Results!C109=\"\",\"\",Results!C109)","v":""},{"$f":"IF(Results!$C109=\"\",\"\",IF(Results!$H$2>=1,VALUE(VLOOKUP($B110,Group1!$I$4:$K$103,3)),0))","v":""},{"$f":"IF(Results!$C109=\"\",\"\",IF(Results!$H$2>=2,VALUE(VLOOKUP($B110,Group2!$I$4:$K$103,3)),0))","v":""},{"$f":"IF(Results!$C109=\"\",\"\",IF(Results!$H$2>=3,VALUE(VLOOKUP($B110,Group3!$I$4:$K$103,3)),0))","v":""},{"$f":"IF(Results!$C109=\"\",\"\",IF(Results!$H$2>=4,VALUE(VLOOKUP($B110,Group4!$I$4:$K$103,3)),0))","v":""},{"$f":"IF(Results!$C109=\"\",\"\",SUM(D110:G110))","v":""},{"$f":"IF(Results!E109=\"\",\"\",Results!E109)","v":""},{"$f":"IF(Results!F109=\"\",\"\",Results!F109)","v":""},"",{"$f":"IF(Results!$I109=\"\",\"\",Results!$I109)","v":""}]
[null,107,{"$f":"IF(Results!C110=\"\",\"\",Results!C110)","v":""},{"$f":"IF(Results!$C110=\"\",\"\",IF(Results!$H$2>=1,VALUE(VLOOKUP($B111,Group1!$I$4:$K$103,3)),0))","v":""},{"$f":"IF(Results!$C110=\"\",\"\",IF(Results!$H$2>=2,VALUE(VLOOKUP($B111,Group2!$I$4:$K$103,3)),0))","v":""},{"$f":"IF(Results!$C110=\"\",\"\",IF(Results!$H$2>=3,VALUE(VLOOKUP($B111,Group3!$I$4:$K$103,3)),0))","v":""},{"$f":"IF(Results!$C110=\"\",\"\",IF(Results!$H$2>=4,VALUE(VLOOKUP($B111,Group4!$I$4:$K$103,3)),0))","v":""},{"$f":"IF(Results!$C110=\"\",\"\",SUM(D111:G111))","v":""},{"$f":"IF(Results!E110=\"\",\"\",Results!E110)","v":""},{"$f":"IF(Results!F110=\"\",\"\",Results!F110)","v":""},"",{"$f":"IF(Results!$I110=\"\",\"\",Results!$I110)","v":""}]
[null,108,{"$f":"IF(Results!C111=\"\",\"\",Results!C111)","v":""},{"$f":"IF(Results!$C111=\"\",\"\",IF(Results!$H$2>=1,VALUE(VLOOKUP($B112,Group1!$I$4:$K$103,3)),0))","v":""},{"$f":"IF(Results!$C111=\"\",\"\",IF(Results!$H$2>=2,VALUE(VLOOKUP($B112,Group2!$I$4:$K$103,3)),0))","v":""},{"$f":"IF(Results!$C111=\"\",\"\",IF(Results!$H$2>=3,VALUE(VLOOKUP($B112,Group3!$I$4:$K$103,3)),0))","v":""},{"$f":"IF(Results!$C111=\"\",\"\",IF(Results!$H$2>=4,VALUE(VLOOKUP($B112,Group4!$I$4:$K$103,3)),0))","v":""},{"$f":"IF(Results!$C111=\"\",\"\",SUM(D112:G112))","v":""},{"$f":"IF(Results!E111=\"\",\"\",Results!E111)","v":""},{"$f":"IF(Results!F111=\"\",\"\",Results!F111)","v":""},"",{"$f":"IF(Results!$I111=\"\",\"\",Results!$I111)","v":""}]
[null,109,{"$f":"IF(Results!C112=\"\",\"\",Results!C112)","v":""},{"$f":"IF(Results!$C112=\"\",\"\",IF(Results!$H$2>=1,VALUE(VLOOKUP($B113,Group1!$I$4:$K$103,3)),0))","v":""},{"$f":"IF(Results!$C112=\"\",\"\",IF(Results!$H$2>=2,VALUE(VLOOKUP($B113,Group2!$I$4:$K$103,3)),0))","v":""},{"$f":"IF(Results!$C112=\"\",\"\",IF(Results!$H$2>=3,VALUE(VLOOKUP($B113,Group3!$I$4:$K$103,3)),0))","v":""},{"$f":"IF(Results!$C112=\"\",\"\",IF(Results!$H$2>=4,VALUE(VLOOKUP($B113,Group4!$I$4:$K$103,3)),0))","v":""},{"$f":"IF(Results!$C112=\"\",\"\",SUM(D113:G113))","v":""},{"$f":"IF(Results!E112=\"\",\"\",Results!E112)","v":""},{"$f":"IF(Results!F112=\"\",\"\",Results!F112)","v":""},"",{"$f":"IF(Results!$I112=\"\",\"\",Results!$I112)","v":""}]
[null,110,{"$f":"IF(Results!C113=\"\",\"\",Results!C113)","v":""},{"$f":"IF(Results!$C113=\"\",\"\",IF(Results!$H$2>=1,VALUE(VLOOKUP($B114,Group1!$I$4:$K$103,3)),0))","v":""},{"$f":"IF(Results!$C113=\"\",\"\",IF(Results!$H$2>=2,VALUE(VLOOKUP($B114,Group2!$I$4:$K$103,3)),0))","v":""},{"$f":"IF(Results!$C113=\"\",\"\",IF(Results!$H$2>=3,VALUE(VLOOKUP($B114,Group3!$I$4:$K$103,3)),0))","v":""},{"$f":"IF(Results!$C113=\"\",\"\",IF(Results!$H$2>=4,VALUE(VLOOKUP($B114,Group4!$I$4:$K$103,3)),0))","v":""},{"$f":"IF(Results!$C113=\"\",\"\",SUM(D114:G114))","v":""},{"$f":"IF(Results!E113=\"\",\"\",Results!E113)","v":""},{"$f":"IF(Results!F113=\"\",\"\",Results!F113)","v":""},"",{"$f":"IF(Results!$I113=\"\",\"\",Results!$I113)","v":""}]
[null,111,{"$f":"IF(Results!C114=\"\",\"\",Results!C114)","v":""},{"$f":"IF(Results!$C114=\"\",\"\",IF(Results!$H$2>=1,VALUE(VLOOKUP($B115,Group1!$I$4:$K$103,3)),0))","v":""},{"$f":"IF(Results!$C114=\"\",\"\",IF(Results!$H$2>=2,VALUE(VLOOKUP($B115,Group2!$I$4:$K$103,3)),0))","v":""},{"$f":"IF(Results!$C114=\"\",\"\",IF(Results!$H$2>=3,VALUE(VLOOKUP($B115,Group3!$I$4:$K$103,3)),0))","v":""},{"$f":"IF(Results!$C114=\"\",\"\",IF(Results!$H$2>=4,VALUE(VLOOKUP($B115,Group4!$I$4:$K$103,3)),0))","v":""},{"$f":"IF(Results!$C114=\"\",\"\",SUM(D115:G115))","v":""},{"$f":"IF(Results!E114=\"\",\"\",Results!E114)","v":""},{"$f":"IF(Results!F114=\"\",\"\",Results!F114)","v":""},"",{"$f":"IF(Results!$I114=\"\",\"\",Results!$I114)","v":""}]
[null,112,{"$f":"IF(Results!C115=\"\",\"\",Results!C115)","v":""},{"$f":"IF(Results!$C115=\"\",\"\",IF(Results!$H$2>=1,VALUE(VLOOKUP($B116,Group1!$I$4:$K$103,3)),0))","v":""},{"$f":"IF(Results!$C115=\"\",\"\",IF(Results!$H$2>=2,VALUE(VLOOKUP($B116,Group2!$I$4:$K$103,3)),0))","v":""},{"$f":"IF(Results!$C115=\"\",\"\",IF(Results!$H$2>=3,VALUE(VLOOKUP($B116,Group3!$I$4:$K$103,3)),0))","v":""},{"$f":"IF(Results!$C115=\"\",\"\",IF(Results!$H$2>=4,VALUE(VLOOKUP($B116,Group4!$I$4:$K$103,3)),0))","v":""},{"$f":"IF(Results!$C115=\"\",\"\",SUM(D116:G116))","v":""},{"$f":"IF(Results!E115=\"\",\"\",Results!E115)","v":""},{"$f":"IF(Results!F115=\"\",\"\",Results!F115)","v":""},"",{"$f":"IF(Results!$I115=\"\",\"\",Results!$I115)","v":""}]
[null,113,{"$f":"IF(Results!C116=\"\",\"\",Results!C116)","v":""},{"$f":"IF(Results!$C116=\"\",\"\",IF(Results!$H$2>=1,VALUE(VLOOKUP($B117,Group1!$I$4:$K$103,3)),0))","v":""},{"$f":"IF(Results!$C116=\"\",\"\",IF(Results!$H$2>=2,VALUE(VLOOKUP($B117,Group2!$I$4:$K$103,3)),0))","v":""},{"$f":"IF(Results!$C116=\"\",\"\",IF(Results!$H$2>=3,VALUE(VLOOKUP($B117,Group3!$I$4:$K$103,3)),0))","v":""},{"$f":"IF(Results!$C116=\"\",\"\",IF(Results!$H$2>=4,VALUE(VLOOKUP($B117,Group4!$I$4:$K$103,3)),0))","v":""},{"$f":"IF(Results!$C116=\"\",\"\",SUM(D117:G117))","v":""},{"$f":"IF(Results!E116=\"\",\"\",Results!E116)","v":""},{"$f":"IF(Results!F116=\"\",\"\",Results!F116)","v":""},"",{"$f":"IF(Results!$I116=\"\",\"\",Results!$I116)","v":""}]
[null,114,{"$f":"IF(Results!C117=\"\",\"\",Results!C117)","v":""},{"$f":"IF(Results!$C117=\"\",\"\",IF(Results!$H$2>=1,VALUE(VLOOKUP($B118,Group1!$I$4:$K$103,3)),0))","v":""},{"$f":"IF(Results!$C117=\"\",\"\",IF(Results!$H$2>=2,VALUE(VLOOKUP($B118,Group2!$I$4:$K$103,3)),0))","v":""},{"$f":"IF(Results!$C117=\"\",\"\",IF(Results!$H$2>=3,VALUE(VLOOKUP($B118,Group3!$I$4:$K$103,3)),0))","v":""},{"$f":"IF(Results!$C117=\"\",\"\",IF(Results!$H$2>=4,VALUE(VLOOKUP($B118,Group4!$I$4:$K$103,3)),0))","v":""},{"$f":"IF(Results!$C117=\"\",\"\",SUM(D118:G118))","v":""},{"$f":"IF(Results!E117=\"\",\"\",Results!E117)","v":""},{"$f":"IF(Results!F117=\"\",\"\",Results!F117)","v":""},"",{"$f":"IF(Results!$I117=\"\",\"\",Results!$I117)","v":""}]
[null,115,{"$f":"IF(Results!C118=\"\",\"\",Results!C118)","v":""},{"$f":"IF(Results!$C118=\"\",\"\",IF(Results!$H$2>=1,VALUE(VLOOKUP($B119,Group1!$I$4:$K$103,3)),0))","v":""},{"$f":"IF(Results!$C118=\"\",\"\",IF(Results!$H$2>=2,VALUE(VLOOKUP($B119,Group2!$I$4:$K$103,3)),0))","v":""},{"$f":"IF(Results!$C118=\"\",\"\",IF(Results!$H$2>=3,VALUE(VLOOKUP($B119,Group3!$I$4:$K$103,3)),0))","v":""},{"$f":"IF(Results!$C118=\"\",\"\",IF(Results!$H$2>=4,VALUE(VLOOKUP($B119,Group4!$I$4:$K$103,3)),0))","v":""},{"$f":"IF(Results!$C118=\"\",\"\",SUM(D119:G119))","v":""},{"$f":"IF(Results!E118=\"\",\"\",Results!E118)","v":""},{"$f":"IF(Results!F118=\"\",\"\",Results!F118)","v":""},"",{"$f":"IF(Results!$I118=\"\",\"\",Results!$I118)","v":""}]
[null,116,{"$f":"IF(Results!C119=\"\",\"\",Results!C119)","v":""},{"$f":"IF(Results!$C119=\"\",\"\",IF(Results!$H$2>=1,VALUE(VLOOKUP($B120,Group1!$I$4:$K$103,3)),0))","v":""},{"$f":"IF(Results!$C119=\"\",\"\",IF(Results!$H$2>=2,VALUE(VLOOKUP($B120,Group2!$I$4:$K$103,3)),0))","v":""},{"$f":"IF(Results!$C119=\"\",\"\",IF(Results!$H$2>=3,VALUE(VLOOKUP($B120,Group3!$I$4:$K$103,3)),0))","v":""},{"$f":"IF(Results!$C119=\"\",\"\",IF(Results!$H$2>=4,VALUE(VLOOKUP($B120,Group4!$I$4:$K$103,3)),0))","v":""},{"$f":"IF(Results!$C119=\"\",\"\",SUM(D120:G120))","v":""},{"$f":"IF(Results!E119=\"\",\"\",Results!E119)","v":""},{"$f":"IF(Results!F119=\"\",\"\",Results!F119)","v":""},"",{"$f":"IF(Results!$I119=\"\",\"\",Results!$I119)","v":""}]
[null,117,{"$f":"IF(Results!C120=\"\",\"\",Results!C120)","v":""},{"$f":"IF(Results!$C120=\"\",\"\",IF(Results!$H$2>=1,VALUE(VLOOKUP($B121,Group1!$I$4:$K$103,3)),0))","v":""},{"$f":"IF(Results!$C120=\"\",\"\",IF(Results!$H$2>=2,VALUE(VLOOKUP($B121,Group2!$I$4:$K$103,3)),0))","v":""},{"$f":"IF(Results!$C120=\"\",\"\",IF(Results!$H$2>=3,VALUE(VLOOKUP($B121,Group3!$I$4:$K$103,3)),0))","v":""},{"$f":"IF(Results!$C120=\"\",\"\",IF(Results!$H$2>=4,VALUE(VLOOKUP($B121,Group4!$I$4:$K$103,3)),0))","v":""},{"$f":"IF(Results!$C120=\"\",\"\",SUM(D121:G121))","v":""},{"$f":"IF(Results!E120=\"\",\"\",Results!E120)","v":""},{"$f":"IF(Results!F120=\"\",\"\",Results!F120)","v":""},"",{"$f":"IF(Results!$I120=\"\",\"\",Results!$I120)","v":""}]
[null,118,{"$f":"IF(Results!C121=\"\",\"\",Results!C121)","v":""},{"$f":"IF(Results!$C121=\"\",\"\",IF(Results!$H$2>=1,VALUE(VLOOKUP($B122,Group1!$I$4:$K$103,3)),0))","v":""},{"$f":"IF(Results!$C121=\"\",\"\",IF(Results!$H$2>=2,VALUE(VLOOKUP($B122,Group2!$I$4:$K$103,3)),0))","v":""},{"$f":"IF(Results!$C121=\"\",\"\",IF(Results!$H$2>=3,VALUE(VLOOKUP($B122,Group3!$I$4:$K$103,3)),0))","v":""},{"$f":"IF(Results!$C121=\"\",\"\",IF(Results!$H$2>=4,VALUE(VLOOKUP($B122,Group4!$I$4:$K$103,3)),0))","v":""},{"$f":"IF(Results!$C121=\"\",\"\",SUM(D122:G122))","v":""},{"$f":"IF(Results!E121=\"\",\"\",Results!E121)","v":""},{"$f":"IF(Results!F121=\"\",\"\",Results!F121)","v":""},"",{"$f":"IF(Results!$I121=\"\",\"\",Results!$I121)","v":""}]
[null,119,{"$f":"IF(Results!C122=\"\",\"\",Results!C122)","v":""},{"$f":"IF(Results!$C122=\"\",\"\",IF(Results!$H$2>=1,VALUE(VLOOKUP($B123,Group1!$I$4:$K$103,3)),0))","v":""},{"$f":"IF(Results!$C122=\"\",\"\",IF(Results!$H$2>=2,VALUE(VLOOKUP($B123,Group2!$I$4:$K$103,3)),0))","v":""},{"$f":"IF(Results!$C122=\"\",\"\",IF(Results!$H$2>=3,VALUE(VLOOKUP($B123,Group3!$I$4:$K$103,3)),0))","v":""},{"$f":"IF(Results!$C122=\"\",\"\",IF(Results!$H$2>=4,VALUE(VLOOKUP($B123,Group4!$I$4:$K$103,3)),0))","v":""},{"$f":"IF(Results!$C122=\"\",\"\",SUM(D123:G123))","v":""},{"$f":"IF(Results!E122=\"\",\"\",Results!E122)","v":""},{"$f":"IF(Results!F122=\"\",\"\",Results!F122)","v":""},"",{"$f":"IF(Results!$I122=\"\",\"\",Results!$I122)","v":""}]
[null,120,{"$f":"IF(Results!C123=\"\",\"\",Results!C123)","v":""},{"$f":"IF(Results!$C123=\"\",\"\",IF(Results!$H$2>=1,VALUE(VLOOKUP($B124,Group1!$I$4:$K$103,3)),0))","v":""},{"$f":"IF(Results!$C123=\"\",\"\",IF(Results!$H$2>=2,VALUE(VLOOKUP($B124,Group2!$I$4:$K$103,3)),0))","v":""},{"$f":"IF(Results!$C123=\"\",\"\",IF(Results!$H$2>=3,VALUE(VLOOKUP($B124,Group3!$I$4:$K$103,3)),0))","v":""},{"$f":"IF(Results!$C123=\"\",\"\",IF(Results!$H$2>=4,VALUE(VLOOKUP($B124,Group4!$I$4:$K$103,3)),0))","v":""},{"$f":"IF(Results!$C123=\"\",\"\",SUM(D124:G124))","v":""},{"$f":"IF(Results!E123=\"\",\"\",Results!E123)","v":""},{"$f":"IF(Results!F123=\"\",\"\",Results!F123)","v":""},"",{"$f":"IF(Results!$I123=\"\",\"\",Results!$I123)","v":""}]
[null,121,{"$f":"IF(Results!C124=\"\",\"\",Results!C124)","v":""},{"$f":"IF(Results!$C124=\"\",\"\",IF(Results!$H$2>=1,VALUE(VLOOKUP($B125,Group1!$I$4:$K$103,3)),0))","v":""},{"$f":"IF(Results!$C124=\"\",\"\",IF(Results!$H$2>=2,VALUE(VLOOKUP($B125,Group2!$I$4:$K$103,3)),0))","v":""},{"$f":"IF(Results!$C124=\"\",\"\",IF(Results!$H$2>=3,VALUE(VLOOKUP($B125,Group3!$I$4:$K$103,3)),0))","v":""},{"$f":"IF(Results!$C124=\"\",\"\",IF(Results!$H$2>=4,VALUE(VLOOKUP($B125,Group4!$I$4:$K$103,3)),0))","v":""},{"$f":"IF(Results!$C124=\"\",\"\",SUM(D125:G125))","v":""},{"$f":"IF(Results!E124=\"\",\"\",Results!E124)","v":""},{"$f":"IF(Results!F124=\"\",\"\",Results!F124)","v":""},"",{"$f":"IF(Results!$I124=\"\",\"\",Results!$I124)","v":""}]
[null,122,{"$f":"IF(Results!C125=\"\",\"\",Results!C125)","v":""},{"$f":"IF(Results!$C125=\"\",\"\",IF(Results!$H$2>=1,VALUE(VLOOKUP($B126,Group1!$I$4:$K$103,3)),0))","v":""},{"$f":"IF(Results!$C125=\"\",\"\",IF(Results!$H$2>=2,VALUE(VLOOKUP($B126,Group2!$I$4:$K$103,3)),0))","v":""},{"$f":"IF(Results!$C125=\"\",\"\",IF(Results!$H$2>=3,VALUE(VLOOKUP($B126,Group3!$I$4:$K$103,3)),0))","v":""},{"$f":"IF(Results!$C125=\"\",\"\",IF(Results!$H$2>=4,VALUE(VLOOKUP($B126,Group4!$I$4:$K$103,3)),0))","v":""},{"$f":"IF(Results!$C125=\"\",\"\",SUM(D126:G126))","v":""},{"$f":"IF(Results!E125=\"\",\"\",Results!E125)","v":""},{"$f":"IF(Results!F125=\"\",\"\",Results!F125)","v":""},"",{"$f":"IF(Results!$I125=\"\",\"\",Results!$I125)","v":""}]
[null,123,{"$f":"IF(Results!C126=\"\",\"\",Results!C126)","v":""},{"$f":"IF(Results!$C126=\"\",\"\",IF(Results!$H$2>=1,VALUE(VLOOKUP($B127,Group1!$I$4:$K$103,3)),0))","v":""},{"$f":"IF(Results!$C126=\"\",\"\",IF(Results!$H$2>=2,VALUE(VLOOKUP($B127,Group2!$I$4:$K$103,3)),0))","v":""},{"$f":"IF(Results!$C126=\"\",\"\",IF(Results!$H$2>=3,VALUE(VLOOKUP($B127,Group3!$I$4:$K$103,3)),0))","v":""},{"$f":"IF(Results!$C126=\"\",\"\",IF(Results!$H$2>=4,VALUE(VLOOKUP($B127,Group4!$I$4:$K$103,3)),0))","v":""},{"$f":"IF(Results!$C126=\"\",\"\",SUM(D127:G127))","v":""},{"$f":"IF(Results!E126=\"\",\"\",Results!E126)","v":""},{"$f":"IF(Results!F126=\"\",\"\",Results!F126)","v":""},"",{"$f":"IF(Results!$I126=\"\",\"\",Results!$I126)","v":""}]
[null,124,{"$f":"IF(Results!C127=\"\",\"\",Results!C127)","v":""},{"$f":"IF(Results!$C127=\"\",\"\",IF(Results!$H$2>=1,VALUE(VLOOKUP($B128,Group1!$I$4:$K$103,3)),0))","v":""},{"$f":"IF(Results!$C127=\"\",\"\",IF(Results!$H$2>=2,VALUE(VLOOKUP($B128,Group2!$I$4:$K$103,3)),0))","v":""},{"$f":"IF(Results!$C127=\"\",\"\",IF(Results!$H$2>=3,VALUE(VLOOKUP($B128,Group3!$I$4:$K$103,3)),0))","v":""},{"$f":"IF(Results!$C127=\"\",\"\",IF(Results!$H$2>=4,VALUE(VLOOKUP($B128,Group4!$I$4:$K$103,3)),0))","v":""},{"$f":"IF(Results!$C127=\"\",\"\",SUM(D128:G128))","v":""},{"$f":"IF(Results!E127=\"\",\"\",Results!E127)","v":""},{"$f":"IF(Results!F127=\"\",\"\",Results!F127)","v":""},"",{"$f":"IF(Results!$I127=\"\",\"\",Results!$I127)","v":""}]
[null,125,{"$f":"IF(Results!C128=\"\",\"\",Results!C128)","v":""},{"$f":"IF(Results!$C128=\"\",\"\",IF(Results!$H$2>=1,VALUE(VLOOKUP($B129,Group1!$I$4:$K$103,3)),0))","v":""},{"$f":"IF(Results!$C128=\"\",\"\",IF(Results!$H$2>=2,VALUE(VLOOKUP($B129,Group2!$I$4:$K$103,3)),0))","v":""},{"$f":"IF(Results!$C128=\"\",\"\",IF(Results!$H$2>=3,VALUE(VLOOKUP($B129,Group3!$I$4:$K$103,3)),0))","v":""},{"$f":"IF(Results!$C128=\"\",\"\",IF(Results!$H$2>=4,VALUE(VLOOKUP($B129,Group4!$I$4:$K$103,3)),0))","v":""},{"$f":"IF(Results!$C128=\"\",\"\",SUM(D129:G129))","v":""},{"$f":"IF(Results!E128=\"\",\"\",Results!E128)","v":""},{"$f":"IF(Results!F128=\"\",\"\",Results!F128)","v":""},"",{"$f":"IF(Results!$I128=\"\",\"\",Results!$I128)","v":""}]
[null,126,{"$f":"IF(Results!C129=\"\",\"\",Results!C129)","v":""},{"$f":"IF(Results!$C129=\"\",\"\",IF(Results!$H$2>=1,VALUE(VLOOKUP($B130,Group1!$I$4:$K$103,3)),0))","v":""},{"$f":"IF(Results!$C129=\"\",\"\",IF(Results!$H$2>=2,VALUE(VLOOKUP($B130,Group2!$I$4:$K$103,3)),0))","v":""},{"$f":"IF(Results!$C129=\"\",\"\",IF(Results!$H$2>=3,VALUE(VLOOKUP($B130,Group3!$I$4:$K$103,3)),0))","v":""},{"$f":"IF(Results!$C129=\"\",\"\",IF(Results!$H$2>=4,VALUE(VLOOKUP($B130,Group4!$I$4:$K$103,3)),0))","v":""},{"$f":"IF(Results!$C129=\"\",\"\",SUM(D130:G130))","v":""},{"$f":"IF(Results!E129=\"\",\"\",Results!E129)","v":""},{"$f":"IF(Results!F129=\"\",\"\",Results!F129)","v":""},"",{"$f":"IF(Results!$I129=\"\",\"\",Results!$I129)","v":""}]
[null,127,{"$f":"IF(Results!C130=\"\",\"\",Results!C130)","v":""},{"$f":"IF(Results!$C130=\"\",\"\",IF(Results!$H$2>=1,VALUE(VLOOKUP($B131,Group1!$I$4:$K$103,3)),0))","v":""},{"$f":"IF(Results!$C130=\"\",\"\",IF(Results!$H$2>=2,VALUE(VLOOKUP($B131,Group2!$I$4:$K$103,3)),0))","v":""},{"$f":"IF(Results!$C130=\"\",\"\",IF(Results!$H$2>=3,VALUE(VLOOKUP($B131,Group3!$I$4:$K$103,3)),0))","v":""},{"$f":"IF(Results!$C130=\"\",\"\",IF(Results!$H$2>=4,VALUE(VLOOKUP($B131,Group4!$I$4:$K$103,3)),0))","v":""},{"$f":"IF(Results!$C130=\"\",\"\",SUM(D131:G131))","v":""},{"$f":"IF(Results!E130=\"\",\"\",Results!E130)","v":""},{"$f":"IF(Results!F130=\"\",\"\",Results!F130)","v":""},"",{"$f":"IF(Results!$I130=\"\",\"\",Results!$I130)","v":""}]
[null,128,{"$f":"IF(Results!C131=\"\",\"\",Results!C131)","v":""},{"$f":"IF(Results!$C131=\"\",\"\",IF(Results!$H$2>=1,VALUE(VLOOKUP($B132,Group1!$I$4:$K$103,3)),0))","v":""},{"$f":"IF(Results!$C131=\"\",\"\",IF(Results!$H$2>=2,VALUE(VLOOKUP($B132,Group2!$I$4:$K$103,3)),0))","v":""},{"$f":"IF(Results!$C131=\"\",\"\",IF(Results!$H$2>=3,VALUE(VLOOKUP($B132,Group3!$I$4:$K$103,3)),0))","v":""},{"$f":"IF(Results!$C131=\"\",\"\",IF(Results!$H$2>=4,VALUE(VLOOKUP($B132,Group4!$I$4:$K$103,3)),0))","v":""},{"$f":"IF(Results!$C131=\"\",\"\",SUM(D132:G132))","v":""},{"$f":"IF(Results!E131=\"\",\"\",Results!E131)","v":""},{"$f":"IF(Results!F131=\"\",\"\",Results!F131)","v":""},"",{"$f":"IF(Results!$I131=\"\",\"\",Results!$I131)","v":""}]
[null,129,{"$f":"IF(Results!C132=\"\",\"\",Results!C132)","v":""},{"$f":"IF(Results!$C132=\"\",\"\",IF(Results!$H$2>=1,VALUE(VLOOKUP($B133,Group1!$I$4:$K$103,3)),0))","v":""},{"$f":"IF(Results!$C132=\"\",\"\",IF(Results!$H$2>=2,VALUE(VLOOKUP($B133,Group2!$I$4:$K$103,3)),0))","v":""},{"$f":"IF(Results!$C132=\"\",\"\",IF(Results!$H$2>=3,VALUE(VLOOKUP($B133,Group3!$I$4:$K$103,3)),0))","v":""},{"$f":"IF(Results!$C132=\"\",\"\",IF(Results!$H$2>=4,VALUE(VLOOKUP($B133,Group4!$I$4:$K$103,3)),0))","v":""},{"$f":"IF(Results!$C132=\"\",\"\",SUM(D133:G133))","v":""},{"$f":"IF(Results!E132=\"\",\"\",Results!E132)","v":""},{"$f":"IF(Results!F132=\"\",\"\",Results!F132)","v":""},"",{"$f":"IF(Results!$I132=\"\",\"\",Results!$I132)","v":""}]
[null,130,{"$f":"IF(Results!C133=\"\",\"\",Results!C133)","v":""},{"$f":"IF(Results!$C133=\"\",\"\",IF(Results!$H$2>=1,VALUE(VLOOKUP($B134,Group1!$I$4:$K$103,3)),0))","v":""},{"$f":"IF(Results!$C133=\"\",\"\",IF(Results!$H$2>=2,VALUE(VLOOKUP($B134,Group2!$I$4:$K$103,3)),0))","v":""},{"$f":"IF(Results!$C133=\"\",\"\",IF(Results!$H$2>=3,VALUE(VLOOKUP($B134,Group3!$I$4:$K$103,3)),0))","v":""},{"$f":"IF(Results!$C133=\"\",\"\",IF(Results!$H$2>=4,VALUE(VLOOKUP($B134,Group4!$I$4:$K$103,3)),0))","v":""},{"$f":"IF(Results!$C133=\"\",\"\",SUM(D134:G134))","v":""},{"$f":"IF(Results!E133=\"\",\"\",Results!E133)","v":""},{"$f":"IF(Results!F133=\"\",\"\",Results!F133)","v":""},"",{"$f":"IF(Results!$I133=\"\",\"\",Results!$I133)","v":""}]
[null,131,{"$f":"IF(Results!C134=\"\",\"\",Results!C134)","v":""},{"$f":"IF(Results!$C134=\"\",\"\",IF(Results!$H$2>=1,VALUE(VLOOKUP($B135,Group1!$I$4:$K$103,3)),0))","v":""},{"$f":"IF(Results!$C134=\"\",\"\",IF(Results!$H$2>=2,VALUE(VLOOKUP($B135,Group2!$I$4:$K$103,3)),0))","v":""},{"$f":"IF(Results!$C134=\"\",\"\",IF(Results!$H$2>=3,VALUE(VLOOKUP($B135,Group3!$I$4:$K$103,3)),0))","v":""},{"$f":"IF(Results!$C134=\"\",\"\",IF(Results!$H$2>=4,VALUE(VLOOKUP($B135,Group4!$I$4:$K$103,3)),0))","v":""},{"$f":"IF(Results!$C134=\"\",\"\",SUM(D135:G135))","v":""},{"$f":"IF(Results!E134=\"\",\"\",Results!E134)","v":""},{"$f":"IF(Results!F134=\"\",\"\",Results!F134)","v":""},"",{"$f":"IF(Results!$I134=\"\",\"\",Results!$I134)","v":""}]
[null,132,{"$f":"IF(Results!C135=\"\",\"\",Results!C135)","v":""},{"$f":"IF(Results!$C135=\"\",\"\",IF(Results!$H$2>=1,VALUE(VLOOKUP($B136,Group1!$I$4:$K$103,3)),0))","v":""},{"$f":"IF(Results!$C135=\"\",\"\",IF(Results!$H$2>=2,VALUE(VLOOKUP($B136,Group2!$I$4:$K$103,3)),0))","v":""},{"$f":"IF(Results!$C135=\"\",\"\",IF(Results!$H$2>=3,VALUE(VLOOKUP($B136,Group3!$I$4:$K$103,3)),0))","v":""},{"$f":"IF(Results!$C135=\"\",\"\",IF(Results!$H$2>=4,VALUE(VLOOKUP($B136,Group4!$I$4:$K$103,3)),0))","v":""},{"$f":"IF(Results!$C135=\"\",\"\",SUM(D136:G136))","v":""},{"$f":"IF(Results!E135=\"\",\"\",Results!E135)","v":""},{"$f":"IF(Results!F135=\"\",\"\",Results!F135)","v":""},"",{"$f":"IF(Results!$I135=\"\",\"\",Results!$I135)","v":""}]
[null,133,{"$f":"IF(Results!C136=\"\",\"\",Results!C136)","v":""},{"$f":"IF(Results!$C136=\"\",\"\",IF(Results!$H$2>=1,VALUE(VLOOKUP($B137,Group1!$I$4:$K$103,3)),0))","v":""},{"$f":"IF(Results!$C136=\"\",\"\",IF(Results!$H$2>=2,VALUE(VLOOKUP($B137,Group2!$I$4:$K$103,3)),0))","v":""},{"$f":"IF(Results!$C136=\"\",\"\",IF(Results!$H$2>=3,VALUE(VLOOKUP($B137,Group3!$I$4:$K$103,3)),0))","v":""},{"$f":"IF(Results!$C136=\"\",\"\",IF(Results!$H$2>=4,VALUE(VLOOKUP($B137,Group4!$I$4:$K$103,3)),0))","v":""},{"$f":"IF(Results!$C136=\"\",\"\",SUM(D137:G137))","v":""},{"$f":"IF(Results!E136=\"\",\"\",Results!E136)","v":""},{"$f":"IF(Results!F136=\"\",\"\",Results!F136)","v":""},"",{"$f":"IF(Results!$I136=\"\",\"\",Results!$I136)","v":""}]
[null,134,{"$f":"IF(Results!C137=\"\",\"\",Results!C137)","v":""},{"$f":"IF(Results!$C137=\"\",\"\",IF(Results!$H$2>=1,VALUE(VLOOKUP($B138,Group1!$I$4:$K$103,3)),0))","v":""},{"$f":"IF(Results!$C137=\"\",\"\",IF(Results!$H$2>=2,VALUE(VLOOKUP($B138,Group2!$I$4:$K$103,3)),0))","v":""},{"$f":"IF(Results!$C137=\"\",\"\",IF(Results!$H$2>=3,VALUE(VLOOKUP($B138,Group3!$I$4:$K$103,3)),0))","v":""},{"$f":"IF(Results!$C137=\"\",\"\",IF(Results!$H$2>=4,VALUE(VLOOKUP($B138,Group4!$I$4:$K$103,3)),0))","v":""},{"$f":"IF(Results!$C137=\"\",\"\",SUM(D138:G138))","v":""},{"$f":"IF(Results!E137=\"\",\"\",Results!E137)","v":""},{"$f":"IF(Results!F137=\"\",\"\",Results!F137)","v":""},"",{"$f":"IF(Results!$I137=\"\",\"\",Results!$I137)","v":""}]
[null,135,{"$f":"IF(Results!C138=\"\",\"\",Results!C138)","v":""},{"$f":"IF(Results!$C138=\"\",\"\",IF(Results!$H$2>=1,VALUE(VLOOKUP($B139,Group1!$I$4:$K$103,3)),0))","v":""},{"$f":"IF(Results!$C138=\"\",\"\",IF(Results!$H$2>=2,VALUE(VLOOKUP($B139,Group2!$I$4:$K$103,3)),0))","v":""},{"$f":"IF(Results!$C138=\"\",\"\",IF(Results!$H$2>=3,VALUE(VLOOKUP($B139,Group3!$I$4:$K$103,3)),0))","v":""},{"$f":"IF(Results!$C138=\"\",\"\",IF(Results!$H$2>=4,VALUE(VLOOKUP($B139,Group4!$I$4:$K$103,3)),0))","v":""},{"$f":"IF(Results!$C138=\"\",\"\",SUM(D139:G139))","v":""},{"$f":"IF(Results!E138=\"\",\"\",Results!E138)","v":""},{"$f":"IF(Results!F138=\"\",\"\",Results!F138)","v":""},"",{"$f":"IF(Results!$I138=\"\",\"\",Results!$I138)","v":""}]
[null,136,{"$f":"IF(Results!C139=\"\",\"\",Results!C139)","v":""},{"$f":"IF(Results!$C139=\"\",\"\",IF(Results!$H$2>=1,VALUE(VLOOKUP($B140,Group1!$I$4:$K$103,3)),0))","v":""},{"$f":"IF(Results!$C139=\"\",\"\",IF(Results!$H$2>=2,VALUE(VLOOKUP($B140,Group2!$I$4:$K$103,3)),0))","v":""},{"$f":"IF(Results!$C139=\"\",\"\",IF(Results!$H$2>=3,VALUE(VLOOKUP($B140,Group3!$I$4:$K$103,3)),0))","v":""},{"$f":"IF(Results!$C139=\"\",\"\",IF(Results!$H$2>=4,VALUE(VLOOKUP($B140,Group4!$I$4:$K$103,3)),0))","v":""},{"$f":"IF(Results!$C139=\"\",\"\",SUM(D140:G140))","v":""},{"$f":"IF(Results!E139=\"\",\"\",Results!E139)","v":""},{"$f":"IF(Results!F139=\"\",\"\",Results!F139)","v":""},"",{"$f":"IF(Results!$I139=\"\",\"\",Results!$I139)","v":""}]
[null,137,{"$f":"IF(Results!C140=\"\",\"\",Results!C140)","v":""},{"$f":"IF(Results!$C140=\"\",\"\",IF(Results!$H$2>=1,VALUE(VLOOKUP($B141,Group1!$I$4:$K$103,3)),0))","v":""},{"$f":"IF(Results!$C140=\"\",\"\",IF(Results!$H$2>=2,VALUE(VLOOKUP($B141,Group2!$I$4:$K$103,3)),0))","v":""},{"$f":"IF(Results!$C140=\"\",\"\",IF(Results!$H$2>=3,VALUE(VLOOKUP($B141,Group3!$I$4:$K$103,3)),0))","v":""},{"$f":"IF(Results!$C140=\"\",\"\",IF(Results!$H$2>=4,VALUE(VLOOKUP($B141,Group4!$I$4:$K$103,3)),0))","v":""},{"$f":"IF(Results!$C140=\"\",\"\",SUM(D141:G141))","v":""},{"$f":"IF(Results!E140=\"\",\"\",Results!E140)","v":""},{"$f":"IF(Results!F140=\"\",\"\",Results!F140)","v":""},"",{"$f":"IF(Results!$I140=\"\",\"\",Results!$I140)","v":""}]
[null,138,{"$f":"IF(Results!C141=\"\",\"\",Results!C141)","v":""},{"$f":"IF(Results!$C141=\"\",\"\",IF(Results!$H$2>=1,VALUE(VLOOKUP($B142,Group1!$I$4:$K$103,3)),0))","v":""},{"$f":"IF(Results!$C141=\"\",\"\",IF(Results!$H$2>=2,VALUE(VLOOKUP($B142,Group2!$I$4:$K$103,3)),0))","v":""},{"$f":"IF(Results!$C141=\"\",\"\",IF(Results!$H$2>=3,VALUE(VLOOKUP($B142,Group3!$I$4:$K$103,3)),0))","v":""},{"$f":"IF(Results!$C141=\"\",\"\",IF(Results!$H$2>=4,VALUE(VLOOKUP($B142,Group4!$I$4:$K$103,3)),0))","v":""},{"$f":"IF(Results!$C141=\"\",\"\",SUM(D142:G142))","v":""},{"$f":"IF(Results!E141=\"\",\"\",Results!E141)","v":""},{"$f":"IF(Results!F141=\"\",\"\",Results!F141)","v":""},"",{"$f":"IF(Results!$I141=\"\",\"\",Results!$I141)","v":""}]
[null,139,{"$f":"IF(Results!C142=\"\",\"\",Results!C142)","v":""},{"$f":"IF(Results!$C142=\"\",\"\",IF(Results!$H$2>=1,VALUE(VLOOKUP($B143,Group1!$I$4:$K$103,3)),0))","v":""},{"$f":"IF(Results!$C142=\"\",\"\",IF(Results!$H$2>=2,VALUE(VLOOKUP($B143,Group2!$I$4:$K$103,3)),0))","v":""},{"$f":"IF(Results!$C142=\"\",\"\",IF(Results!$H$2>=3,VALUE(VLOOKUP($B143,Group3!$I$4:$K$103,3)),0))","v":""},{"$f":"IF(Results!$C142=\"\",\"\",IF(Results!$H$2>=4,VALUE(VLOOKUP($B143,Group4!$I$4:$K$103,3)),0))","v":""},{"$f":"IF(Results!$C142=\"\",\"\",SUM(D143:G143))","v":""},{"$f":"IF(Results!E142=\"\",\"\",Results!E142)","v":""},{"$f":"IF(Results!F142=\"\",\"\",Results!F142)","v":""},"",{"$f":"IF(Results!$I142=\"\",\"\",Results!$I142)","v":""}]
[null,140,{"$f":"IF(Results!C143=\"\",\"\",Results!C143)","v":""},{"$f":"IF(Results!$C143=\"\",\"\",IF(Results!$H$2>=1,VALUE(VLOOKUP($B144,Group1!$I$4:$K$103,3)),0))","v":""},{"$f":"IF(Results!$C143=\"\",\"\",IF(Results!$H$2>=2,VALUE(VLOOKUP($B144,Group2!$I$4:$K$103,3)),0))","v":""},{"$f":"IF(Results!$C143=\"\",\"\",IF(Results!$H$2>=3,VALUE(VLOOKUP($B144,Group3!$I$4:$K$103,3)),0))","v":""},{"$f":"IF(Results!$C143=\"\",\"\",IF(Results!$H$2>=4,VALUE(VLOOKUP($B144,Group4!$I$4:$K$103,3)),0))","v":""},{"$f":"IF(Results!$C143=\"\",\"\",SUM(D144:G144))","v":""},{"$f":"IF(Results!E143=\"\",\"\",Results!E143)","v":""},{"$f":"IF(Results!F143=\"\",\"\",Results!F143)","v":""},"",{"$f":"IF(Results!$I143=\"\",\"\",Results!$I143)","v":""}]
[null,141,{"$f":"IF(Results!C144=\"\",\"\",Results!C144)","v":""},{"$f":"IF(Results!$C144=\"\",\"\",IF(Results!$H$2>=1,VALUE(VLOOKUP($B145,Group1!$I$4:$K$103,3)),0))","v":""},{"$f":"IF(Results!$C144=\"\",\"\",IF(Results!$H$2>=2,VALUE(VLOOKUP($B145,Group2!$I$4:$K$103,3)),0))","v":""},{"$f":"IF(Results!$C144=\"\",\"\",IF(Results!$H$2>=3,VALUE(VLOOKUP($B145,Group3!$I$4:$K$103,3)),0))","v":""},{"$f":"IF(Results!$C144=\"\",\"\",IF(Results!$H$2>=4,VALUE(VLOOKUP($B145,Group4!$I$4:$K$103,3)),0))","v":""},{"$f":"IF(Results!$C144=\"\",\"\",SUM(D145:G145))","v":""},{"$f":"IF(Results!E144=\"\",\"\",Results!E144)","v":""},{"$f":"IF(Results!F144=\"\",\"\",Results!F144)","v":""},"",{"$f":"IF(Results!$I144=\"\",\"\",Results!$I144)","v":""}]
[null,142,{"$f":"IF(Results!C145=\"\",\"\",Results!C145)","v":""},{"$f":"IF(Results!$C145=\"\",\"\",IF(Results!$H$2>=1,VALUE(VLOOKUP($B146,Group1!$I$4:$K$103,3)),0))","v":""},{"$f":"IF(Results!$C145=\"\",\"\",IF(Results!$H$2>=2,VALUE(VLOOKUP($B146,Group2!$I$4:$K$103,3)),0))","v":""},{"$f":"IF(Results!$C145=\"\",\"\",IF(Results!$H$2>=3,VALUE(VLOOKUP($B146,Group3!$I$4:$K$103,3)),0))","v":""},{"$f":"IF(Results!$C145=\"\",\"\",IF(Results!$H$2>=4,VALUE(VLOOKUP($B146,Group4!$I$4:$K$103,3)),0))","v":""},{"$f":"IF(Results!$C145=\"\",\"\",SUM(D146:G146))","v":""},{"$f":"IF(Results!E145=\"\",\"\",Results!E145)","v":""},{"$f":"IF(Results!F145=\"\",\"\",Results!F145)","v":""},"",{"$f":"IF(Results!$I145=\"\",\"\",Results!$I145)","v":""}]
[null,143,{"$f":"IF(Results!C146=\"\",\"\",Results!C146)","v":""},{"$f":"IF(Results!$C146=\"\",\"\",IF(Results!$H$2>=1,VALUE(VLOOKUP($B147,Group1!$I$4:$K$103,3)),0))","v":""},{"$f":"IF(Results!$C146=\"\",\"\",IF(Results!$H$2>=2,VALUE(VLOOKUP($B147,Group2!$I$4:$K$103,3)),0))","v":""},{"$f":"IF(Results!$C146=\"\",\"\",IF(Results!$H$2>=3,VALUE(VLOOKUP($B147,Group3!$I$4:$K$103,3)),0))","v":""},{"$f":"IF(Results!$C146=\"\",\"\",IF(Results!$H$2>=4,VALUE(VLOOKUP($B147,Group4!$I$4:$K$103,3)),0))","v":""},{"$f":"IF(Results!$C146=\"\",\"\",SUM(D147:G147))","v":""},{"$f":"IF(Results!E146=\"\",\"\",Results!E146)","v":""},{"$f":"IF(Results!F146=\"\",\"\",Results!F146)","v":""},"",{"$f":"IF(Results!$I146=\"\",\"\",Results!$I146)","v":""}]
[null,144,{"$f":"IF(Results!C147=\"\",\"\",Results!C147)","v":""},{"$f":"IF(Results!$C147=\"\",\"\",IF(Results!$H$2>=1,VALUE(VLOOKUP($B148,Group1!$I$4:$K$103,3)),0))","v":""},{"$f":"IF(Results!$C147=\"\",\"\",IF(Results!$H$2>=2,VALUE(VLOOKUP($B148,Group2!$I$4:$K$103,3)),0))","v":""},{"$f":"IF(Results!$C147=\"\",\"\",IF(Results!$H$2>=3,VALUE(VLOOKUP($B148,Group3!$I$4:$K$103,3)),0))","v":""},{"$f":"IF(Results!$C147=\"\",\"\",IF(Results!$H$2>=4,VALUE(VLOOKUP($B148,Group4!$I$4:$K$103,3)),0))","v":""},{"$f":"IF(Results!$C147=\"\",\"\",SUM(D148:G148))","v":""},{"$f":"IF(Results!E147=\"\",\"\",Results!E147)","v":""},{"$f":"IF(Results!F147=\"\",\"\",Results!F147)","v":""},"",{"$f":"IF(Results!$I147=\"\",\"\",Results!$I147)","v":""}]
[null,145,{"$f":"IF(Results!C148=\"\",\"\",Results!C148)","v":""},{"$f":"IF(Results!$C148=\"\",\"\",IF(Results!$H$2>=1,VALUE(VLOOKUP($B149,Group1!$I$4:$K$103,3)),0))","v":""},{"$f":"IF(Results!$C148=\"\",\"\",IF(Results!$H$2>=2,VALUE(VLOOKUP($B149,Group2!$I$4:$K$103,3)),0))","v":""},{"$f":"IF(Results!$C148=\"\",\"\",IF(Results!$H$2>=3,VALUE(VLOOKUP($B149,Group3!$I$4:$K$103,3)),0))","v":""},{"$f":"IF(Results!$C148=\"\",\"\",IF(Results!$H$2>=4,VALUE(VLOOKUP($B149,Group4!$I$4:$K$103,3)),0))","v":""},{"$f":"IF(Results!$C148=\"\",\"\",SUM(D149:G149))","v":""},{"$f":"IF(Results!E148=\"\",\"\",Results!E148)","v":""},{"$f":"IF(Results!F148=\"\",\"\",Results!F148)","v":""},"",{"$f":"IF(Results!$I148=\"\",\"\",Results!$I148)","v":""}]
[null,146,{"$f":"IF(Results!C149=\"\",\"\",Results!C149)","v":""},{"$f":"IF(Results!$C149=\"\",\"\",IF(Results!$H$2>=1,VALUE(VLOOKUP($B150,Group1!$I$4:$K$103,3)),0))","v":""},{"$f":"IF(Results!$C149=\"\",\"\",IF(Results!$H$2>=2,VALUE(VLOOKUP($B150,Group2!$I$4:$K$103,3)),0))","v":""},{"$f":"IF(Results!$C149=\"\",\"\",IF(Results!$H$2>=3,VALUE(VLOOKUP($B150,Group3!$I$4:$K$103,3)),0))","v":""},{"$f":"IF(Results!$C149=\"\",\"\",IF(Results!$H$2>=4,VALUE(VLOOKUP($B150,Group4!$I$4:$K$103,3)),0))","v":""},{"$f":"IF(Results!$C149=\"\",\"\",SUM(D150:G150))","v":""},{"$f":"IF(Results!E149=\"\",\"\",Results!E149)","v":""},{"$f":"IF(Results!F149=\"\",\"\",Results!F149)","v":""},"",{"$f":"IF(Results!$I149=\"\",\"\",Results!$I149)","v":""}]
[null,147,{"$f":"IF(Results!C150=\"\",\"\",Results!C150)","v":""},{"$f":"IF(Results!$C150=\"\",\"\",IF(Results!$H$2>=1,VALUE(VLOOKUP($B151,Group1!$I$4:$K$103,3)),0))","v":""},{"$f":"IF(Results!$C150=\"\",\"\",IF(Results!$H$2>=2,VALUE(VLOOKUP($B151,Group2!$I$4:$K$103,3)),0))","v":""},{"$f":"IF(Results!$C150=\"\",\"\",IF(Results!$H$2>=3,VALUE(VLOOKUP($B151,Group3!$I$4:$K$103,3)),0))","v":""},{"$f":"IF(Results!$C150=\"\",\"\",IF(Results!$H$2>=4,VALUE(VLOOKUP($B151,Group4!$I$4:$K$103,3)),0))","v":""},{"$f":"IF(Results!$C150=\"\",\"\",SUM(D151:G151))","v":""},{"$f":"IF(Results!E150=\"\",\"\",Results!E150)","v":""},{"$f":"IF(Results!F150=\"\",\"\",Results!F150)","v":""},"",{"$f":"IF(Results!$I150=\"\",\"\",Results!$I150)","v":""}]
[null,148,{"$f":"IF(Results!C151=\"\",\"\",Results!C151)","v":""},{"$f":"IF(Results!$C151=\"\",\"\",IF(Results!$H$2>=1,VALUE(VLOOKUP($B152,Group1!$I$4:$K$103,3)),0))","v":""},{"$f":"IF(Results!$C151=\"\",\"\",IF(Results!$H$2>=2,VALUE(VLOOKUP($B152,Group2!$I$4:$K$103,3)),0))","v":""},{"$f":"IF(Results!$C151=\"\",\"\",IF(Results!$H$2>=3,VALUE(VLOOKUP($B152,Group3!$I$4:$K$103,3)),0))","v":""},{"$f":"IF(Results!$C151=\"\",\"\",IF(Results!$H$2>=4,VALUE(VLOOKUP($B152,Group4!$I$4:$K$103,3)),0))","v":""},{"$f":"IF(Results!$C151=\"\",\"\",SUM(D152:G152))","v":""},{"$f":"IF(Results!E151=\"\",\"\",Results!E151)","v":""},{"$f":"IF(Results!F151=\"\",\"\",Results!F151)","v":""},"",{"$f":"IF(Results!$I151=\"\",\"\",Results!$I151)","v":""}]
[null,149,{"$f":"IF(Results!C152=\"\",\"\",Results!C152)","v":""},{"$f":"IF(Results!$C152=\"\",\"\",IF(Results!$H$2>=1,VALUE(VLOOKUP($B153,Group1!$I$4:$K$103,3)),0))","v":""},{"$f":"IF(Results!$C152=\"\",\"\",IF(Results!$H$2>=2,VALUE(VLOOKUP($B153,Group2!$I$4:$K$103,3)),0))","v":""},{"$f":"IF(Results!$C152=\"\",\"\",IF(Results!$H$2>=3,VALUE(VLOOKUP($B153,Group3!$I$4:$K$103,3)),0))","v":""},{"$f":"IF(Results!$C152=\"\",\"\",IF(Results!$H$2>=4,VALUE(VLOOKUP($B153,Group4!$I$4:$K$103,3)),0))","v":""},{"$f":"IF(Results!$C152=\"\",\"\",SUM(D153:G153))","v":""},{"$f":"IF(Results!E152=\"\",\"\",Results!E152)","v":""},{"$f":"IF(Results!F152=\"\",\"\",Results!F152)","v":""},"",{"$f":"IF(Results!$I152=\"\",\"\",Results!$I152)","v":""}]
[null,150,{"$f":"IF(Results!C153=\"\",\"\",Results!C153)","v":""},{"$f":"IF(Results!$C153=\"\",\"\",IF(Results!$H$2>=1,VALUE(VLOOKUP($B154,Group1!$I$4:$K$103,3)),0))","v":""},{"$f":"IF(Results!$C153=\"\",\"\",IF(Results!$H$2>=2,VALUE(VLOOKUP($B154,Group2!$I$4:$K$103,3)),0))","v":""},{"$f":"IF(Results!$C153=\"\",\"\",IF(Results!$H$2>=3,VALUE(VLOOKUP($B154,Group3!$I$4:$K$103,3)),0))","v":""},{"$f":"IF(Results!$C153=\"\",\"\",IF(Results!$H$2>=4,VALUE(VLOOKUP($B154,Group4!$I$4:$K$103,3)),0))","v":""},{"$f":"IF(Results!$C153=\"\",\"\",SUM(D154:G154))","v":""},{"$f":"IF(Results!E153=\"\",\"\",Results!E153)","v":""},{"$f":"IF(Results!F153=\"\",\"\",Results!F153)","v":""},"",{"$f":"IF(Results!$I153=\"\",\"\",Results!$I153)","v":""}]
[null,151,{"$f":"IF(Results!C154=\"\",\"\",Results!C154)","v":""},{"$f":"IF(Results!$C154=\"\",\"\",IF(Results!$H$2>=1,VALUE(VLOOKUP($B155,Group1!$I$4:$K$103,3)),0))","v":""},{"$f":"IF(Results!$C154=\"\",\"\",IF(Results!$H$2>=2,VALUE(VLOOKUP($B155,Group2!$I$4:$K$103,3)),0))","v":""},{"$f":"IF(Results!$C154=\"\",\"\",IF(Results!$H$2>=3,VALUE(VLOOKUP($B155,Group3!$I$4:$K$103,3)),0))","v":""},{"$f":"IF(Results!$C154=\"\",\"\",IF(Results!$H$2>=4,VALUE(VLOOKUP($B155,Group4!$I$4:$K$103,3)),0))","v":""},{"$f":"IF(Results!$C154=\"\",\"\",SUM(D155:G155))","v":""},{"$f":"IF(Results!E154=\"\",\"\",Results!E154)","v":""},{"$f":"IF(Results!F154=\"\",\"\",Results!F154)","v":""},"",{"$f":"IF(Results!$I154=\"\",\"\",Results!$I154)","v":""}]
[null,152,{"$f":"IF(Results!C155=\"\",\"\",Results!C155)","v":""},{"$f":"IF(Results!$C155=\"\",\"\",IF(Results!$H$2>=1,VALUE(VLOOKUP($B156,Group1!$I$4:$K$103,3)),0))","v":""},{"$f":"IF(Results!$C155=\"\",\"\",IF(Results!$H$2>=2,VALUE(VLOOKUP($B156,Group2!$I$4:$K$103,3)),0))","v":""},{"$f":"IF(Results!$C155=\"\",\"\",IF(Results!$H$2>=3,VALUE(VLOOKUP($B156,Group3!$I$4:$K$103,3)),0))","v":""},{"$f":"IF(Results!$C155=\"\",\"\",IF(Results!$H$2>=4,VALUE(VLOOKUP($B156,Group4!$I$4:$K$103,3)),0))","v":""},{"$f":"IF(Results!$C155=\"\",\"\",SUM(D156:G156))","v":""},{"$f":"IF(Results!E155=\"\",\"\",Results!E155)","v":""},{"$f":"IF(Results!F155=\"\",\"\",Results!F155)","v":""},"",{"$f":"IF(Results!$I155=\"\",\"\",Results!$I155)","v":""}]
[null,153,{"$f":"IF(Results!C156=\"\",\"\",Results!C156)","v":""},{"$f":"IF(Results!$C156=\"\",\"\",IF(Results!$H$2>=1,VALUE(VLOOKUP($B157,Group1!$I$4:$K$103,3)),0))","v":""},{"$f":"IF(Results!$C156=\"\",\"\",IF(Results!$H$2>=2,VALUE(VLOOKUP($B157,Group2!$I$4:$K$103,3)),0))","v":""},{"$f":"IF(Results!$C156=\"\",\"\",IF(Results!$H$2>=3,VALUE(VLOOKUP($B157,Group3!$I$4:$K$103,3)),0))","v":""},{"$f":"IF(Results!$C156=\"\",\"\",IF(Results!$H$2>=4,VALUE(VLOOKUP($B157,Group4!$I$4:$K$103,3)),0))","v":""},{"$f":"IF(Results!$C156=\"\",\"\",SUM(D157:G157))","v":""},{"$f":"IF(Results!E156=\"\",\"\",Results!E156)","v":""},{"$f":"IF(Results!F156=\"\",\"\",Results!F156)","v":""},"",{"$f":"IF(Results!$I156=\"\",\"\",Results!$I156)","v":""}]
[null,154,{"$f":"IF(Results!C157=\"\",\"\",Results!C157)","v":""},{"$f":"IF(Results!$C157=\"\",\"\",IF(Results!$H$2>=1,VALUE(VLOOKUP($B158,Group1!$I$4:$K$103,3)),0))","v":""},{"$f":"IF(Results!$C157=\"\",\"\",IF(Results!$H$2>=2,VALUE(VLOOKUP($B158,Group2!$I$4:$K$103,3)),0))","v":""},{"$f":"IF(Results!$C157=\"\",\"\",IF(Results!$H$2>=3,VALUE(VLOOKUP($B158,Group3!$I$4:$K$103,3)),0))","v":""},{"$f":"IF(Results!$C157=\"\",\"\",IF(Results!$H$2>=4,VALUE(VLOOKUP($B158,Group4!$I$4:$K$103,3)),0))","v":""},{"$f":"IF(Results!$C157=\"\",\"\",SUM(D158:G158))","v":""},{"$f":"IF(Results!E157=\"\",\"\",Results!E157)","v":""},{"$f":"IF(Results!F157=\"\",\"\",Results!F157)","v":""},"",{"$f":"IF(Results!$I157=\"\",\"\",Results!$I157)","v":""}]
[null,155,{"$f":"IF(Results!C158=\"\",\"\",Results!C158)","v":""},{"$f":"IF(Results!$C158=\"\",\"\",IF(Results!$H$2>=1,VALUE(VLOOKUP($B159,Group1!$I$4:$K$103,3)),0))","v":""},{"$f":"IF(Results!$C158=\"\",\"\",IF(Results!$H$2>=2,VALUE(VLOOKUP($B159,Group2!$I$4:$K$103,3)),0))","v":""},{"$f":"IF(Results!$C158=\"\",\"\",IF(Results!$H$2>=3,VALUE(VLOOKUP($B159,Group3!$I$4:$K$103,3)),0))","v":""},{"$f":"IF(Results!$C158=\"\",\"\",IF(Results!$H$2>=4,VALUE(VLOOKUP($B159,Group4!$I$4:$K$103,3)),0))","v":""},{"$f":"IF(Results!$C158=\"\",\"\",SUM(D159:G159))","v":""},{"$f":"IF(Results!E158=\"\",\"\",Results!E158)","v":""},{"$f":"IF(Results!F158=\"\",\"\",Results!F158)","v":""},"",{"$f":"IF(Results!$I158=\"\",\"\",Results!$I158)","v":""}]
[null,156,{"$f":"IF(Results!C159=\"\",\"\",Results!C159)","v":""},{"$f":"IF(Results!$C159=\"\",\"\",IF(Results!$H$2>=1,VALUE(VLOOKUP($B160,Group1!$I$4:$K$103,3)),0))","v":""},{"$f":"IF(Results!$C159=\"\",\"\",IF(Results!$H$2>=2,VALUE(VLOOKUP($B160,Group2!$I$4:$K$103,3)),0))","v":""},{"$f":"IF(Results!$C159=\"\",\"\",IF(Results!$H$2>=3,VALUE(VLOOKUP($B160,Group3!$I$4:$K$103,3)),0))","v":""},{"$f":"IF(Results!$C159=\"\",\"\",IF(Results!$H$2>=4,VALUE(VLOOKUP($B160,Group4!$I$4:$K$103,3)),0))","v":""},{"$f":"IF(Results!$C159=\"\",\"\",SUM(D160:G160))","v":""},{"$f":"IF(Results!E159=\"\",\"\",Results!E159)","v":""},{"$f":"IF(Results!F159=\"\",\"\",Results!F159)","v":""},"",{"$f":"IF(Results!$I159=\"\",\"\",Results!$I159)","v":""}]
[null,157,{"$f":"IF(Results!C160=\"\",\"\",Results!C160)","v":""},{"$f":"IF(Results!$C160=\"\",\"\",IF(Results!$H$2>=1,VALUE(VLOOKUP($B161,Group1!$I$4:$K$103,3)),0))","v":""},{"$f":"IF(Results!$C160=\"\",\"\",IF(Results!$H$2>=2,VALUE(VLOOKUP($B161,Group2!$I$4:$K$103,3)),0))","v":""},{"$f":"IF(Results!$C160=\"\",\"\",IF(Results!$H$2>=3,VALUE(VLOOKUP($B161,Group3!$I$4:$K$103,3)),0))","v":""},{"$f":"IF(Results!$C160=\"\",\"\",IF(Results!$H$2>=4,VALUE(VLOOKUP($B161,Group4!$I$4:$K$103,3)),0))","v":""},{"$f":"IF(Results!$C160=\"\",\"\",SUM(D161:G161))","v":""},{"$f":"IF(Results!E160=\"\",\"\",Results!E160)","v":""},{"$f":"IF(Results!F160=\"\",\"\",Results!F160)","v":""},"",{"$f":"IF(Results!$I160=\"\",\"\",Results!$I160)","v":""}]
[null,158,{"$f":"IF(Results!C161=\"\",\"\",Results!C161)","v":""},{"$f":"IF(Results!$C161=\"\",\"\",IF(Results!$H$2>=1,VALUE(VLOOKUP($B162,Group1!$I$4:$K$103,3)),0))","v":""},{"$f":"IF(Results!$C161=\"\",\"\",IF(Results!$H$2>=2,VALUE(VLOOKUP($B162,Group2!$I$4:$K$103,3)),0))","v":""},{"$f":"IF(Results!$C161=\"\",\"\",IF(Results!$H$2>=3,VALUE(VLOOKUP($B162,Group3!$I$4:$K$103,3)),0))","v":""},{"$f":"IF(Results!$C161=\"\",\"\",IF(Results!$H$2>=4,VALUE(VLOOKUP($B162,Group4!$I$4:$K$103,3)),0))","v":""},{"$f":"IF(Results!$C161=\"\",\"\",SUM(D162:G162))","v":""},{"$f":"IF(Results!E161=\"\",\"\",Results!E161)","v":""},{"$f":"IF(Results!F161=\"\",\"\",Results!F161)","v":""},"",{"$f":"IF(Results!$I161=\"\",\"\",Results!$I161)","v":""}]
[null,159,{"$f":"IF(Results!C162=\"\",\"\",Results!C162)","v":""},{"$f":"IF(Results!$C162=\"\",\"\",IF(Results!$H$2>=1,VALUE(VLOOKUP($B163,Group1!$I$4:$K$103,3)),0))","v":""},{"$f":"IF(Results!$C162=\"\",\"\",IF(Results!$H$2>=2,VALUE(VLOOKUP($B163,Group2!$I$4:$K$103,3)),0))","v":""},{"$f":"IF(Results!$C162=\"\",\"\",IF(Results!$H$2>=3,VALUE(VLOOKUP($B163,Group3!$I$4:$K$103,3)),0))","v":""},{"$f":"IF(Results!$C162=\"\",\"\",IF(Results!$H$2>=4,VALUE(VLOOKUP($B163,Group4!$I$4:$K$103,3)),0))","v":""},{"$f":"IF(Results!$C162=\"\",\"\",SUM(D163:G163))","v":""},{"$f":"IF(Results!E162=\"\",\"\",Results!E162)","v":""},{"$f":"IF(Results!F162=\"\",\"\",Results!F162)","v":""},"",{"$f":"IF(Results!$I162=\"\",\"\",Results!$I162)","v":""}]
[null,160,{"$f":"IF(Results!C163=\"\",\"\",Results!C163)","v":""},{"$f":"IF(Results!$C163=\"\",\"\",IF(Results!$H$2>=1,VALUE(VLOOKUP($B164,Group1!$I$4:$K$103,3)),0))","v":""},{"$f":"IF(Results!$C163=\"\",\"\",IF(Results!$H$2>=2,VALUE(VLOOKUP($B164,Group2!$I$4:$K$103,3)),0))","v":""},{"$f":"IF(Results!$C163=\"\",\"\",IF(Results!$H$2>=3,VALUE(VLOOKUP($B164,Group3!$I$4:$K$103,3)),0))","v":""},{"$f":"IF(Results!$C163=\"\",\"\",IF(Results!$H$2>=4,VALUE(VLOOKUP($B164,Group4!$I$4:$K$103,3)),0))","v":""},{"$f":"IF(Results!$C163=\"\",\"\",SUM(D164:G164))","v":""},{"$f":"IF(Results!E163=\"\",\"\",Results!E163)","v":""},{"$f":"IF(Results!F163=\"\",\"\",Results!F163)","v":""},"",{"$f":"IF(Results!$I163=\"\",\"\",Results!$I163)","v":""}]
[null,161,{"$f":"IF(Results!C164=\"\",\"\",Results!C164)","v":""},{"$f":"IF(Results!$C164=\"\",\"\",IF(Results!$H$2>=1,VALUE(VLOOKUP($B165,Group1!$I$4:$K$103,3)),0))","v":""},{"$f":"IF(Results!$C164=\"\",\"\",IF(Results!$H$2>=2,VALUE(VLOOKUP($B165,Group2!$I$4:$K$103,3)),0))","v":""},{"$f":"IF(Results!$C164=\"\",\"\",IF(Results!$H$2>=3,VALUE(VLOOKUP($B165,Group3!$I$4:$K$103,3)),0))","v":""},{"$f":"IF(Results!$C164=\"\",\"\",IF(Results!$H$2>=4,VALUE(VLOOKUP($B165,Group4!$I$4:$K$103,3)),0))","v":""},{"$f":"IF(Results!$C164=\"\",\"\",SUM(D165:G165))","v":""},{"$f":"IF(Results!E164=\"\",\"\",Results!E164)","v":""},{"$f":"IF(Results!F164=\"\",\"\",Results!F164)","v":""},"",{"$f":"IF(Results!$I164=\"\",\"\",Results!$I164)","v":""}]
[null,162,{"$f":"IF(Results!C165=\"\",\"\",Results!C165)","v":""},{"$f":"IF(Results!$C165=\"\",\"\",IF(Results!$H$2>=1,VALUE(VLOOKUP($B166,Group1!$I$4:$K$103,3)),0))","v":""},{"$f":"IF(Results!$C165=\"\",\"\",IF(Results!$H$2>=2,VALUE(VLOOKUP($B166,Group2!$I$4:$K$103,3)),0))","v":""},{"$f":"IF(Results!$C165=\"\",\"\",IF(Results!$H$2>=3,VALUE(VLOOKUP($B166,Group3!$I$4:$K$103,3)),0))","v":""},{"$f":"IF(Results!$C165=\"\",\"\",IF(Results!$H$2>=4,VALUE(VLOOKUP($B166,Group4!$I$4:$K$103,3)),0))","v":""},{"$f":"IF(Results!$C165=\"\",\"\",SUM(D166:G166))","v":""},{"$f":"IF(Results!E165=\"\",\"\",Results!E165)","v":""},{"$f":"IF(Results!F165=\"\",\"\",Results!F165)","v":""},"",{"$f":"IF(Results!$I165=\"\",\"\",Results!$I165)","v":""}]
[null,163,{"$f":"IF(Results!C166=\"\",\"\",Results!C166)","v":""},{"$f":"IF(Results!$C166=\"\",\"\",IF(Results!$H$2>=1,VALUE(VLOOKUP($B167,Group1!$I$4:$K$103,3)),0))","v":""},{"$f":"IF(Results!$C166=\"\",\"\",IF(Results!$H$2>=2,VALUE(VLOOKUP($B167,Group2!$I$4:$K$103,3)),0))","v":""},{"$f":"IF(Results!$C166=\"\",\"\",IF(Results!$H$2>=3,VALUE(VLOOKUP($B167,Group3!$I$4:$K$103,3)),0))","v":""},{"$f":"IF(Results!$C166=\"\",\"\",IF(Results!$H$2>=4,VALUE(VLOOKUP($B167,Group4!$I$4:$K$103,3)),0))","v":""},{"$f":"IF(Results!$C166=\"\",\"\",SUM(D167:G167))","v":""},{"$f":"IF(Results!E166=\"\",\"\",Results!E166)","v":""},{"$f":"IF(Results!F166=\"\",\"\",Results!F166)","v":""},"",{"$f":"IF(Results!$I166=\"\",\"\",Results!$I166)","v":""}]
[null,164,{"$f":"IF(Results!C167=\"\",\"\",Results!C167)","v":""},{"$f":"IF(Results!$C167=\"\",\"\",IF(Results!$H$2>=1,VALUE(VLOOKUP($B168,Group1!$I$4:$K$103,3)),0))","v":""},{"$f":"IF(Results!$C167=\"\",\"\",IF(Results!$H$2>=2,VALUE(VLOOKUP($B168,Group2!$I$4:$K$103,3)),0))","v":""},{"$f":"IF(Results!$C167=\"\",\"\",IF(Results!$H$2>=3,VALUE(VLOOKUP($B168,Group3!$I$4:$K$103,3)),0))","v":""},{"$f":"IF(Results!$C167=\"\",\"\",IF(Results!$H$2>=4,VALUE(VLOOKUP($B168,Group4!$I$4:$K$103,3)),0))","v":""},{"$f":"IF(Results!$C167=\"\",\"\",SUM(D168:G168))","v":""},{"$f":"IF(Results!E167=\"\",\"\",Results!E167)","v":""},{"$f":"IF(Results!F167=\"\",\"\",Results!F167)","v":""},"",{"$f":"IF(Results!$I167=\"\",\"\",Results!$I167)","v":""}]
[null,165,{"$f":"IF(Results!C168=\"\",\"\",Results!C168)","v":""},{"$f":"IF(Results!$C168=\"\",\"\",IF(Results!$H$2>=1,VALUE(VLOOKUP($B169,Group1!$I$4:$K$103,3)),0))","v":""},{"$f":"IF(Results!$C168=\"\",\"\",IF(Results!$H$2>=2,VALUE(VLOOKUP($B169,Group2!$I$4:$K$103,3)),0))","v":""},{"$f":"IF(Results!$C168=\"\",\"\",IF(Results!$H$2>=3,VALUE(VLOOKUP($B169,Group3!$I$4:$K$103,3)),0))","v":""},{"$f":"IF(Results!$C168=\"\",\"\",IF(Results!$H$2>=4,VALUE(VLOOKUP($B169,Group4!$I$4:$K$103,3)),0))","v":""},{"$f":"IF(Results!$C168=\"\",\"\",SUM(D169:G169))","v":""},{"$f":"IF(Results!E168=\"\",\"\",Results!E168)","v":""},{"$f":"IF(Results!F168=\"\",\"\",Results!F168)","v":""},{"$f":"IF(C169=\"\",\"\",SUM(H169:J169))","v":""},{"$f":"IF(Results!$I168=\"\",\"\",Results!$I168)","v":""}]
[null,166,{"$f":"IF(Results!C169=\"\",\"\",Results!C169)","v":""},{"$f":"IF(Results!$C169=\"\",\"\",IF(Results!$H$2>=1,VALUE(VLOOKUP($B170,Group1!$I$4:$K$103,3)),0))","v":""},{"$f":"IF(Results!$C169=\"\",\"\",IF(Results!$H$2>=2,VALUE(VLOOKUP($B170,Group2!$I$4:$K$103,3)),0))","v":""},{"$f":"IF(Results!$C169=\"\",\"\",IF(Results!$H$2>=3,VALUE(VLOOKUP($B170,Group3!$I$4:$K$103,3)),0))","v":""},{"$f":"IF(Results!$C169=\"\",\"\",IF(Results!$H$2>=4,VALUE(VLOOKUP($B170,Group4!$I$4:$K$103,3)),0))","v":""},{"$f":"IF(Results!$C169=\"\",\"\",SUM(D170:G170))","v":""},{"$f":"IF(Results!E169=\"\",\"\",Results!E169)","v":""},{"$f":"IF(Results!F169=\"\",\"\",Results!F169)","v":""},"",{"$f":"IF(Results!$I169=\"\",\"\",Results!$I169)","v":""}]
[null,167,{"$f":"IF(Results!C170=\"\",\"\",Results!C170)","v":""},{"$f":"IF(Results!$C170=\"\",\"\",IF(Results!$H$2>=1,VALUE(VLOOKUP($B171,Group1!$I$4:$K$103,3)),0))","v":""},{"$f":"IF(Results!$C170=\"\",\"\",IF(Results!$H$2>=2,VALUE(VLOOKUP($B171,Group2!$I$4:$K$103,3)),0))","v":""},{"$f":"IF(Results!$C170=\"\",\"\",IF(Results!$H$2>=3,VALUE(VLOOKUP($B171,Group3!$I$4:$K$103,3)),0))","v":""},{"$f":"IF(Results!$C170=\"\",\"\",IF(Results!$H$2>=4,VALUE(VLOOKUP($B171,Group4!$I$4:$K$103,3)),0))","v":""},{"$f":"IF(Results!$C170=\"\",\"\",SUM(D171:G171))","v":""},{"$f":"IF(Results!E170=\"\",\"\",Results!E170)","v":""},{"$f":"IF(Results!F170=\"\",\"\",Results!F170)","v":""},"",{"$f":"IF(Results!$I170=\"\",\"\",Results!$I170)","v":""}]
[null,168,{"$f":"IF(Results!C171=\"\",\"\",Results!C171)","v":""},{"$f":"IF(Results!$C171=\"\",\"\",IF(Results!$H$2>=1,VALUE(VLOOKUP($B172,Group1!$I$4:$K$103,3)),0))","v":""},{"$f":"IF(Results!$C171=\"\",\"\",IF(Results!$H$2>=2,VALUE(VLOOKUP($B172,Group2!$I$4:$K$103,3)),0))","v":""},{"$f":"IF(Results!$C171=\"\",\"\",IF(Results!$H$2>=3,VALUE(VLOOKUP($B172,Group3!$I$4:$K$103,3)),0))","v":""},{"$f":"IF(Results!$C171=\"\",\"\",IF(Results!$H$2>=4,VALUE(VLOOKUP($B172,Group4!$I$4:$K$103,3)),0))","v":""},{"$f":"IF(Results!$C171=\"\",\"\",SUM(D172:G172))","v":""},{"$f":"IF(Results!E171=\"\",\"\",Results!E171)","v":""},{"$f":"IF(Results!F171=\"\",\"\",Results!F171)","v":""},"",{"$f":"IF(Results!$I171=\"\",\"\",Results!$I171)","v":""}]
[null,169,{"$f":"IF(Results!C172=\"\",\"\",Results!C172)","v":""},{"$f":"IF(Results!$C172=\"\",\"\",IF(Results!$H$2>=1,VALUE(VLOOKUP($B173,Group1!$I$4:$K$103,3)),0))","v":""},{"$f":"IF(Results!$C172=\"\",\"\",IF(Results!$H$2>=2,VALUE(VLOOKUP($B173,Group2!$I$4:$K$103,3)),0))","v":""},{"$f":"IF(Results!$C172=\"\",\"\",IF(Results!$H$2>=3,VALUE(VLOOKUP($B173,Group3!$I$4:$K$103,3)),0))","v":""},{"$f":"IF(Results!$C172=\"\",\"\",IF(Results!$H$2>=4,VALUE(VLOOKUP($B173,Group4!$I$4:$K$103,3)),0))","v":""},{"$f":"IF(Results!$C172=\"\",\"\",SUM(D173:G173))","v":""},{"$f":"IF(Results!E172=\"\",\"\",Results!E172)","v":""},{"$f":"IF(Results!F172=\"\",\"\",Results!F172)","v":""},"",{"$f":"IF(Results!$I172=\"\",\"\",Results!$I172)","v":""}]
[null,170,{"$f":"IF(Results!C173=\"\",\"\",Results!C173)","v":""},{"$f":"IF(Results!$C173=\"\",\"\",IF(Results!$H$2>=1,VALUE(VLOOKUP($B174,Group1!$I$4:$K$103,3)),0))","v":""},{"$f":"IF(Results!$C173=\"\",\"\",IF(Results!$H$2>=2,VALUE(VLOOKUP($B174,Group2!$I$4:$K$103,3)),0))","v":""},{"$f":"IF(Results!$C173=\"\",\"\",IF(Results!$H$2>=3,VALUE(VLOOKUP($B174,Group3!$I$4:$K$103,3)),0))","v":""},{"$f":"IF(Results!$C173=\"\",\"\",IF(Results!$H$2>=4,VALUE(VLOOKUP($B174,Group4!$I$4:$K$103,3)),0))","v":""},{"$f":"IF(Results!$C173=\"\",\"\",SUM(D174:G174))","v":""},{"$f":"IF(Results!E173=\"\",\"\",Results!E173)","v":""},{"$f":"IF(Results!F173=\"\",\"\",Results!F173)","v":""},"",{"$f":"IF(Results!$I173=\"\",\"\",Results!$I173)","v":""}]
[null,171,{"$f":"IF(Results!C174=\"\",\"\",Results!C174)","v":""},{"$f":"IF(Results!$C174=\"\",\"\",IF(Results!$H$2>=1,VALUE(VLOOKUP($B175,Group1!$I$4:$K$103,3)),0))","v":""},{"$f":"IF(Results!$C174=\"\",\"\",IF(Results!$H$2>=2,VALUE(VLOOKUP($B175,Group2!$I$4:$K$103,3)),0))","v":""},{"$f":"IF(Results!$C174=\"\",\"\",IF(Results!$H$2>=3,VALUE(VLOOKUP($B175,Group3!$I$4:$K$103,3)),0))","v":""},{"$f":"IF(Results!$C174=\"\",\"\",IF(Results!$H$2>=4,VALUE(VLOOKUP($B175,Group4!$I$4:$K$103,3)),0))","v":""},{"$f":"IF(Results!$C174=\"\",\"\",SUM(D175:G175))","v":""},{"$f":"IF(Results!E174=\"\",\"\",Results!E174)","v":""},{"$f":"IF(Results!F174=\"\",\"\",Results!F174)","v":""},"",{"$f":"IF(Results!$I174=\"\",\"\",Results!$I174)","v":""}]
[null,172,{"$f":"IF(Results!C175=\"\",\"\",Results!C175)","v":""},{"$f":"IF(Results!$C175=\"\",\"\",IF(Results!$H$2>=1,VALUE(VLOOKUP($B176,Group1!$I$4:$K$103,3)),0))","v":""},{"$f":"IF(Results!$C175=\"\",\"\",IF(Results!$H$2>=2,VALUE(VLOOKUP($B176,Group2!$I$4:$K$103,3)),0))","v":""},{"$f":"IF(Results!$C175=\"\",\"\",IF(Results!$H$2>=3,VALUE(VLOOKUP($B176,Group3!$I$4:$K$103,3)),0))","v":""},{"$f":"IF(Results!$C175=\"\",\"\",IF(Results!$H$2>=4,VALUE(VLOOKUP($B176,Group4!$I$4:$K$103,3)),0))","v":""},{"$f":"IF(Results!$C175=\"\",\"\",SUM(D176:G176))","v":""},{"$f":"IF(Results!E175=\"\",\"\",Results!E175)","v":""},{"$f":"IF(Results!F175=\"\",\"\",Results!F175)","v":""},"",{"$f":"IF(Results!$I175=\"\",\"\",Results!$I175)","v":""}]
[null,173,{"$f":"IF(Results!C176=\"\",\"\",Results!C176)","v":""},{"$f":"IF(Results!$C176=\"\",\"\",IF(Results!$H$2>=1,VALUE(VLOOKUP($B177,Group1!$I$4:$K$103,3)),0))","v":""},{"$f":"IF(Results!$C176=\"\",\"\",IF(Results!$H$2>=2,VALUE(VLOOKUP($B177,Group2!$I$4:$K$103,3)),0))","v":""},{"$f":"IF(Results!$C176=\"\",\"\",IF(Results!$H$2>=3,VALUE(VLOOKUP($B177,Group3!$I$4:$K$103,3)),0))","v":""},{"$f":"IF(Results!$C176=\"\",\"\",IF(Results!$H$2>=4,VALUE(VLOOKUP($B177,Group4!$I$4:$K$103,3)),0))","v":""},{"$f":"IF(Results!$C176=\"\",\"\",SUM(D177:G177))","v":""},{"$f":"IF(Results!E176=\"\",\"\",Results!E176)","v":""},{"$f":"IF(Results!F176=\"\",\"\",Results!F176)","v":""},"",{"$f":"IF(Results!$I176=\"\",\"\",Results!$I176)","v":""}]
[null,174,{"$f":"IF(Results!C177=\"\",\"\",Results!C177)","v":""},{"$f":"IF(Results!$C177=\"\",\"\",IF(Results!$H$2>=1,VALUE(VLOOKUP($B178,Group1!$I$4:$K$103,3)),0))","v":""},{"$f":"IF(Results!$C177=\"\",\"\",IF(Results!$H$2>=2,VALUE(VLOOKUP($B178,Group2!$I$4:$K$103,3)),0))","v":""},{"$f":"IF(Results!$C177=\"\",\"\",IF(Results!$H$2>=3,VALUE(VLOOKUP($B178,Group3!$I$4:$K$103,3)),0))","v":""},{"$f":"IF(Results!$C177=\"\",\"\",IF(Results!$H$2>=4,VALUE(VLOOKUP($B178,Group4!$I$4:$K$103,3)),0))","v":""},{"$f":"IF(Results!$C177=\"\",\"\",SUM(D178:G178))","v":""},{"$f":"IF(Results!E177=\"\",\"\",Results!E177)","v":""},{"$f":"IF(Results!F177=\"\",\"\",Results!F177)","v":""},"",{"$f":"IF(Results!$I177=\"\",\"\",Results!$I177)","v":""}]
[null,175,{"$f":"IF(Results!C178=\"\",\"\",Results!C178)","v":""},{"$f":"IF(Results!$C178=\"\",\"\",IF(Results!$H$2>=1,VALUE(VLOOKUP($B179,Group1!$I$4:$K$103,3)),0))","v":""},{"$f":"IF(Results!$C178=\"\",\"\",IF(Results!$H$2>=2,VALUE(VLOOKUP($B179,Group2!$I$4:$K$103,3)),0))","v":""},{"$f":"IF(Results!$C178=\"\",\"\",IF(Results!$H$2>=3,VALUE(VLOOKUP($B179,Group3!$I$4:$K$103,3)),0))","v":""},{"$f":"IF(Results!$C178=\"\",\"\",IF(Results!$H$2>=4,VALUE(VLOOKUP($B179,Group4!$I$4:$K$103,3)),0))","v":""},{"$f":"IF(Results!$C178=\"\",\"\",SUM(D179:G179))","v":""},{"$f":"IF(Results!E178=\"\",\"\",Results!E178)","v":""},{"$f":"IF(Results!F178=\"\",\"\",Results!F178)","v":""},"",{"$f":"IF(Results!$I178=\"\",\"\",Results!$I178)","v":""}]
[null,176,{"$f":"IF(Results!C179=\"\",\"\",Results!C179)","v":""},{"$f":"IF(Results!$C179=\"\",\"\",IF(Results!$H$2>=1,VALUE(VLOOKUP($B180,Group1!$I$4:$K$103,3)),0))","v":""},{"$f":"IF(Results!$C179=\"\",\"\",IF(Results!$H$2>=2,VALUE(VLOOKUP($B180,Group2!$I$4:$K$103,3)),0))","v":""},{"$f":"IF(Results!$C179=\"\",\"\",IF(Results!$H$2>=3,VALUE(VLOOKUP($B180,Group3!$I$4:$K$103,3)),0))","v":""},{"$f":"IF(Results!$C179=\"\",\"\",IF(Results!$H$2>=4,VALUE(VLOOKUP($B180,Group4!$I$4:$K$103,3)),0))","v":""},{"$f":"IF(Results!$C179=\"\",\"\",SUM(D180:G180))","v":""},{"$f":"IF(Results!E179=\"\",\"\",Results!E179)","v":""},{"$f":"IF(Results!F179=\"\",\"\",Results!F179)","v":""},"",{"$f":"IF(Results!$I179=\"\",\"\",Results!$I179)","v":""}]
[null,177,{"$f":"IF(Results!C180=\"\",\"\",Results!C180)","v":""},{"$f":"IF(Results!$C180=\"\",\"\",IF(Results!$H$2>=1,VALUE(VLOOKUP($B181,Group1!$I$4:$K$103,3)),0))","v":""},{"$f":"IF(Results!$C180=\"\",\"\",IF(Results!$H$2>=2,VALUE(VLOOKUP($B181,Group2!$I$4:$K$103,3)),0))","v":""},{"$f":"IF(Results!$C180=\"\",\"\",IF(Results!$H$2>=3,VALUE(VLOOKUP($B181,Group3!$I$4:$K$103,3)),0))","v":""},{"$f":"IF(Results!$C180=\"\",\"\",IF(Results!$H$2>=4,VALUE(VLOOKUP($B181,Group4!$I$4:$K$103,3)),0))","v":""},{"$f":"IF(Results!$C180=\"\",\"\",SUM(D181:G181))","v":""},{"$f":"IF(Results!E180=\"\",\"\",Results!E180)","v":""},{"$f":"IF(Results!F180=\"\",\"\",Results!F180)","v":""},"",{"$f":"IF(Results!$I180=\"\",\"\",Results!$I180)","v":""}]
[null,178,{"$f":"IF(Results!C181=\"\",\"\",Results!C181)","v":""},{"$f":"IF(Results!$C181=\"\",\"\",IF(Results!$H$2>=1,VALUE(VLOOKUP($B182,Group1!$I$4:$K$103,3)),0))","v":""},{"$f":"IF(Results!$C181=\"\",\"\",IF(Results!$H$2>=2,VALUE(VLOOKUP($B182,Group2!$I$4:$K$103,3)),0))","v":""},{"$f":"IF(Results!$C181=\"\",\"\",IF(Results!$H$2>=3,VALUE(VLOOKUP($B182,Group3!$I$4:$K$103,3)),0))","v":""},{"$f":"IF(Results!$C181=\"\",\"\",IF(Results!$H$2>=4,VALUE(VLOOKUP($B182,Group4!$I$4:$K$103,3)),0))","v":""},{"$f":"IF(Results!$C181=\"\",\"\",SUM(D182:G182))","v":""},{"$f":"IF(Results!E181=\"\",\"\",Results!E181)","v":""},{"$f":"IF(Results!F181=\"\",\"\",Results!F181)","v":""},"",{"$f":"IF(Results!$I181=\"\",\"\",Results!$I181)","v":""}]
[null,179,{"$f":"IF(Results!C182=\"\",\"\",Results!C182)","v":""},{"$f":"IF(Results!$C182=\"\",\"\",IF(Results!$H$2>=1,VALUE(VLOOKUP($B183,Group1!$I$4:$K$103,3)),0))","v":""},{"$f":"IF(Results!$C182=\"\",\"\",IF(Results!$H$2>=2,VALUE(VLOOKUP($B183,Group2!$I$4:$K$103,3)),0))","v":""},{"$f":"IF(Results!$C182=\"\",\"\",IF(Results!$H$2>=3,VALUE(VLOOKUP($B183,Group3!$I$4:$K$103,3)),0))","v":""},{"$f":"IF(Results!$C182=\"\",\"\",IF(Results!$H$2>=4,VALUE(VLOOKUP($B183,Group4!$I$4:$K$103,3)),0))","v":""},{"$f":"IF(Results!$C182=\"\",\"\",SUM(D183:G183))","v":""},{"$f":"IF(Results!E182=\"\",\"\",Results!E182)","v":""},{"$f":"IF(Results!F182=\"\",\"\",Results!F182)","v":""},"",{"$f":"IF(Results!$I182=\"\",\"\",Results!$I182)","v":""}]
[null,180,{"$f":"IF(Results!C183=\"\",\"\",Results!C183)","v":""},{"$f":"IF(Results!$C183=\"\",\"\",IF(Results!$H$2>=1,VALUE(VLOOKUP($B184,Group1!$I$4:$K$103,3)),0))","v":""},{"$f":"IF(Results!$C183=\"\",\"\",IF(Results!$H$2>=2,VALUE(VLOOKUP($B184,Group2!$I$4:$K$103,3)),0))","v":""},{"$f":"IF(Results!$C183=\"\",\"\",IF(Results!$H$2>=3,VALUE(VLOOKUP($B184,Group3!$I$4:$K$103,3)),0))","v":""},{"$f":"IF(Results!$C183=\"\",\"\",IF(Results!$H$2>=4,VALUE(VLOOKUP($B184,Group4!$I$4:$K$103,3)),0))","v":""},{"$f":"IF(Results!$C183=\"\",\"\",SUM(D184:G184))","v":""},{"$f":"IF(Results!E183=\"\",\"\",Results!E183)","v":""},{"$f":"IF(Results!F183=\"\",\"\",Results!F183)","v":""},"",{"$f":"IF(Results!$I183=\"\",\"\",Results!$I183)","v":""}]
[null,181,{"$f":"IF(Results!C184=\"\",\"\",Results!C184)","v":""},{"$f":"IF(Results!$C184=\"\",\"\",IF(Results!$H$2>=1,VALUE(VLOOKUP($B185,Group1!$I$4:$K$103,3)),0))","v":""},{"$f":"IF(Results!$C184=\"\",\"\",IF(Results!$H$2>=2,VALUE(VLOOKUP($B185,Group2!$I$4:$K$103,3)),0))","v":""},{"$f":"IF(Results!$C184=\"\",\"\",IF(Results!$H$2>=3,VALUE(VLOOKUP($B185,Group3!$I$4:$K$103,3)),0))","v":""},{"$f":"IF(Results!$C184=\"\",\"\",IF(Results!$H$2>=4,VALUE(VLOOKUP($B185,Group4!$I$4:$K$103,3)),0))","v":""},{"$f":"IF(Results!$C184=\"\",\"\",SUM(D185:G185))","v":""},{"$f":"IF(Results!E184=\"\",\"\",Results!E184)","v":""},{"$f":"IF(Results!F184=\"\",\"\",Results!F184)","v":""},"",{"$f":"IF(Results!$I184=\"\",\"\",Results!$I184)","v":""}]
[null,182,{"$f":"IF(Results!C185=\"\",\"\",Results!C185)","v":""},{"$f":"IF(Results!$C185=\"\",\"\",IF(Results!$H$2>=1,VALUE(VLOOKUP($B186,Group1!$I$4:$K$103,3)),0))","v":""},{"$f":"IF(Results!$C185=\"\",\"\",IF(Results!$H$2>=2,VALUE(VLOOKUP($B186,Group2!$I$4:$K$103,3)),0))","v":""},{"$f":"IF(Results!$C185=\"\",\"\",IF(Results!$H$2>=3,VALUE(VLOOKUP($B186,Group3!$I$4:$K$103,3)),0))","v":""},{"$f":"IF(Results!$C185=\"\",\"\",IF(Results!$H$2>=4,VALUE(VLOOKUP($B186,Group4!$I$4:$K$103,3)),0))","v":""},{"$f":"IF(Results!$C185=\"\",\"\",SUM(D186:G186))","v":""},{"$f":"IF(Results!E185=\"\",\"\",Results!E185)","v":""},{"$f":"IF(Results!F185=\"\",\"\",Results!F185)","v":""},"",{"$f":"IF(Results!$I185=\"\",\"\",Results!$I185)","v":""}]
[null,183,{"$f":"IF(Results!C186=\"\",\"\",Results!C186)","v":""},{"$f":"IF(Results!$C186=\"\",\"\",IF(Results!$H$2>=1,VALUE(VLOOKUP($B187,Group1!$I$4:$K$103,3)),0))","v":""},{"$f":"IF(Results!$C186=\"\",\"\",IF(Results!$H$2>=2,VALUE(VLOOKUP($B187,Group2!$I$4:$K$103,3)),0))","v":""},{"$f":"IF(Results!$C186=\"\",\"\",IF(Results!$H$2>=3,VALUE(VLOOKUP($B187,Group3!$I$4:$K$103,3)),0))","v":""},{"$f":"IF(Results!$C186=\"\",\"\",IF(Results!$H$2>=4,VALUE(VLOOKUP($B187,Group4!$I$4:$K$103,3)),0))","v":""},{"$f":"IF(Results!$C186=\"\",\"\",SUM(D187:G187))","v":""},{"$f":"IF(Results!E186=\"\",\"\",Results!E186)","v":""},{"$f":"IF(Results!F186=\"\",\"\",Results!F186)","v":""},"",{"$f":"IF(Results!$I186=\"\",\"\",Results!$I186)","v":""}]
[null,184,{"$f":"IF(Results!C187=\"\",\"\",Results!C187)","v":""},{"$f":"IF(Results!$C187=\"\",\"\",IF(Results!$H$2>=1,VALUE(VLOOKUP($B188,Group1!$I$4:$K$103,3)),0))","v":""},{"$f":"IF(Results!$C187=\"\",\"\",IF(Results!$H$2>=2,VALUE(VLOOKUP($B188,Group2!$I$4:$K$103,3)),0))","v":""},{"$f":"IF(Results!$C187=\"\",\"\",IF(Results!$H$2>=3,VALUE(VLOOKUP($B188,Group3!$I$4:$K$103,3)),0))","v":""},{"$f":"IF(Results!$C187=\"\",\"\",IF(Results!$H$2>=4,VALUE(VLOOKUP($B188,Group4!$I$4:$K$103,3)),0))","v":""},{"$f":"IF(Results!$C187=\"\",\"\",SUM(D188:G188))","v":""},{"$f":"IF(Results!E187=\"\",\"\",Results!E187)","v":""},{"$f":"IF(Results!F187=\"\",\"\",Results!F187)","v":""},"",{"$f":"IF(Results!$I187=\"\",\"\",Results!$I187)","v":""}]
[null,185,{"$f":"IF(Results!C188=\"\",\"\",Results!C188)","v":""},{"$f":"IF(Results!$C188=\"\",\"\",IF(Results!$H$2>=1,VALUE(VLOOKUP($B189,Group1!$I$4:$K$103,3)),0))","v":""},{"$f":"IF(Results!$C188=\"\",\"\",IF(Results!$H$2>=2,VALUE(VLOOKUP($B189,Group2!$I$4:$K$103,3)),0))","v":""},{"$f":"IF(Results!$C188=\"\",\"\",IF(Results!$H$2>=3,VALUE(VLOOKUP($B189,Group3!$I$4:$K$103,3)),0))","v":""},{"$f":"IF(Results!$C188=\"\",\"\",IF(Results!$H$2>=4,VALUE(VLOOKUP($B189,Group4!$I$4:$K$103,3)),0))","v":""},{"$f":"IF(Results!$C188=\"\",\"\",SUM(D189:G189))","v":""},{"$f":"IF(Results!E188=\"\",\"\",Results!E188)","v":""},{"$f":"IF(Results!F188=\"\",\"\",Results!F188)","v":""},"",{"$f":"IF(Results!$I188=\"\",\"\",Results!$I188)","v":""}]
[null,186,{"$f":"IF(Results!C189=\"\",\"\",Results!C189)","v":""},{"$f":"IF(Results!$C189=\"\",\"\",IF(Results!$H$2>=1,VALUE(VLOOKUP($B190,Group1!$I$4:$K$103,3)),0))","v":""},{"$f":"IF(Results!$C189=\"\",\"\",IF(Results!$H$2>=2,VALUE(VLOOKUP($B190,Group2!$I$4:$K$103,3)),0))","v":""},{"$f":"IF(Results!$C189=\"\",\"\",IF(Results!$H$2>=3,VALUE(VLOOKUP($B190,Group3!$I$4:$K$103,3)),0))","v":""},{"$f":"IF(Results!$C189=\"\",\"\",IF(Results!$H$2>=4,VALUE(VLOOKUP($B190,Group4!$I$4:$K$103,3)),0))","v":""},{"$f":"IF(Results!$C189=\"\",\"\",SUM(D190:G190))","v":""},{"$f":"IF(Results!E189=\"\",\"\",Results!E189)","v":""},{"$f":"IF(Results!F189=\"\",\"\",Results!F189)","v":""},"",{"$f":"IF(Results!$I189=\"\",\"\",Results!$I189)","v":""}]
[null,187,{"$f":"IF(Results!C190=\"\",\"\",Results!C190)","v":""},{"$f":"IF(Results!$C190=\"\",\"\",IF(Results!$H$2>=1,VALUE(VLOOKUP($B191,Group1!$I$4:$K$103,3)),0))","v":""},{"$f":"IF(Results!$C190=\"\",\"\",IF(Results!$H$2>=2,VALUE(VLOOKUP($B191,Group2!$I$4:$K$103,3)),0))","v":""},{"$f":"IF(Results!$C190=\"\",\"\",IF(Results!$H$2>=3,VALUE(VLOOKUP($B191,Group3!$I$4:$K$103,3)),0))","v":""},{"$f":"IF(Results!$C190=\"\",\"\",IF(Results!$H$2>=4,VALUE(VLOOKUP($B191,Group4!$I$4:$K$103,3)),0))","v":""},{"$f":"IF(Results!$C190=\"\",\"\",SUM(D191:G191))","v":""},{"$f":"IF(Results!E190=\"\",\"\",Results!E190)","v":""},{"$f":"IF(Results!F190=\"\",\"\",Results!F190)","v":""},"",{"$f":"IF(Results!$I190=\"\",\"\",Results!$I190)","v":""}]
[null,188,{"$f":"IF(Results!C191=\"\",\"\",Results!C191)","v":""},{"$f":"IF(Results!$C191=\"\",\"\",IF(Results!$H$2>=1,VALUE(VLOOKUP($B192,Group1!$I$4:$K$103,3)),0))","v":""},{"$f":"IF(Results!$C191=\"\",\"\",IF(Results!$H$2>=2,VALUE(VLOOKUP($B192,Group2!$I$4:$K$103,3)),0))","v":""},{"$f":"IF(Results!$C191=\"\",\"\",IF(Results!$H$2>=3,VALUE(VLOOKUP($B192,Group3!$I$4:$K$103,3)),0))","v":""},{"$f":"IF(Results!$C191=\"\",\"\",IF(Results!$H$2>=4,VALUE(VLOOKUP($B192,Group4!$I$4:$K$103,3)),0))","v":""},{"$f":"IF(Results!$C191=\"\",\"\",SUM(D192:G192))","v":""},{"$f":"IF(Results!E191=\"\",\"\",Results!E191)","v":""},{"$f":"IF(Results!F191=\"\",\"\",Results!F191)","v":""},"",{"$f":"IF(Results!$I191=\"\",\"\",Results!$I191)","v":""}]
[null,189,{"$f":"IF(Results!C192=\"\",\"\",Results!C192)","v":""},{"$f":"IF(Results!$C192=\"\",\"\",IF(Results!$H$2>=1,VALUE(VLOOKUP($B193,Group1!$I$4:$K$103,3)),0))","v":""},{"$f":"IF(Results!$C192=\"\",\"\",IF(Results!$H$2>=2,VALUE(VLOOKUP($B193,Group2!$I$4:$K$103,3)),0))","v":""},{"$f":"IF(Results!$C192=\"\",\"\",IF(Results!$H$2>=3,VALUE(VLOOKUP($B193,Group3!$I$4:$K$103,3)),0))","v":""},{"$f":"IF(Results!$C192=\"\",\"\",IF(Results!$H$2>=4,VALUE(VLOOKUP($B193,Group4!$I$4:$K$103,3)),0))","v":""},{"$f":"IF(Results!$C192=\"\",\"\",SUM(D193:G193))","v":""},{"$f":"IF(Results!E192=\"\",\"\",Results!E192)","v":""},{"$f":"IF(Results!F192=\"\",\"\",Results!F192)","v":""},"",{"$f":"IF(Results!$I192=\"\",\"\",Results!$I192)","v":""}]
[null,190,{"$f":"IF(Results!C193=\"\",\"\",Results!C193)","v":""},{"$f":"IF(Results!$C193=\"\",\"\",IF(Results!$H$2>=1,VALUE(VLOOKUP($B194,Group1!$I$4:$K$103,3)),0))","v":""},{"$f":"IF(Results!$C193=\"\",\"\",IF(Results!$H$2>=2,VALUE(VLOOKUP($B194,Group2!$I$4:$K$103,3)),0))","v":""},{"$f":"IF(Results!$C193=\"\",\"\",IF(Results!$H$2>=3,VALUE(VLOOKUP($B194,Group3!$I$4:$K$103,3)),0))","v":""},{"$f":"IF(Results!$C193=\"\",\"\",IF(Results!$H$2>=4,VALUE(VLOOKUP($B194,Group4!$I$4:$K$103,3)),0))","v":""},{"$f":"IF(Results!$C193=\"\",\"\",SUM(D194:G194))","v":""},{"$f":"IF(Results!E193=\"\",\"\",Results!E193)","v":""},{"$f":"IF(Results!F193=\"\",\"\",Results!F193)","v":""},"",{"$f":"IF(Results!$I193=\"\",\"\",Results!$I193)","v":""}]
[null,191,{"$f":"IF(Results!C194=\"\",\"\",Results!C194)","v":""},{"$f":"IF(Results!$C194=\"\",\"\",IF(Results!$H$2>=1,VALUE(VLOOKUP($B195,Group1!$I$4:$K$103,3)),0))","v":""},{"$f":"IF(Results!$C194=\"\",\"\",IF(Results!$H$2>=2,VALUE(VLOOKUP($B195,Group2!$I$4:$K$103,3)),0))","v":""},{"$f":"IF(Results!$C194=\"\",\"\",IF(Results!$H$2>=3,VALUE(VLOOKUP($B195,Group3!$I$4:$K$103,3)),0))","v":""},{"$f":"IF(Results!$C194=\"\",\"\",IF(Results!$H$2>=4,VALUE(VLOOKUP($B195,Group4!$I$4:$K$103,3)),0))","v":""},{"$f":"IF(Results!$C194=\"\",\"\",SUM(D195:G195))","v":""},{"$f":"IF(Results!E194=\"\",\"\",Results!E194)","v":""},{"$f":"IF(Results!F194=\"\",\"\",Results!F194)","v":""},"",{"$f":"IF(Results!$I194=\"\",\"\",Results!$I194)","v":""}]
[null,192,{"$f":"IF(Results!C195=\"\",\"\",Results!C195)","v":""},{"$f":"IF(Results!$C195=\"\",\"\",IF(Results!$H$2>=1,VALUE(VLOOKUP($B196,Group1!$I$4:$K$103,3)),0))","v":""},{"$f":"IF(Results!$C195=\"\",\"\",IF(Results!$H$2>=2,VALUE(VLOOKUP($B196,Group2!$I$4:$K$103,3)),0))","v":""},{"$f":"IF(Results!$C195=\"\",\"\",IF(Results!$H$2>=3,VALUE(VLOOKUP($B196,Group3!$I$4:$K$103,3)),0))","v":""},{"$f":"IF(Results!$C195=\"\",\"\",IF(Results!$H$2>=4,VALUE(VLOOKUP($B196,Group4!$I$4:$K$103,3)),0))","v":""},{"$f":"IF(Results!$C195=\"\",\"\",SUM(D196:G196))","v":""},{"$f":"IF(Results!E195=\"\",\"\",Results!E195)","v":""},{"$f":"IF(Results!F195=\"\",\"\",Results!F195)","v":""},"",{"$f":"IF(Results!$I195=\"\",\"\",Results!$I195)","v":""}]
[null,193,{"$f":"IF(Results!C196=\"\",\"\",Results!C196)","v":""},{"$f":"IF(Results!$C196=\"\",\"\",IF(Results!$H$2>=1,VALUE(VLOOKUP($B197,Group1!$I$4:$K$103,3)),0))","v":""},{"$f":"IF(Results!$C196=\"\",\"\",IF(Results!$H$2>=2,VALUE(VLOOKUP($B197,Group2!$I$4:$K$103,3)),0))","v":""},{"$f":"IF(Results!$C196=\"\",\"\",IF(Results!$H$2>=3,VALUE(VLOOKUP($B197,Group3!$I$4:$K$103,3)),0))","v":""},{"$f":"IF(Results!$C196=\"\",\"\",IF(Results!$H$2>=4,VALUE(VLOOKUP($B197,Group4!$I$4:$K$103,3)),0))","v":""},{"$f":"IF(Results!$C196=\"\",\"\",SUM(D197:G197))","v":""},{"$f":"IF(Results!E196=\"\",\"\",Results!E196)","v":""},{"$f":"IF(Results!F196=\"\",\"\",Results!F196)","v":""},"",{"$f":"IF(Results!$I196=\"\",\"\",Results!$I196)","v":""}]
[null,194,{"$f":"IF(Results!C197=\"\",\"\",Results!C197)","v":""},{"$f":"IF(Results!$C197=\"\",\"\",IF(Results!$H$2>=1,VALUE(VLOOKUP($B198,Group1!$I$4:$K$103,3)),0))","v":""},{"$f":"IF(Results!$C197=\"\",\"\",IF(Results!$H$2>=2,VALUE(VLOOKUP($B198,Group2!$I$4:$K$103,3)),0))","v":""},{"$f":"IF(Results!$C197=\"\",\"\",IF(Results!$H$2>=3,VALUE(VLOOKUP($B198,Group3!$I$4:$K$103,3)),0))","v":""},{"$f":"IF(Results!$C197=\"\",\"\",IF(Results!$H$2>=4,VALUE(VLOOKUP($B198,Group4!$I$4:$K$103,3)),0))","v":""},{"$f":"IF(Results!$C197=\"\",\"\",SUM(D198:G198))","v":""},{"$f":"IF(Results!E197=\"\",\"\",Results!E197)","v":""},{"$f":"IF(Results!F197=\"\",\"\",Results!F197)","v":""},"",{"$f":"IF(Results!$I197=\"\",\"\",Results!$I197)","v":""}]
[null,195,{"$f":"IF(Results!C198=\"\",\"\",Results!C198)","v":""},{"$f":"IF(Results!$C198=\"\",\"\",IF(Results!$H$2>=1,VALUE(VLOOKUP($B199,Group1!$I$4:$K$103,3)),0))","v":""},{"$f":"IF(Results!$C198=\"\",\"\",IF(Results!$H$2>=2,VALUE(VLOOKUP($B199,Group2!$I$4:$K$103,3)),0))","v":""},{"$f":"IF(Results!$C198=\"\",\"\",IF(Results!$H$2>=3,VALUE(VLOOKUP($B199,Group3!$I$4:$K$103,3)),0))","v":""},{"$f":"IF(Results!$C198=\"\",\"\",IF(Results!$H$2>=4,VALUE(VLOOKUP($B199,Group4!$I$4:$K$103,3)),0))","v":""},{"$f":"IF(Results!$C198=\"\",\"\",SUM(D199:G199))","v":""},{"$f":"IF(Results!E198=\"\",\"\",Results!E198)","v":""},{"$f":"IF(Results!F198=\"\",\"\",Results!F198)","v":""},"",{"$f":"IF(Results!$I198=\"\",\"\",Results!$I198)","v":""}]
[null,196,{"$f":"IF(Results!C199=\"\",\"\",Results!C199)","v":""},{"$f":"IF(Results!$C199=\"\",\"\",IF(Results!$H$2>=1,VALUE(VLOOKUP($B200,Group1!$I$4:$K$103,3)),0))","v":""},{"$f":"IF(Results!$C199=\"\",\"\",IF(Results!$H$2>=2,VALUE(VLOOKUP($B200,Group2!$I$4:$K$103,3)),0))","v":""},{"$f":"IF(Results!$C199=\"\",\"\",IF(Results!$H$2>=3,VALUE(VLOOKUP($B200,Group3!$I$4:$K$103,3)),0))","v":""},{"$f":"IF(Results!$C199=\"\",\"\",IF(Results!$H$2>=4,VALUE(VLOOKUP($B200,Group4!$I$4:$K$103,3)),0))","v":""},{"$f":"IF(Results!$C199=\"\",\"\",SUM(D200:G200))","v":""},{"$f":"IF(Results!E199=\"\",\"\",Results!E199)","v":""},{"$f":"IF(Results!F199=\"\",\"\",Results!F199)","v":""},"",{"$f":"IF(Results!$I199=\"\",\"\",Results!$I199)","v":""}]
[null,197,{"$f":"IF(Results!C200=\"\",\"\",Results!C200)","v":""},{"$f":"IF(Results!$C200=\"\",\"\",IF(Results!$H$2>=1,VALUE(VLOOKUP($B201,Group1!$I$4:$K$103,3)),0))","v":""},{"$f":"IF(Results!$C200=\"\",\"\",IF(Results!$H$2>=2,VALUE(VLOOKUP($B201,Group2!$I$4:$K$103,3)),0))","v":""},{"$f":"IF(Results!$C200=\"\",\"\",IF(Results!$H$2>=3,VALUE(VLOOKUP($B201,Group3!$I$4:$K$103,3)),0))","v":""},{"$f":"IF(Results!$C200=\"\",\"\",IF(Results!$H$2>=4,VALUE(VLOOKUP($B201,Group4!$I$4:$K$103,3)),0))","v":""},{"$f":"IF(Results!$C200=\"\",\"\",SUM(D201:G201))","v":""},{"$f":"IF(Results!E200=\"\",\"\",Results!E200)","v":""},{"$f":"IF(Results!F200=\"\",\"\",Results!F200)","v":""},"",{"$f":"IF(Results!$I200=\"\",\"\",Results!$I200)","v":""}]
[null,198,{"$f":"IF(Results!C201=\"\",\"\",Results!C201)","v":""},{"$f":"IF(Results!$C201=\"\",\"\",IF(Results!$H$2>=1,VALUE(VLOOKUP($B202,Group1!$I$4:$K$103,3)),0))","v":""},{"$f":"IF(Results!$C201=\"\",\"\",IF(Results!$H$2>=2,VALUE(VLOOKUP($B202,Group2!$I$4:$K$103,3)),0))","v":""},{"$f":"IF(Results!$C201=\"\",\"\",IF(Results!$H$2>=3,VALUE(VLOOKUP($B202,Group3!$I$4:$K$103,3)),0))","v":""},{"$f":"IF(Results!$C201=\"\",\"\",IF(Results!$H$2>=4,VALUE(VLOOKUP($B202,Group4!$I$4:$K$103,3)),0))","v":""},{"$f":"IF(Results!$C201=\"\",\"\",SUM(D202:G202))","v":""},{"$f":"IF(Results!E201=\"\",\"\",Results!E201)","v":""},{"$f":"IF(Results!F201=\"\",\"\",Results!F201)","v":""},"",{"$f":"IF(Results!$I201=\"\",\"\",Results!$I201)","v":""}]
[null,199,{"$f":"IF(Results!C202=\"\",\"\",Results!C202)","v":""},{"$f":"IF(Results!$C202=\"\",\"\",IF(Results!$H$2>=1,VALUE(VLOOKUP($B203,Group1!$I$4:$K$103,3)),0))","v":""},{"$f":"IF(Results!$C202=\"\",\"\",IF(Results!$H$2>=2,VALUE(VLOOKUP($B203,Group2!$I$4:$K$103,3)),0))","v":""},{"$f":"IF(Results!$C202=\"\",\"\",IF(Results!$H$2>=3,VALUE(VLOOKUP($B203,Group3!$I$4:$K$103,3)),0))","v":""},{"$f":"IF(Results!$C202=\"\",\"\",IF(Results!$H$2>=4,VALUE(VLOOKUP($B203,Group4!$I$4:$K$103,3)),0))","v":""},{"$f":"IF(Results!$C202=\"\",\"\",SUM(D203:G203))","v":""},{"$f":"IF(Results!E202=\"\",\"\",Results!E202)","v":""},{"$f":"IF(Results!F202=\"\",\"\",Results!F202)","v":""},"",{"$f":"IF(Results!$I202=\"\",\"\",Results!$I202)","v":""}]
[null,200,{"$f":"IF(Results!C203=\"\",\"\",Results!C203)","v":""},{"$f":"IF(Results!$C203=\"\",\"\",IF(Results!$H$2>=1,VALUE(VLOOKUP($B204,Group1!$I$4:$K$103,3)),0))","v":""},{"$f":"IF(Results!$C203=\"\",\"\",IF(Results!$H$2>=2,VALUE(VLOOKUP($B204,Group2!$I$4:$K$103,3)),0))","v":""},{"$f":"IF(Results!$C203=\"\",\"\",IF(Results!$H$2>=3,VALUE(VLOOKUP($B204,Group3!$I$4:$K$103,3)),0))","v":""},{"$f":"IF(Results!$C203=\"\",\"\",IF(Results!$H$2>=4,VALUE(VLOOKUP($B204,Group4!$I$4:$K$103,3)),0))","v":""},{"$f":"IF(Results!$C203=\"\",\"\",SUM(D204:G204))","v":""},{"$f":"IF(Results!E203=\"\",\"\",Results!E203)","v":""},{"$f":"IF(Results!F203=\"\",\"\",Results!F203)","v":""},"",{"$f":"IF(Results!$I203=\"\",\"\",Results!$I203)","v":""}]

{"sheet":"Print","index":9,"n_rows":48,"n_cols":11,"rows_kept":48,"cut":false,"hidden":false,"merged":[[16,4,16,10],[40,3,40,4],[30,3,30,4],[33,3,33,4],[34,3,34,4],[35,3,35,4],[38,3,38,4],[39,3,39,4],[28,3,28,4],[29,3,29,4],[23,3,23,4],[24,3,24,4],[25,3,25,4]]}
[1,"ENTRANT NO"]
[]
[]
[]
[]
[]
[null,null,"Agricultural Societies Council of NSW"]
[]
[]
[]
[]
[null,null,null,"YOUNG JUDGES COMPETITION"]
[]
[null,null,null,{"$f":"Title!$H$9","v":"Competition Name"}]
[null,null,null,null,"OVER-JUDGE",null,{"$f":"Title!$J$13","v":0}]
[null,null,null,null,"JUDGED AT",null,{"$f":"Title!H15","v":"Locaton"}]
[null,null,null,null,{"$f":"Title!$H$16","v":"Date"}]
[]
[]
[null,"RESULTS",null,{"$f":"(VLOOKUP($A$1,Full!$B$5:$C$204,2))","v":""}]
[]
[]
[]
[null,{"$f":"IF(Group1!$D$2=\"\",\"N/A\",Group1!$D$2)","v":"N/A"},null,"JUDGE'S PLACINGS",null,null,{"$f":"IF(Group1!$D$2=\"\",\"\",Group1!$C$6)","v":""},{"$f":"IF(Group1!$D$2=\"\",\"\",Group1!$D$6)","v":""},{"$f":"IF(Group1!$D$2=\"\",\"\",Group1!$E$6)","v":""},{"$f":"IF(Group1!$D$2=\"\",\"\",Group1!$F$6)","v":""}]
[null,null,null,"YOUR PLACINGS",null,null,{"$f":"IF(Group1!$D$2=\"\",\"\",IF($D$20=\"\",\"\",LEFT(VLOOKUP($A$1,Group1!$I$4:$J$203,2))))","v":""},{"$f":"IF(Group1!$D$2=\"\",\"\",IF($D$20=\"\",\"\",MID(VLOOKUP($A$1,Group1!$I$4:$J$203,2),2,1)))","v":""},{"$f":"IF(Group1!$D$2=\"\",\"\",IF($D$20=\"\",\"\",MID(VLOOKUP($A$1,Group1!$I$4:$J$203,2),3,1)))","v":""},{"$f":"IF(Group1!$D$2=\"\",\"\",IF($D$20=\"\",\"\",RIGHT(VLOOKUP($A$1,Group1!$I$4:$J$203,2))))","v":""}]
[null,null,null,"YOUR SCORE",null,null,null,null,null,null,{"$f":"IF($D$20=\"\",\"N/A\",VLOOKUP($A$1,Group1!$I$4:$K$203,3))","v":"N/A"}]
[]
[]
[null,{"$f":"IF(Group2!$D$2=\"\",\"N/A\",Group2!$D$2)","v":"N/A"},null,"JUDGE'S PLACINGS",null,null,{"$f":"IF(Group2!$D$2=\"\",\"\",Group2!$C$6)","v":""},{"$f":"IF(Group2!$D$2=\"\",\"\",Group2!$D$6)","v":""},{"$f":"IF(Group2!$D$2=\"\",\"\",Group2!$E$6)","v":""},{"$f":"IF(Group2!$D$2=\"\",\"\",Group2!$F$6)","v":""}]
[null,null,null,"YOUR PLACINGS",null,null,{"$f":"IF(Group2!$D$2=\"\",\"\",IF($D$20=\"\",\"\",LEFT(VLOOKUP($A$1,Group2!$I$4:$J$203,2))))","v":""},{"$f":"IF(Group2!$D$2=\"\",\"\",IF($D$20=\"\",\"\",MID(VLOOKUP($A$1,Group2!$I$4:$J$203,2),2,1)))","v":""},{"$f":"IF(Group2!$D$2=\"\",\"\",IF($D$20=\"\",\"\",MID(VLOOKUP($A$1,Group2!$I$4:$J$203,2),3,1)))","v":""},{"$f":"IF(Group2!$D$2=\"\",\"\",IF($D$20=\"\",\"\",RIGHT(VLOOKUP($A$1,Group2!$I$4:$J$203,2))))","v":""}]
[null,null,null,"YOUR SCORE",null,null,null,null,null,null,{"$f":"IF($D$20=\"\",\"N/A\",VLOOKUP($A$1,Group2!$I$4:$K$203,3))","v":"N/A"}]
[]
[]
[null,{"$f":"IF(Group3!$D$2=\"\",\"N/A\",Group3!$D$2)","v":"N/A"},null,"JUDGE'S PLACINGS",null,null,{"$f":"IF(Group3!$D$2=\"\",\"\",Group3!$C$6)","v":""},{"$f":"IF(Group3!$D$2=\"\",\"\",Group3!$D$6)","v":""},{"$f":"IF(Group3!$D$2=\"\",\"\",Group3!$E$6)","v":""},{"$f":"IF(Group3!$D$2=\"\",\"\",Group3!$F$6)","v":""}]
[null,null,null,"YOUR PLACINGS",null,null,{"$f":"IF(Group3!$D$2=\"\",\"\",IF($D$20=\"\",\"\",LEFT(VLOOKUP($A$1,Group3!$I$4:$J$203,2))))","v":""},{"$f":"IF(Group3!$D$2=\"\",\"\",IF($D$20=\"\",\"\",MID(VLOOKUP($A$1,Group3!$I$4:$J$203,2),2,1)))","v":""},{"$f":"IF(Group3!$D$2=\"\",\"\",IF($D$20=\"\",\"\",MID(VLOOKUP($A$1,Group3!$I$4:$J$203,2),3,1)))","v":""},{"$f":"IF(Group3!$D$2=\"\",\"\",IF($D$20=\"\",\"\",RIGHT(VLOOKUP($A$1,Group3!$I$4:$J$203,2))))","v":""}]
[null,null,null,"YOUR SCORE",null,null,null,null,null,null,{"$f":"IF($D$20=\"\",\"N/A\",VLOOKUP($A$1,Group3!$I$4:$K$203,3))","v":"N/A"}]
[]
[]
[null,{"$f":"IF(Group4!$D$2=\"\",\"N/A\",Group4!$D$2)","v":"N/A"},null,"JUDGE'S PLACINGS",null,null,{"$f":"IF(Group4!$D$2=\"\",\"\",Group4!$C$6)","v":""},{"$f":"IF(Group4!$D$2=\"\",\"\",Group4!$D$6)","v":""},{"$f":"IF(Group4!$D$2=\"\",\"\",Group4!$E$6)","v":""},{"$f":"IF(Group4!$D$2=\"\",\"\",Group4!$F$6)","v":""}]
[null,null,null,"YOUR PLACINGS",null,null,{"$f":"IF(Group4!$D$2=\"\",\"\",IF($D$20=\"\",\"\",LEFT(VLOOKUP($A$1,Group4!$I$4:$J$203,2))))","v":""},{"$f":"IF(Group4!$D$2=\"\",\"\",IF($D$20=\"\",\"\",MID(VLOOKUP($A$1,Group4!$I$4:$J$203,2),2,1)))","v":""},{"$f":"IF(Group4!$D$2=\"\",\"\",IF($D$20=\"\",\"\",MID(VLOOKUP($A$1,Group4!$I$4:$J$203,2),3,1)))","v":""},{"$f":"IF(Group4!$D$2=\"\",\"\",IF($D$20=\"\",\"\",RIGHT(VLOOKUP($A$1,Group4!$I$4:$J$203,2))))","v":""}]
[null,null,null,"YOUR SCORE",null,null,null,null,null,null,{"$f":"IF($D$20=\"\",\"N/A\",VLOOKUP($A$1,Group4!$I$4:$K$203,3))","v":"N/A"}]
[]
[]
[null,null,null,null,"HANDLING SCORE",null,null,null,null,null,{"$f":"IF($D$20=\"\",\"\",VLOOKUP($A$1,Results!$B$4:$I$203,4))","v":""}]
[]
[null,null,null,null,"ORAL SCORE",null,null,null,null,null,{"$f":"IF($D$20=\"\",\"\",VLOOKUP($A$1,Results!$B$4:$I$203,5))","v":""}]
[]
[null,null,null,null,"TOTAL SCORE",null,null,null,null,null,{"$f":"SUM(K25:K46)","v":0}]

{"sheet":"Instructions","index":10,"n_rows":19,"n_cols":3,"rows_kept":19,"cut":false,"hidden":false,"merged":[]}
[null,"INSTRUCTIONS"]
[]
[null,1,"You can only enter data into pre-selected sheets and cells. All other cells are locked. It does not matter which order you enter the data into any of the sheets. Calculations may not show until all relevant scores are entered."]
[null,2,"When you open the template you will get a Security Warning. Select \"Enable Content\"."]
[null,3,"When the program is opened it will be given a name like \"ASC Group5 V16-1001.xlsm\". Click FILE - SAVE AS. In the screen that opens select the destination where you want the file saved to; Select SAVE AS FILE TYPE as \"Excel Macro-Enabled Workbook\"; Enter a meaningful name in FILE NAME; Click SAVE."]
[null,4,"In the Title tab enter the information coloured green."]
[null,5,"In the Results tab enter the names of the contestants. If an entrant does not show for the contest delete the name and/or leave the Entrant Name blank."]
[null,6,"In the Results tab enter the number of Groups to be judged."]
[null,7,"In each of the Group tabs enter the Group name (eg Tomato, Jersey, Conformation), the Judge's Placings and Judge's Cuts for that Group. The total cuts must not be more than 15 or less than 3. Also if the total cuts equals 15, the middle cut must not be more than 8 or if the total cuts equals 14 the middle cut must not be more than 8. A Warning will appear if these conditions are not met. The Judge must adjust the cuts to meet these conditions."]
[null,8,"The Entrant Number will automatically be inserted in the Group tabs. When available enter the contestants' placings in the form of four numbers, eg 2134, 3412, etc. The score will be automatically appear."]
[null,9,"When all the scores for the visual part of the competition have been entered the total visual score will automatically be inserted into the Visual Score column of the Result tab."]
[null,10,"In the Results tab enter the Handling Score if appropriate."]
[null,11,"In the Oral tab all data is entered automatically. Click the Green arrow to sort the entrants into rank order from highest to lowest score. Use this to select contestants for the oral section. To re-sort into contestant order click the Blue arrow"]
[null,12,"In the Results tab enter the Oral Scores."]
[null,13,"In the Results tab the final ranking of the contestants will be displayed."]
[null,14,"If there are any ties go to the Final tab and click the Green arrow. This will list the contestants in Rank Order. Use this information and the competition rules to determine the placings if ties are not allowed."]
[null,15,"In the Results tab enter the placings in the Place column."]
[null,16,"If facilities are available print the Print tab and give to each contestant."]
[null,17,"Save the file."]

{"sheet":"About","index":11,"n_rows":22,"n_cols":7,"rows_kept":22,"cut":false,"hidden":false,"merged":[[18,2,18,6],[19,2,19,6]]}
[]
[]
[null,null,"JUDGING COMPETITION COMPUTER SCORING SYSTEM"]
[]
[null,null,"Program developed by Ray Connelly 2010"]
[null,null,"© Agricultural Societies Council of NSW - Group 5"]
[null,null,"Used at 2012 Sydney Royal Easter Show"]
[]
[null,null,"Version 12",null,"2012-04-28",null,"Excel 2010"]
[null,null,"Version 13",null,"2012-09-04",null,"Excel 2010"]
[null,null,"Version 14",null,"2012-09-04",null,"Excel 2010"]
[null,null,"Version 15",null,"2013-02-18",null,"Excel 2010"]
[null,null,"Version 16",null,"2013-02-18",null,"Excel 2010"]
[null,null,"Version 17",null,"2013-06-11",null,"Added Print"]
[null,null,"Version 17-200",null,"2015-08-20",null,"200 Contest"]
[null,null,"Version 18-200",null,"2015-09-29",null,"Changed Title"]
[]
[]
[null,null,"©  Agricultural Societies Council of NSW."]
[null,null,"No part of this program may be used, copied or sold without the written permission of the Agricultural Societies Council of NSW."]
[]
[null,null,"Disclaimer : All care but no responsibility."]