{"text_format":"1","workbook":"xlsx","n_sheets":12,"sheets":["Title","Results","Group1","Group2","Group3","Group4","Oral","Final","Full","Print","Instructions","About"],"not_rendered":{"charts":0,"images":3,"macros":1,"external_links":0,"defined_names":2,"comments":0,"pivot_tables":0},"unopened":[],"bounds":{"document_bytes":16777216,"sheet_cells":100000,"rows_first":2000,"rows_last":500,"rows_between":2000,"halvings":0,"cell_chars":16384,"cell_head_chars":4096},"cells_cut":0,"cells_raw":0,"read":"whole","date_system":"1900"}

{"sheet":"Title","index":0,"n_rows":22,"n_cols":8,"rows_kept":22,"cut":false,"hidden":false,"merged":[[16,3,16,4],[21,6,21,11],[15,7,15,12],[14,7,14,12],[8,7,8,14],[10,7,10,14],[12,7,12,8],[12,9,12,12]]}
[]
[]
[]
[]
[]
[null,null,null,null,null,null,null,"YOUNG JUDGES COMPETITION"]
[]
[]
{"$rows_left_out":15}
{"sheet":"Results","index":1,"n_rows":203,"n_cols":9,"rows_kept":203,"cut":false,"hidden":false,"merged":[]}
[]
[null,{"$f":"Title!H9","v":"Competition Name"},null,null,null,null,"GROUPS",0]
[null,"Entrant No","Name","Visual Score","Handling Score","Oral Score","Total Score","Rank","Place"]
[null,1,null,{"$f":"IF($C4=\"\",\"\",IF($H$2=1,Group1!$K4,IF($H$2=2,Group1!$K4+Group2!$K4,IF($H$2=3,Group1!$K4+Group2!$K4+Group3!$K4,Group1!$K4+Group2!$K4+Group3!$K4+Group4!$K4))))","v":""},null,49,{"$f":"IF(D4=\"\",\"\",$D4+$E4+$F4)","v":""},{"$f":"IF(G4=\"\",\"\",RANK($G4,$G$4:$G$103))","v":""}]
[null,2,null,{"$f":"IF($C5=\"\",\"\",IF($H$2=1,Group1!$K5,IF($H$2=2,Group1!$K5+Group2!$K5,IF($H$2=3,Group1!$K5+Group2!$K5+Group3!$K5,Group1!$K5+Group2!$K5+Group3!$K5+Group4!$K5))))","v":""},null,47,{"$f":"IF(D5=\"\",\"\",$D5+$E5+$F5)","v":""},{"$f":"IF(G5=\"\",\"\",RANK($G5,$G$4:$G$103))","v":""}]
[null,3,null,{"$f":"IF($C6=\"\",\"\",IF($H$2=1,Group1!$K6,IF($H$2=2,Group1!$K6+Group2!$K6,IF($H$2=3,Group1!$K6+Group2!$K6+Group3!$K6,Group1!$K6+Group2!$K6+Group3!$K6+Group4!$K6))))","v":""},null,38,"",{"$f":"IF(G6=\"\",\"\",RANK($G6,$G$4:$G$103))","v":""}]
[null,4,null,{"$f":"IF($C7=\"\",\"\",IF($H$2=1,Group1!$K7,IF($H$2=2,Group1!$K7+Group2!$K7,IF($H$2=3,Group1!$K7+Group2!$K7+Group3!$K7,Group1!$K7+Group2!$K7+Group3!$K7+Group4!$K7))))","v":""},null,44,"",""]
[null,5,null,{"$f":"IF($C8=\"\",\"\",IF($H$2=1,Group1!$K8,IF($H$2=2,Group1!$K8+Group2!$K8,IF($H$2=3,Group1!$K8+Group2!$K8+Group3!$K8,Group1!$K8+Group2!$K8+Group3!$K8+Group4!$K8))))","v":""},null,35,"",""]
{"$rows_left_out":196}
{"sheet":"Group1","index":2,"n_rows":203,"n_cols":22,"rows_kept":203,"cut":false,"hidden":false,"merged":[[1,3,1,8]]}
[]
[null,null,"Group 1 :"]
[null,null,null,null,null,null,null,null,"Entrant No","Placings","Score",null,"J1","J2","J3","J4","PO","QO","RO","QP","RP","RQ"]
[null,null,null,null,null,null,null,null,{"$f":"IF(Results!C4=\"\",\"\",Results!B4)","v":""},null,{"$f":"IF($C$6=\"\",\"\",IF(I4=\"\",\"\",50-SUM(Q4:V4)))","v":""},null,{"$f":"SEARCH($C$6,J4)","v":{"$error":"#VALUE!"}},{"$f":"SEARCH($D$6,J4)","v":{"$error":"#VALUE!"}},{"$f":"SEARCH($E$6,J4)","v":{"$error":"#VALUE!"}},{"$f":"SEARCH($F$6,J4)","v":{"$error":"#VALUE!"}},{"$f":"IF((N4-M4)<0,$C$8,0)","v":{"$error":"#VALUE!"}},{"$f":"IF((O4-M4)<0,$C$8+$D$8,0)","v":{"$error":"#VALUE!"}},{"$f":"IF((P4-M4)<0,$C$8+$D$8+$E$8,0)","v":{"$error":"#VALUE!"}},{"$f":"IF((O4-N4)<0,$D$8,0)","v":{"$error":"#VALUE!"}},{"$f":"IF((P4-N4)<0,$D$8+$E$8,0)","v":{"$error":"#VALUE!"}},{"$f":"IF((P4-O4)<0,$E$8,0)","v":{"$error":"#VALUE!"}}]
[null,null,"Judge's Placings",null,null,null,null,null,{"$f":"IF(Results!C5=\"\",\"\",Results!B5)","v":""},null,"",null,{"$error":"#VALUE!"},{"$error":"#VALUE!"},{"$error":"#VALUE!"},{"$error":"#VALUE!"},{"$error":"#VALUE!"},{"$error":"#VALUE!"},{"$error":"#VALUE!"},{"$error":"#VALUE!"},{"$error":"#VALUE!"},{"$error":"#VALUE!"}]
[null,null,null,null,null,null,null,null,{"$f":"IF(Results!C6=\"\",\"\",Results!B6)","v":""},null,"",null,{"$error":"#VALUE!"},{"$error":"#VALUE!"},{"$error":"#VALUE!"},{"$error":"#VALUE!"},{"$error":"#VALUE!"},{"$error":"#VALUE!"},{"$error":"#VALUE!"},{"$error":"#VALUE!"},{"$error":"#VALUE!"},{"$error":"#VALUE!"}]
[null,null,"Judge's Cuts",null,null,null,null,null,{"$f":"IF(Results!C7=\"\",\"\",Results!B7)","v":""},null,"",null,{"$error":"#VALUE!"},{"$error":"#VALUE!"},{"$error":"#VALUE!"},{"$error":"#VALUE!"},{"$error":"#VALUE!"},{"$error":"#VALUE!"},{"$error":"#VALUE!"},{"$error":"#VALUE!"},{"$error":"#VALUE!"},{"$error":"#VALUE!"}]
[null,null,null,null,null,null,null,null,{"$f":"IF(Results!C8=\"\",\"\",Results!B8)","v":""},null,"",null,{"$error":"#VALUE!"},{"$error":"#VALUE!"},{"$error":"#VALUE!"},{"$error":"#VALUE!"},{"$error":"#VALUE!"},{"$error":"#VALUE!"},{"$error":"#VALUE!"},{"$error":"#VALUE!"},{"$error":"#VALUE!"},{"$error":"#VALUE!"}]
{"$rows_left_out":196}
{"sheet":"Group2","index":3,"n_rows":203,"n_cols":22,"rows_kept":203,"cut":false,"hidden":false,"merged":[[1,3,1,8]]}
[]
[null,null,"Group 2 :"]
[null,null,null,null,null,null,null,null,"Entrant No","Placings","Score",null,"J1","J2","J3","J4","PO","QO","RO","QP","RP","RQ"]
[null,null,null,null,null,null,null,null,{"$f":"IF(Results!C4=\"\",\"\",Results!B4)","v":""},null,{"$f":"IF($C$6=\"\",\"\",IF(I4=\"\",\"\",50-SUM(Q4:V4)))","v":""},null,{"$f":"SEARCH($C$6,J4)","v":{"$error":"#VALUE!"}},{"$f":"SEARCH($D$6,J4)","v":{"$error":"#VALUE!"}},{"$f":"SEARCH($E$6,J4)","v":{"$error":"#VALUE!"}},{"$f":"SEARCH($F$6,J4)","v":{"$error":"#VALUE!"}},{"$f":"IF((N4-M4)<0,$C$8,0)","v":{"$error":"#VALUE!"}},{"$f":"IF((O4-M4)<0,$C$8+$D$8,0)","v":{"$error":"#VALUE!"}},{"$f":"IF((P4-M4)<0,$C$8+$D$8+$E$8,0)","v":{"$error":"#VALUE!"}},{"$f":"IF((O4-N4)<0,$D$8,0)","v":{"$error":"#VALUE!"}},{"$f":"IF((P4-N4)<0,$D$8+$E$8,0)","v":{"$error":"#VALUE!"}},{"$f":"IF((P4-O4)<0,$E$8,0)","v":{"$error":"#VALUE!"}}]
[null,null,"Judge's Placings",null,null,null,null,null,{"$f":"IF(Results!C5=\"\",\"\",Results!B5)","v":""},null,{"$f":"IF($C$6=\"\",\"\",IF(I5=\"\",\"\",50-SUM(Q5:V5)))","v":""},null,{"$error":"#VALUE!"},{"$error":"#VALUE!"},{"$error":"#VALUE!"},{"$error":"#VALUE!"},{"$error":"#VALUE!"},{"$error":"#VALUE!"},{"$error":"#VALUE!"},{"$error":"#VALUE!"},{"$error":"#VALUE!"},{"$error":"#VALUE!"}]
[null,null,null,null,null,null,null,null,{"$f":"IF(Results!C6=\"\",\"\",Results!B6)","v":""},null,"",null,{"$error":"#VALUE!"},{"$error":"#VALUE!"},{"$error":"#VALUE!"},{"$error":"#VALUE!"},{"$error":"#VALUE!"},{"$error":"#VALUE!"},{"$error":"#VALUE!"},{"$error":"#VALUE!"},{"$error":"#VALUE!"},{"$error":"#VALUE!"}]
[null,null,"Judge's Cuts",null,null,null,null,null,{"$f":"IF(Results!C7=\"\",\"\",Results!B7)","v":""},null,"",null,{"$error":"#VALUE!"},{"$error":"#VALUE!"},{"$error":"#VALUE!"},{"$error":"#VALUE!"},{"$error":"#VALUE!"},{"$error":"#VALUE!"},{"$error":"#VALUE!"},{"$error":"#VALUE!"},{"$error":"#VALUE!"},{"$error":"#VALUE!"}]
[null,null,null,null,null,null,null,null,{"$f":"IF(Results!C8=\"\",\"\",Results!B8)","v":""},null,"",null,{"$error":"#VALUE!"},{"$error":"#VALUE!"},{"$error":"#VALUE!"},{"$error":"#VALUE!"},{"$error":"#VALUE!"},{"$error":"#VALUE!"},{"$error":"#VALUE!"},{"$error":"#VALUE!"},{"$error":"#VALUE!"},{"$error":"#VALUE!"}]
{"$rows_left_out":196}
{"sheet":"Group3","index":4,"n_rows":203,"n_cols":22,"rows_kept":203,"cut":false,"hidden":false,"merged":[[1,3,1,8]]}
[]
[null,null,"Group 3 :"]
[null,null,null,null,null,null,null,null,"Entrant No","Placings","Score",null,"J1","J2","J3","J4","PO","QO","RO","QP","RP","RQ"]
[null,null,null,null,null,null,null,null,{"$f":"IF(Results!C4=\"\",\"\",Results!B4)","v":""},null,{"$f":"IF($C$6=\"\",\"\",IF(I4=\"\",\"\",50-SUM(Q4:V4)))","v":""},null,{"$f":"SEARCH($C$6,J4)","v":{"$error":"#VALUE!"}},{"$f":"SEARCH($D$6,J4)","v":{"$error":"#VALUE!"}},{"$f":"SEARCH($E$6,J4)","v":{"$error":"#VALUE!"}},{"$f":"SEARCH($F$6,J4)","v":{"$error":"#VALUE!"}},{"$f":"IF((N4-M4)<0,$C$8,0)","v":{"$error":"#VALUE!"}},{"$f":"IF((O4-M4)<0,$C$8+$D$8,0)","v":{"$error":"#VALUE!"}},{"$f":"IF((P4-M4)<0,$C$8+$D$8+$E$8,0)","v":{"$error":"#VALUE!"}},{"$f":"IF((O4-N4)<0,$D$8,0)","v":{"$error":"#VALUE!"}},{"$f":"IF((P4-N4)<0,$D$8+$E$8,0)","v":{"$error":"#VALUE!"}},{"$f":"IF((P4-O4)<0,$E$8,0)","v":{"$error":"#VALUE!"}}]
[null,null,"Judge's Placings",null,null,null,null,null,{"$f":"IF(Results!C5=\"\",\"\",Results!B5)","v":""},null,{"$f":"IF($C$6=\"\",\"\",IF(I5=\"\",\"\",50-SUM(Q5:V5)))","v":""},null,{"$error":"#VALUE!"},{"$error":"#VALUE!"},{"$error":"#VALUE!"},{"$error":"#VALUE!"},{"$error":"#VALUE!"},{"$error":"#VALUE!"},{"$error":"#VALUE!"},{"$error":"#VALUE!"},{"$error":"#VALUE!"},{"$error":"#VALUE!"}]
[null,null,null,null,null,null,null,null,{"$f":"IF(Results!C6=\"\",\"\",Results!B6)","v":""},null,"",null,{"$error":"#VALUE!"},{"$error":"#VALUE!"},{"$error":"#VALUE!"},{"$error":"#VALUE!"},{"$error":"#VALUE!"},{"$error":"#VALUE!"},{"$error":"#VALUE!"},{"$error":"#VALUE!"},{"$error":"#VALUE!"},{"$error":"#VALUE!"}]
[null,null,"Judge's Cuts",null,null,null,null,null,{"$f":"IF(Results!C7=\"\",\"\",Results!B7)","v":""},null,"",null,{"$error":"#VALUE!"},{"$error":"#VALUE!"},{"$error":"#VALUE!"},{"$error":"#VALUE!"},{"$error":"#VALUE!"},{"$error":"#VALUE!"},{"$error":"#VALUE!"},{"$error":"#VALUE!"},{"$error":"#VALUE!"},{"$error":"#VALUE!"}]
[null,null,null,null,null,null,null,null,{"$f":"IF(Results!C8=\"\",\"\",Results!B8)","v":""},null,"",null,{"$error":"#VALUE!"},{"$error":"#VALUE!"},{"$error":"#VALUE!"},{"$error":"#VALUE!"},{"$error":"#VALUE!"},{"$error":"#VALUE!"},{"$error":"#VALUE!"},{"$error":"#VALUE!"},{"$error":"#VALUE!"},{"$error":"#VALUE!"}]
{"$rows_left_out":196}
{"sheet":"Group4","index":5,"n_rows":203,"n_cols":22,"rows_kept":203,"cut":false,"hidden":false,"merged":[[1,3,1,8]]}
[]
[null,null,"Group 4 :"]
[null,null,null,null,null,null,null,null,"Entrant No","Placings","Score",null,"J1","J2","J3","J4","PO","QO","RO","QP","RP","RQ"]
[null,null,null,null,null,null,null,null,{"$f":"IF(Results!C4=\"\",\"\",Results!B4)","v":""},null,{"$f":"IF($C$6=\"\",\"\",IF(I4=\"\",\"\",50-SUM(Q4:V4)))","v":""},null,{"$f":"SEARCH($C$6,J4)","v":{"$error":"#VALUE!"}},{"$f":"SEARCH($D$6,J4)","v":{"$error":"#VALUE!"}},{"$f":"SEARCH($E$6,J4)","v":{"$error":"#VALUE!"}},{"$f":"SEARCH($F$6,J4)","v":{"$error":"#VALUE!"}},{"$f":"IF((N4-M4)<0,$C$8,0)","v":{"$error":"#VALUE!"}},{"$f":"IF((O4-M4)<0,$C$8+$D$8,0)","v":{"$error":"#VALUE!"}},{"$f":"IF((P4-M4)<0,$C$8+$D$8+$E$8,0)","v":{"$error":"#VALUE!"}},{"$f":"IF((O4-N4)<0,$D$8,0)","v":{"$error":"#VALUE!"}},{"$f":"IF((P4-N4)<0,$D$8+$E$8,0)","v":{"$error":"#VALUE!"}},{"$f":"IF((P4-O4)<0,$E$8,0)","v":{"$error":"#VALUE!"}}]
[null,null,"Judge's Placings",null,null,null,null,null,{"$f":"IF(Results!C5=\"\",\"\",Results!B5)","v":""},null,{"$f":"IF($C$6=\"\",\"\",IF(I5=\"\",\"\",50-SUM(Q5:V5)))","v":""},null,{"$error":"#VALUE!"},{"$error":"#VALUE!"},{"$error":"#VALUE!"},{"$error":"#VALUE!"},{"$error":"#VALUE!"},{"$error":"#VALUE!"},{"$error":"#VALUE!"},{"$error":"#VALUE!"},{"$error":"#VALUE!"},{"$error":"#VALUE!"}]
[null,null,null,null,null,null,null,null,{"$f":"IF(Results!C6=\"\",\"\",Results!B6)","v":""},null,"",null,{"$error":"#VALUE!"},{"$error":"#VALUE!"},{"$error":"#VALUE!"},{"$error":"#VALUE!"},{"$error":"#VALUE!"},{"$error":"#VALUE!"},{"$error":"#VALUE!"},{"$error":"#VALUE!"},{"$error":"#VALUE!"},{"$error":"#VALUE!"}]
[null,null,"Judge's Cuts",null,null,null,null,null,{"$f":"IF(Results!C7=\"\",\"\",Results!B7)","v":""},null,"",null,{"$error":"#VALUE!"},{"$error":"#VALUE!"},{"$error":"#VALUE!"},{"$error":"#VALUE!"},{"$error":"#VALUE!"},{"$error":"#VALUE!"},{"$error":"#VALUE!"},{"$error":"#VALUE!"},{"$error":"#VALUE!"},{"$error":"#VALUE!"}]
[null,null,null,null,null,null,null,null,{"$f":"IF(Results!C8=\"\",\"\",Results!B8)","v":""},null,"",null,{"$error":"#VALUE!"},{"$error":"#VALUE!"},{"$error":"#VALUE!"},{"$error":"#VALUE!"},{"$error":"#VALUE!"},{"$error":"#VALUE!"},{"$error":"#VALUE!"},{"$error":"#VALUE!"},{"$error":"#VALUE!"},{"$error":"#VALUE!"}]
{"$rows_left_out":196}
{"sheet":"Oral","index":6,"n_rows":203,"n_cols":7,"rows_kept":203,"cut":false,"hidden":false,"merged":[]}
[null,"SORTING ENTRANTS FOR ORAL PARTICIPATION"]
[]
[null,"NO","NAME","VISUAL TOTAL","HANDLING SCORE","PRE-ORAL SCORE","RANK"]
[null,5,{"$f":"IF(Results!C8=\"\",\"\",Results!C8)","v":""},{"$f":"IF(Results!D8=\"\",\"\",Results!D8)","v":""},{"$f":"IF(Results!E8=\"\",\"\",Results!E8)","v":""},{"$f":"IF(C4=\"\",\"\",SUM(D4:E4))","v":""},{"$f":"IF(F4=\"\",\"\",RANK($F4,$F$4:$F$203))","v":""}]
[null,3,{"$f":"IF(Results!C6=\"\",\"\",Results!C6)","v":""},{"$f":"IF(Results!D6=\"\",\"\",Results!D6)","v":""},{"$f":"IF(Results!E6=\"\",\"\",Results!E6)","v":""},"",""]
[null,4,{"$f":"IF(Results!C7=\"\",\"\",Results!C7)","v":""},{"$f":"IF(Results!D7=\"\",\"\",Results!D7)","v":""},{"$f":"IF(Results!E7=\"\",\"\",Results!E7)","v":""},"",""]
[null,2,{"$f":"IF(Results!C5=\"\",\"\",Results!C5)","v":""},{"$f":"IF(Results!D5=\"\",\"\",Results!D5)","v":""},{"$f":"IF(Results!E5=\"\",\"\",Results!E5)","v":""},"",""]
[null,1,{"$f":"IF(Results!C4=\"\",\"\",Results!C4)","v":""},{"$f":"IF(Results!D4=\"\",\"\",Results!D4)","v":""},{"$f":"IF(Results!E4=\"\",\"\",Results!E4)","v":""},"",""]
{"$rows_left_out":196}
{"sheet":"Final","index":7,"n_rows":203,"n_cols":8,"rows_kept":203,"cut":false,"hidden":false,"merged":[]}
[null,"SORTING ENTRANTS FOR FINAL RANKING"]
[]
[null,"NO","NAME","VISUAL TOTAL","HANDLING SCORE","ORAL SCORE","TOTAL SCORE","RANK"]
[null,2,{"$f":"IF(Results!C5=\"\",\"\",Results!C5)","v":""},{"$f":"IF(Results!D5=\"\",\"\",Results!D5)","v":""},{"$f":"IF(Results!E5=\"\",\"\",Results!E5)","v":""},{"$f":"IF(Results!F5=\"\",\"\",Results!F5)","v":47},{"$f":"IF(D4=\"\",\"\",SUM(D4:F4))","v":""},{"$f":"IF(F4=\"\",\"\",RANK($G4,$G$4:$G$103))","v":{"$error":"#VALUE!"}}]
[null,1,{"$f":"IF(Results!C4=\"\",\"\",Results!C4)","v":""},{"$f":"IF(Results!D4=\"\",\"\",Results!D4)","v":""},{"$f":"IF(Results!E4=\"\",\"\",Results!E4)","v":""},{"$f":"IF(Results!F4=\"\",\"\",Results!F4)","v":49},"",{"$error":"#VALUE!"}]
[null,4,{"$f":"IF(Results!C7=\"\",\"\",Results!C7)","v":""},{"$f":"IF(Results!D7=\"\",\"\",Results!D7)","v":""},{"$f":"IF(Results!E7=\"\",\"\",Results!E7)","v":""},{"$f":"IF(Results!F7=\"\",\"\",Results!F7)","v":44},"",{"$error":"#VALUE!"}]
[null,5,{"$f":"IF(Results!C8=\"\",\"\",Results!C8)","v":""},{"$f":"IF(Results!D8=\"\",\"\",Results!D8)","v":""},{"$f":"IF(Results!E8=\"\",\"\",Results!E8)","v":""},{"$f":"IF(Results!F8=\"\",\"\",Results!F8)","v":35},"",{"$error":"#VALUE!"}]
[null,3,{"$f":"IF(Results!C6=\"\",\"\",Results!C6)","v":""},{"$f":"IF(Results!D6=\"\",\"\",Results!D6)","v":""},{"$f":"IF(Results!E6=\"\",\"\",Results!E6)","v":""},{"$f":"IF(Results!F6=\"\",\"\",Results!F6)","v":38},"",{"$error":"#VALUE!"}]
{"$rows_left_out":196}
{"sheet":"Full","index":8,"n_rows":204,"n_cols":12,"rows_kept":204,"cut":false,"hidden":false,"merged":[[1,1,1,5],[0,1,0,5],[0,6,0,11],[1,7,1,11],[2,1,2,2],[2,3,2,5]]}
[null,{"$f":"Title!H9","v":"Competition Name"},null,null,null,null,{"$f":"Title!H11","v":"Host/ Event"}]
[null,{"$f":"Title!H15","v":"Locaton"},null,null,null,null,null,{"$f":"Title!H16","v":"Date"}]
[null,"OVER - JUDGE :",null,{"$f":"IF(Title!J13=\"\",\"\",Title!J13)","v":""}]
[null,"NO","NAME",{"$f":"IF(Group1!D2=\"\",\"\",Group1!D2)","v":""},{"$f":"IF(Group2!D2=\"\",\"\",Group2!D2)","v":""},{"$f":"IF(Group3!D2=\"\",\"\",Group3!D2)","v":""},{"$f":"IF(Group4!D2=\"\",\"\",Group4!D2)","v":""},"VISUAL TOTAL","HANDLING SCORE","ORAL SCORE","TOTAL SCORE","PLACE"]
[null,1,{"$f":"IF(Results!C4=\"\",\"\",Results!C4)","v":""},{"$f":"IF(Results!$C4=\"\",\"\",IF(Results!$H$2>=1,VALUE(VLOOKUP($B5,Group1!$I$4:$K$103,3)),0))","v":""},{"$f":"IF(Results!$C4=\"\",\"\",IF(Results!$H$2>=2,VALUE(VLOOKUP($B5,Group2!$I$4:$K$103,3)),0))","v":""},{"$f":"IF(Results!$C4=\"\",\"\",IF(Results!$H$2>=3,VALUE(VLOOKUP($B5,Group3!$I$4:$K$103,3)),0))","v":""},{"$f":"IF(Results!$C4=\"\",\"\",IF(Results!$H$2>=4,VALUE(VLOOKUP($B5,Group4!$I$4:$K$103,3)),0))","v":""},{"$f":"IF(Results!$C4=\"\",\"\",SUM(D5:G5))","v":""},{"$f":"IF(Results!E4=\"\",\"\",Results!E4)","v":""},{"$f":"IF(Results!F4=\"\",\"\",Results!F4)","v":49},{"$f":"IF(C5=\"\",\"\",SUM(H5:J5))","v":""},{"$f":"IF(Results!$I4=\"\",\"\",Results!$I4)","v":""}]
[null,2,{"$f":"IF(Results!C5=\"\",\"\",Results!C5)","v":""},{"$f":"IF(Results!$C5=\"\",\"\",IF(Results!$H$2>=1,VALUE(VLOOKUP($B6,Group1!$I$4:$K$103,3)),0))","v":""},{"$f":"IF(Results!$C5=\"\",\"\",IF(Results!$H$2>=2,VALUE(VLOOKUP($B6,Group2!$I$4:$K$103,3)),0))","v":""},{"$f":"IF(Results!$C5=\"\",\"\",IF(Results!$H$2>=3,VALUE(VLOOKUP($B6,Group3!$I$4:$K$103,3)),0))","v":""},{"$f":"IF(Results!$C5=\"\",\"\",IF(Results!$H$2>=4,VALUE(VLOOKUP($B6,Group4!$I$4:$K$103,3)),0))","v":""},{"$f":"IF(Results!$C5=\"\",\"\",SUM(D6:G6))","v":""},{"$f":"IF(Results!E5=\"\",\"\",Results!E5)","v":""},{"$f":"IF(Results!F5=\"\",\"\",Results!F5)","v":47},{"$f":"IF(C6=\"\",\"\",SUM(H6:J6))","v":""},{"$f":"IF(Results!$I5=\"\",\"\",Results!$I5)","v":""}]
[null,3,{"$f":"IF(Results!C6=\"\",\"\",Results!C6)","v":""},{"$f":"IF(Results!$C6=\"\",\"\",IF(Results!$H$2>=1,VALUE(VLOOKUP($B7,Group1!$I$4:$K$103,3)),0))","v":""},{"$f":"IF(Results!$C6=\"\",\"\",IF(Results!$H$2>=2,VALUE(VLOOKUP($B7,Group2!$I$4:$K$103,3)),0))","v":""},{"$f":"IF(Results!$C6=\"\",\"\",IF(Results!$H$2>=3,VALUE(VLOOKUP($B7,Group3!$I$4:$K$103,3)),0))","v":""},{"$f":"IF(Results!$C6=\"\",\"\",IF(Results!$H$2>=4,VALUE(VLOOKUP($B7,Group4!$I$4:$K$103,3)),0))","v":""},{"$f":"IF(Results!$C6=\"\",\"\",SUM(D7:G7))","v":""},{"$f":"IF(Results!E6=\"\",\"\",Results!E6)","v":""},{"$f":"IF(Results!F6=\"\",\"\",Results!F6)","v":38},"",{"$f":"IF(Results!$I6=\"\",\"\",Results!$I6)","v":""}]
[null,4,{"$f":"IF(Results!C7=\"\",\"\",Results!C7)","v":""},{"$f":"IF(Results!$C7=\"\",\"\",IF(Results!$H$2>=1,VALUE(VLOOKUP($B8,Group1!$I$4:$K$103,3)),0))","v":""},{"$f":"IF(Results!$C7=\"\",\"\",IF(Results!$H$2>=2,VALUE(VLOOKUP($B8,Group2!$I$4:$K$103,3)),0))","v":""},{"$f":"IF(Results!$C7=\"\",\"\",IF(Results!$H$2>=3,VALUE(VLOOKUP($B8,Group3!$I$4:$K$103,3)),0))","v":""},{"$f":"IF(Results!$C7=\"\",\"\",IF(Results!$H$2>=4,VALUE(VLOOKUP($B8,Group4!$I$4:$K$103,3)),0))","v":""},{"$f":"IF(Results!$C7=\"\",\"\",SUM(D8:G8))","v":""},{"$f":"IF(Results!E7=\"\",\"\",Results!E7)","v":""},{"$f":"IF(Results!F7=\"\",\"\",Results!F7)","v":44},"",{"$f":"IF(Results!$I7=\"\",\"\",Results!$I7)","v":""}]
{"$rows_left_out":197}
{"sheet":"Print","index":9,"n_rows":48,"n_cols":11,"rows_kept":48,"cut":false,"hidden":false,"merged":[[16,4,16,10],[40,3,40,4],[30,3,30,4],[33,3,33,4],[34,3,34,4],[35,3,35,4],[38,3,38,4],[39,3,39,4],[28,3,28,4],[29,3,29,4],[23,3,23,4],[24,3,24,4],[25,3,25,4]]}
[1,"ENTRANT NO"]
[]
[]
[]
[]
[]
[null,null,"Agricultural Societies Council of NSW"]
[]
{"$rows_left_out":41}
{"sheet":"Instructions","index":10,"n_rows":19,"n_cols":3,"rows_kept":19,"cut":false,"hidden":false,"merged":[]}
[null,"INSTRUCTIONS"]
[]
[null,1,"You can only enter data into pre-selected sheets and cells. All other cells are locked. It does not matter which order you enter the data into any of the sheets. Calculations may not show until all relevant scores are entered."]
[null,2,"When you open the template you will get a Security Warning. Select \"Enable Content\"."]
[null,3,"When the program is opened it will be given a name like \"ASC Group5 V16-1001.xlsm\". Click FILE - SAVE AS. In the screen that opens select the destination where you want the file saved to; Select SAVE AS FILE TYPE as \"Excel Macro-Enabled Workbook\"; Enter a meaningful name in FILE NAME; Click SAVE."]
[null,4,"In the Title tab enter the information coloured green."]
[null,5,"In the Results tab enter the names of the contestants. If an entrant does not show for the contest delete the name and/or leave the Entrant Name blank."]
[null,6,"In the Results tab enter the number of Groups to be judged."]
{"$rows_left_out":12}
{"sheet":"About","index":11,"n_rows":22,"n_cols":7,"rows_kept":22,"cut":false,"hidden":false,"merged":[[18,2,18,6],[19,2,19,6]]}
[]
[]
[null,null,"JUDGING COMPETITION COMPUTER SCORING SYSTEM"]
[]
[null,null,"Program developed by Ray Connelly 2010"]
[null,null,"© Agricultural Societies Council of NSW - Group 5"]
[null,null,"Used at 2012 Sydney Royal Easter Show"]
[]
{"$rows_left_out":14}